Build: #4 failed

Job: Test Tasks Many Linux 2.28 Replace Casatasks import with casashell failed

Build log

The build generated 42,156 lines of output.   The output is too long and has been truncated to the last 1,000 lines. Download or view full build log.

23-Sep-2026 13:27:15 casa-CAS-14882-1-py3.12.el8/lib/py/lib/python3.12/__pycache__/struct.cpython-312.opt-1.pyc
23-Sep-2026 13:27:15 casa-CAS-14882-1-py3.12.el8/lib/py/lib/python3.12/__pycache__/io.cpython-312.pyc
23-Sep-2026 13:27:15 casa-CAS-14882-1-py3.12.el8/lib/py/lib/python3.12/__pycache__/bdb.cpython-312.opt-2.pyc
23-Sep-2026 13:27:15 casa-CAS-14882-1-py3.12.el8/lib/py/lib/python3.12/__pycache__/shlex.cpython-312.opt-2.pyc
23-Sep-2026 13:27:15 casa-CAS-14882-1-py3.12.el8/lib/py/lib/python3.12/__pycache__/tempfile.cpython-312.pyc
23-Sep-2026 13:27:15 casa-CAS-14882-1-py3.12.el8/lib/py/lib/python3.12/__pycache__/sndhdr.cpython-312.opt-2.pyc
23-Sep-2026 13:27:15 casa-CAS-14882-1-py3.12.el8/lib/py/lib/python3.12/__pycache__/_aix_support.cpython-312.opt-1.pyc
23-Sep-2026 13:27:15 casa-CAS-14882-1-py3.12.el8/lib/py/lib/python3.12/__pycache__/_pydecimal.cpython-312.opt-1.pyc
23-Sep-2026 13:27:15 casa-CAS-14882-1-py3.12.el8/lib/py/lib/python3.12/__pycache__/pipes.cpython-312.pyc
23-Sep-2026 13:27:15 casa-CAS-14882-1-py3.12.el8/lib/py/lib/python3.12/__pycache__/poplib.cpython-312.pyc
23-Sep-2026 13:27:15 casa-CAS-14882-1-py3.12.el8/lib/py/lib/python3.12/__pycache__/colorsys.cpython-312.pyc
23-Sep-2026 13:27:15 casa-CAS-14882-1-py3.12.el8/lib/py/lib/python3.12/__pycache__/ssl.cpython-312.pyc
23-Sep-2026 13:27:15 casa-CAS-14882-1-py3.12.el8/lib/py/lib/python3.12/__pycache__/bdb.cpython-312.pyc
23-Sep-2026 13:27:15 casa-CAS-14882-1-py3.12.el8/lib/py/lib/python3.12/__pycache__/subprocess.cpython-312.opt-1.pyc
23-Sep-2026 13:27:15 casa-CAS-14882-1-py3.12.el8/lib/py/lib/python3.12/__pycache__/stringprep.cpython-312.pyc
23-Sep-2026 13:27:15 casa-CAS-14882-1-py3.12.el8/lib/py/lib/python3.12/__pycache__/traceback.cpython-312.opt-2.pyc
23-Sep-2026 13:27:15 casa-CAS-14882-1-py3.12.el8/lib/py/lib/python3.12/__pycache__/posixpath.cpython-312.opt-2.pyc
23-Sep-2026 13:27:15 casa-CAS-14882-1-py3.12.el8/lib/py/lib/python3.12/__pycache__/statistics.cpython-312.pyc
23-Sep-2026 13:27:15 casa-CAS-14882-1-py3.12.el8/lib/py/lib/python3.12/__pycache__/tracemalloc.cpython-312.opt-2.pyc
23-Sep-2026 13:27:15 casa-CAS-14882-1-py3.12.el8/lib/py/lib/python3.12/__pycache__/pathlib.cpython-312.opt-2.pyc
23-Sep-2026 13:27:15 casa-CAS-14882-1-py3.12.el8/lib/py/lib/python3.12/__pycache__/netrc.cpython-312.opt-2.pyc
23-Sep-2026 13:27:15 casa-CAS-14882-1-py3.12.el8/lib/py/lib/python3.12/__pycache__/decimal.cpython-312.opt-1.pyc
23-Sep-2026 13:27:15 casa-CAS-14882-1-py3.12.el8/lib/py/lib/python3.12/__pycache__/contextlib.cpython-312.opt-2.pyc
23-Sep-2026 13:27:15 casa-CAS-14882-1-py3.12.el8/lib/py/lib/python3.12/__pycache__/operator.cpython-312.opt-2.pyc
23-Sep-2026 13:27:15 casa-CAS-14882-1-py3.12.el8/lib/py/lib/python3.12/__pycache__/_collections_abc.cpython-312.opt-2.pyc
23-Sep-2026 13:27:15 casa-CAS-14882-1-py3.12.el8/lib/py/lib/python3.12/__pycache__/site.cpython-312.opt-2.pyc
23-Sep-2026 13:27:15 casa-CAS-14882-1-py3.12.el8/lib/py/lib/python3.12/__pycache__/_pydecimal.cpython-312.opt-2.pyc
23-Sep-2026 13:27:15 casa-CAS-14882-1-py3.12.el8/lib/py/lib/python3.12/__pycache__/fractions.cpython-312.opt-2.pyc
23-Sep-2026 13:27:15 casa-CAS-14882-1-py3.12.el8/lib/py/lib/python3.12/__pycache__/gettext.cpython-312.opt-2.pyc
23-Sep-2026 13:27:15 casa-CAS-14882-1-py3.12.el8/lib/py/lib/python3.12/__pycache__/inspect.cpython-312.opt-1.pyc
23-Sep-2026 13:27:15 casa-CAS-14882-1-py3.12.el8/lib/py/lib/python3.12/__pycache__/filecmp.cpython-312.opt-1.pyc
23-Sep-2026 13:27:15 casa-CAS-14882-1-py3.12.el8/lib/py/lib/python3.12/__pycache__/opcode.cpython-312.opt-1.pyc
23-Sep-2026 13:27:15 casa-CAS-14882-1-py3.12.el8/lib/py/lib/python3.12/__pycache__/pyclbr.cpython-312.opt-1.pyc
23-Sep-2026 13:27:15 casa-CAS-14882-1-py3.12.el8/lib/py/lib/python3.12/__pycache__/plistlib.cpython-312.opt-1.pyc
23-Sep-2026 13:27:15 casa-CAS-14882-1-py3.12.el8/lib/py/lib/python3.12/__pycache__/dis.cpython-312.opt-1.pyc
23-Sep-2026 13:27:15 casa-CAS-14882-1-py3.12.el8/lib/py/lib/python3.12/__pycache__/heapq.cpython-312.opt-1.pyc
23-Sep-2026 13:27:15 casa-CAS-14882-1-py3.12.el8/lib/py/lib/python3.12/__pycache__/queue.cpython-312.opt-1.pyc
23-Sep-2026 13:27:15 casa-CAS-14882-1-py3.12.el8/lib/py/lib/python3.12/__pycache__/pty.cpython-312.opt-1.pyc
23-Sep-2026 13:27:15 casa-CAS-14882-1-py3.12.el8/lib/py/lib/python3.12/__pycache__/configparser.cpython-312.pyc
23-Sep-2026 13:27:15 casa-CAS-14882-1-py3.12.el8/lib/py/lib/python3.12/__pycache__/pickle.cpython-312.opt-2.pyc
23-Sep-2026 13:27:15 casa-CAS-14882-1-py3.12.el8/lib/py/lib/python3.12/__pycache__/trace.cpython-312.opt-1.pyc
23-Sep-2026 13:27:15 casa-CAS-14882-1-py3.12.el8/lib/py/lib/python3.12/__pycache__/xdrlib.cpython-312.opt-1.pyc
23-Sep-2026 13:27:15 casa-CAS-14882-1-py3.12.el8/lib/py/lib/python3.12/__pycache__/abc.cpython-312.pyc
23-Sep-2026 13:27:15 casa-CAS-14882-1-py3.12.el8/lib/py/lib/python3.12/__pycache__/nntplib.cpython-312.pyc
23-Sep-2026 13:27:15 casa-CAS-14882-1-py3.12.el8/lib/py/lib/python3.12/__pycache__/pipes.cpython-312.opt-1.pyc
23-Sep-2026 13:27:15 casa-CAS-14882-1-py3.12.el8/lib/py/lib/python3.12/__pycache__/sre_constants.cpython-312.opt-1.pyc
23-Sep-2026 13:27:15 casa-CAS-14882-1-py3.12.el8/lib/py/lib/python3.12/__pycache__/_osx_support.cpython-312.opt-2.pyc
23-Sep-2026 13:27:15 casa-CAS-14882-1-py3.12.el8/lib/py/lib/python3.12/__pycache__/tokenize.cpython-312.opt-1.pyc
23-Sep-2026 13:27:15 casa-CAS-14882-1-py3.12.el8/lib/py/lib/python3.12/__pycache__/heapq.cpython-312.pyc
23-Sep-2026 13:27:15 casa-CAS-14882-1-py3.12.el8/lib/py/lib/python3.12/__pycache__/threading.cpython-312.opt-2.pyc
23-Sep-2026 13:27:15 casa-CAS-14882-1-py3.12.el8/lib/py/lib/python3.12/__pycache__/calendar.cpython-312.pyc
23-Sep-2026 13:27:16 casa-CAS-14882-1-py3.12.el8/lib/py/lib/python3.12/__pycache__/wave.cpython-312.opt-1.pyc
23-Sep-2026 13:27:16 casa-CAS-14882-1-py3.12.el8/lib/py/lib/python3.12/__pycache__/sre_constants.cpython-312.opt-2.pyc
23-Sep-2026 13:27:16 casa-CAS-14882-1-py3.12.el8/lib/py/lib/python3.12/__pycache__/os.cpython-312.pyc
23-Sep-2026 13:27:16 casa-CAS-14882-1-py3.12.el8/lib/py/lib/python3.12/__pycache__/zipapp.cpython-312.pyc
23-Sep-2026 13:27:16 casa-CAS-14882-1-py3.12.el8/lib/py/lib/python3.12/__pycache__/statistics.cpython-312.opt-1.pyc
23-Sep-2026 13:27:16 casa-CAS-14882-1-py3.12.el8/lib/py/lib/python3.12/__pycache__/fnmatch.cpython-312.pyc
23-Sep-2026 13:27:16 casa-CAS-14882-1-py3.12.el8/lib/py/lib/python3.12/__pycache__/hashlib.cpython-312.opt-2.pyc
23-Sep-2026 13:27:16 casa-CAS-14882-1-py3.12.el8/lib/py/lib/python3.12/__pycache__/telnetlib.cpython-312.opt-1.pyc
23-Sep-2026 13:27:16 casa-CAS-14882-1-py3.12.el8/lib/py/lib/python3.12/__pycache__/copyreg.cpython-312.opt-1.pyc
23-Sep-2026 13:27:16 casa-CAS-14882-1-py3.12.el8/lib/py/lib/python3.12/__pycache__/selectors.cpython-312.pyc
23-Sep-2026 13:27:16 casa-CAS-14882-1-py3.12.el8/lib/py/lib/python3.12/__pycache__/mailbox.cpython-312.opt-2.pyc
23-Sep-2026 13:27:16 casa-CAS-14882-1-py3.12.el8/lib/py/lib/python3.12/__pycache__/chunk.cpython-312.opt-1.pyc
23-Sep-2026 13:27:16 casa-CAS-14882-1-py3.12.el8/lib/py/lib/python3.12/__pycache__/netrc.cpython-312.opt-1.pyc
23-Sep-2026 13:27:16 casa-CAS-14882-1-py3.12.el8/lib/py/lib/python3.12/__pycache__/pstats.cpython-312.opt-1.pyc
23-Sep-2026 13:27:16 casa-CAS-14882-1-py3.12.el8/lib/py/lib/python3.12/__pycache__/zipimport.cpython-312.opt-2.pyc
23-Sep-2026 13:27:16 casa-CAS-14882-1-py3.12.el8/lib/py/lib/python3.12/__pycache__/tracemalloc.cpython-312.pyc
23-Sep-2026 13:27:16 casa-CAS-14882-1-py3.12.el8/lib/py/lib/python3.12/__pycache__/ntpath.cpython-312.opt-2.pyc
23-Sep-2026 13:27:16 casa-CAS-14882-1-py3.12.el8/lib/py/lib/python3.12/__pycache__/dataclasses.cpython-312.opt-2.pyc
23-Sep-2026 13:27:16 casa-CAS-14882-1-py3.12.el8/lib/py/lib/python3.12/__pycache__/linecache.cpython-312.pyc
23-Sep-2026 13:27:16 casa-CAS-14882-1-py3.12.el8/lib/py/lib/python3.12/__pycache__/copy.cpython-312.pyc
23-Sep-2026 13:27:16 casa-CAS-14882-1-py3.12.el8/lib/py/lib/python3.12/__pycache__/lzma.cpython-312.opt-1.pyc
23-Sep-2026 13:27:16 casa-CAS-14882-1-py3.12.el8/lib/py/lib/python3.12/__pycache__/copy.cpython-312.opt-2.pyc
23-Sep-2026 13:27:16 casa-CAS-14882-1-py3.12.el8/lib/py/lib/python3.12/__pycache__/keyword.cpython-312.opt-2.pyc
23-Sep-2026 13:27:16 casa-CAS-14882-1-py3.12.el8/lib/py/lib/python3.12/__pycache__/_sitebuiltins.cpython-312.opt-2.pyc
23-Sep-2026 13:27:16 casa-CAS-14882-1-py3.12.el8/lib/py/lib/python3.12/__pycache__/xdrlib.cpython-312.pyc
23-Sep-2026 13:27:16 casa-CAS-14882-1-py3.12.el8/lib/py/lib/python3.12/__pycache__/socket.cpython-312.opt-2.pyc
23-Sep-2026 13:27:16 casa-CAS-14882-1-py3.12.el8/lib/py/lib/python3.12/__pycache__/cgi.cpython-312.pyc
23-Sep-2026 13:27:16 casa-CAS-14882-1-py3.12.el8/lib/py/lib/python3.12/__pycache__/webbrowser.cpython-312.opt-1.pyc
23-Sep-2026 13:27:16 casa-CAS-14882-1-py3.12.el8/lib/py/lib/python3.12/__pycache__/trace.cpython-312.opt-2.pyc
23-Sep-2026 13:27:16 casa-CAS-14882-1-py3.12.el8/lib/py/lib/python3.12/__pycache__/doctest.cpython-312.pyc
23-Sep-2026 13:27:16 casa-CAS-14882-1-py3.12.el8/lib/py/lib/python3.12/__pycache__/csv.cpython-312.opt-2.pyc
23-Sep-2026 13:27:16 casa-CAS-14882-1-py3.12.el8/lib/py/lib/python3.12/__pycache__/_aix_support.cpython-312.opt-2.pyc
23-Sep-2026 13:27:16 casa-CAS-14882-1-py3.12.el8/lib/py/lib/python3.12/__pycache__/keyword.cpython-312.pyc
23-Sep-2026 13:27:16 casa-CAS-14882-1-py3.12.el8/lib/py/lib/python3.12/__pycache__/signal.cpython-312.opt-1.pyc
23-Sep-2026 13:27:16 casa-CAS-14882-1-py3.12.el8/lib/py/lib/python3.12/__pycache__/_sysconfigdata__linux_x86_64-linux-gnu.cpython-312.pyc
23-Sep-2026 13:27:16 casa-CAS-14882-1-py3.12.el8/lib/py/lib/python3.12/__pycache__/mailcap.cpython-312.opt-2.pyc
23-Sep-2026 13:27:16 casa-CAS-14882-1-py3.12.el8/lib/py/lib/python3.12/__pycache__/nturl2path.cpython-312.pyc
23-Sep-2026 13:27:16 casa-CAS-14882-1-py3.12.el8/lib/py/lib/python3.12/__pycache__/_pydatetime.cpython-312.opt-2.pyc
23-Sep-2026 13:27:16 casa-CAS-14882-1-py3.12.el8/lib/py/lib/python3.12/__pycache__/mimetypes.cpython-312.opt-1.pyc
23-Sep-2026 13:27:16 casa-CAS-14882-1-py3.12.el8/lib/py/lib/python3.12/__pycache__/getopt.cpython-312.opt-1.pyc
23-Sep-2026 13:27:16 casa-CAS-14882-1-py3.12.el8/lib/py/lib/python3.12/__pycache__/optparse.cpython-312.opt-2.pyc
23-Sep-2026 13:27:16 casa-CAS-14882-1-py3.12.el8/lib/py/lib/python3.12/__pycache__/pdb.cpython-312.pyc
23-Sep-2026 13:27:16 casa-CAS-14882-1-py3.12.el8/lib/py/lib/python3.12/__pycache__/hashlib.cpython-312.opt-1.pyc
23-Sep-2026 13:27:16 casa-CAS-14882-1-py3.12.el8/lib/py/lib/python3.12/__pycache__/warnings.cpython-312.opt-1.pyc
23-Sep-2026 13:27:16 casa-CAS-14882-1-py3.12.el8/lib/py/lib/python3.12/__pycache__/_osx_support.cpython-312.opt-1.pyc
23-Sep-2026 13:27:16 casa-CAS-14882-1-py3.12.el8/lib/py/lib/python3.12/__pycache__/imghdr.cpython-312.opt-2.pyc
23-Sep-2026 13:27:16 casa-CAS-14882-1-py3.12.el8/lib/py/lib/python3.12/__pycache__/sre_constants.cpython-312.pyc
23-Sep-2026 13:27:16 casa-CAS-14882-1-py3.12.el8/lib/py/lib/python3.12/__pycache__/numbers.cpython-312.opt-1.pyc
23-Sep-2026 13:27:16 casa-CAS-14882-1-py3.12.el8/lib/py/lib/python3.12/__pycache__/_sitebuiltins.cpython-312.pyc
23-Sep-2026 13:27:16 casa-CAS-14882-1-py3.12.el8/lib/py/lib/python3.12/__pycache__/platform.cpython-312.pyc
23-Sep-2026 13:27:16 casa-CAS-14882-1-py3.12.el8/lib/py/lib/python3.12/__pycache__/pdb.cpython-312.opt-1.pyc
23-Sep-2026 13:27:16 casa-CAS-14882-1-py3.12.el8/lib/py/lib/python3.12/__pycache__/codeop.cpython-312.opt-2.pyc
23-Sep-2026 13:27:16 casa-CAS-14882-1-py3.12.el8/lib/py/lib/python3.12/__pycache__/getopt.cpython-312.opt-2.pyc
23-Sep-2026 13:27:16 casa-CAS-14882-1-py3.12.el8/lib/py/lib/python3.12/__pycache__/sndhdr.cpython-312.pyc
23-Sep-2026 13:27:16 casa-CAS-14882-1-py3.12.el8/lib/py/lib/python3.12/__pycache__/pprint.cpython-312.pyc
23-Sep-2026 13:27:16 casa-CAS-14882-1-py3.12.el8/lib/py/lib/python3.12/__pycache__/configparser.cpython-312.opt-1.pyc
23-Sep-2026 13:27:16 casa-CAS-14882-1-py3.12.el8/lib/py/lib/python3.12/__pycache__/filecmp.cpython-312.pyc
23-Sep-2026 13:27:16 casa-CAS-14882-1-py3.12.el8/lib/py/lib/python3.12/__pycache__/_markupbase.cpython-312.opt-2.pyc
23-Sep-2026 13:27:16 casa-CAS-14882-1-py3.12.el8/lib/py/lib/python3.12/__pycache__/tabnanny.cpython-312.opt-1.pyc
23-Sep-2026 13:27:16 casa-CAS-14882-1-py3.12.el8/lib/py/lib/python3.12/__pycache__/pkgutil.cpython-312.opt-1.pyc
23-Sep-2026 13:27:16 casa-CAS-14882-1-py3.12.el8/lib/py/lib/python3.12/__pycache__/plistlib.cpython-312.opt-2.pyc
23-Sep-2026 13:27:16 casa-CAS-14882-1-py3.12.el8/lib/py/lib/python3.12/__pycache__/cmd.cpython-312.opt-1.pyc
23-Sep-2026 13:27:16 casa-CAS-14882-1-py3.12.el8/lib/py/lib/python3.12/__pycache__/profile.cpython-312.opt-2.pyc
23-Sep-2026 13:27:16 casa-CAS-14882-1-py3.12.el8/lib/py/lib/python3.12/__pycache__/contextvars.cpython-312.opt-2.pyc
23-Sep-2026 13:27:16 casa-CAS-14882-1-py3.12.el8/lib/py/lib/python3.12/__pycache__/ftplib.cpython-312.opt-2.pyc
23-Sep-2026 13:27:16 casa-CAS-14882-1-py3.12.el8/lib/py/lib/python3.12/__pycache__/io.cpython-312.opt-2.pyc
23-Sep-2026 13:27:16 casa-CAS-14882-1-py3.12.el8/lib/py/lib/python3.12/__pycache__/keyword.cpython-312.opt-1.pyc
23-Sep-2026 13:27:16 casa-CAS-14882-1-py3.12.el8/lib/py/lib/python3.12/__pycache__/difflib.cpython-312.opt-2.pyc
23-Sep-2026 13:27:16 casa-CAS-14882-1-py3.12.el8/lib/py/lib/python3.12/__pycache__/pickle.cpython-312.pyc
23-Sep-2026 13:27:16 casa-CAS-14882-1-py3.12.el8/lib/py/lib/python3.12/__pycache__/this.cpython-312.opt-1.pyc
23-Sep-2026 13:27:16 casa-CAS-14882-1-py3.12.el8/lib/py/lib/python3.12/__pycache__/quopri.cpython-312.pyc
23-Sep-2026 13:27:16 casa-CAS-14882-1-py3.12.el8/lib/py/lib/python3.12/__pycache__/_compat_pickle.cpython-312.opt-2.pyc
23-Sep-2026 13:27:16 casa-CAS-14882-1-py3.12.el8/lib/py/lib/python3.12/__pycache__/_collections_abc.cpython-312.pyc
23-Sep-2026 13:27:16 casa-CAS-14882-1-py3.12.el8/lib/py/lib/python3.12/__pycache__/colorsys.cpython-312.opt-2.pyc
23-Sep-2026 13:27:16 casa-CAS-14882-1-py3.12.el8/lib/py/lib/python3.12/__pycache__/stat.cpython-312.opt-1.pyc
23-Sep-2026 13:27:16 casa-CAS-14882-1-py3.12.el8/lib/py/lib/python3.12/__pycache__/ntpath.cpython-312.opt-1.pyc
23-Sep-2026 13:27:16 casa-CAS-14882-1-py3.12.el8/lib/py/lib/python3.12/__pycache__/stat.cpython-312.pyc
23-Sep-2026 13:27:16 casa-CAS-14882-1-py3.12.el8/lib/py/lib/python3.12/__pycache__/pydoc.cpython-312.opt-2.pyc
23-Sep-2026 13:27:16 casa-CAS-14882-1-py3.12.el8/lib/py/lib/python3.12/__pycache__/shutil.cpython-312.pyc
23-Sep-2026 13:27:16 casa-CAS-14882-1-py3.12.el8/lib/py/lib/python3.12/__pycache__/this.cpython-312.pyc
23-Sep-2026 13:27:16 casa-CAS-14882-1-py3.12.el8/lib/py/lib/python3.12/__pycache__/_sitebuiltins.cpython-312.opt-1.pyc
23-Sep-2026 13:27:16 casa-CAS-14882-1-py3.12.el8/lib/py/lib/python3.12/__pycache__/cgitb.cpython-312.opt-1.pyc
23-Sep-2026 13:27:16 casa-CAS-14882-1-py3.12.el8/lib/py/lib/python3.12/__pycache__/glob.cpython-312.pyc
23-Sep-2026 13:27:16 casa-CAS-14882-1-py3.12.el8/lib/py/lib/python3.12/__pycache__/traceback.cpython-312.opt-1.pyc
23-Sep-2026 13:27:16 casa-CAS-14882-1-py3.12.el8/lib/py/lib/python3.12/__pycache__/difflib.cpython-312.opt-1.pyc
23-Sep-2026 13:27:16 casa-CAS-14882-1-py3.12.el8/lib/py/lib/python3.12/__pycache__/_compression.cpython-312.pyc
23-Sep-2026 13:27:16 casa-CAS-14882-1-py3.12.el8/lib/py/lib/python3.12/__pycache__/gzip.cpython-312.opt-2.pyc
23-Sep-2026 13:27:16 casa-CAS-14882-1-py3.12.el8/lib/py/lib/python3.12/__pycache__/locale.cpython-312.pyc
23-Sep-2026 13:27:16 casa-CAS-14882-1-py3.12.el8/lib/py/lib/python3.12/__pycache__/sysconfig.cpython-312.opt-2.pyc
23-Sep-2026 13:27:16 casa-CAS-14882-1-py3.12.el8/lib/py/lib/python3.12/__pycache__/_threading_local.cpython-312.pyc
23-Sep-2026 13:27:16 casa-CAS-14882-1-py3.12.el8/lib/py/lib/python3.12/__pycache__/turtle.cpython-312.pyc
23-Sep-2026 13:27:16 casa-CAS-14882-1-py3.12.el8/lib/py/lib/python3.12/__pycache__/rlcompleter.cpython-312.opt-1.pyc
23-Sep-2026 13:27:16 casa-CAS-14882-1-py3.12.el8/lib/py/lib/python3.12/__pycache__/smtplib.cpython-312.pyc
23-Sep-2026 13:27:16 casa-CAS-14882-1-py3.12.el8/lib/py/lib/python3.12/__pycache__/sre_parse.cpython-312.opt-1.pyc
23-Sep-2026 13:27:16 casa-CAS-14882-1-py3.12.el8/lib/py/lib/python3.12/__pycache__/inspect.cpython-312.opt-2.pyc
23-Sep-2026 13:27:16 casa-CAS-14882-1-py3.12.el8/lib/py/lib/python3.12/__pycache__/zipapp.cpython-312.opt-2.pyc
23-Sep-2026 13:27:16 casa-CAS-14882-1-py3.12.el8/lib/py/lib/python3.12/__pycache__/warnings.cpython-312.pyc
23-Sep-2026 13:27:16 casa-CAS-14882-1-py3.12.el8/lib/py/lib/python3.12/__pycache__/uuid.cpython-312.opt-1.pyc
23-Sep-2026 13:27:16 casa-CAS-14882-1-py3.12.el8/lib/py/lib/python3.12/__pycache__/linecache.cpython-312.opt-2.pyc
23-Sep-2026 13:27:16 casa-CAS-14882-1-py3.12.el8/lib/py/lib/python3.12/__pycache__/runpy.cpython-312.opt-2.pyc
23-Sep-2026 13:27:16 casa-CAS-14882-1-py3.12.el8/lib/py/lib/python3.12/__pycache__/symtable.cpython-312.opt-1.pyc
23-Sep-2026 13:27:16 casa-CAS-14882-1-py3.12.el8/lib/py/lib/python3.12/__pycache__/threading.cpython-312.opt-1.pyc
23-Sep-2026 13:27:16 casa-CAS-14882-1-py3.12.el8/lib/py/lib/python3.12/__pycache__/zipimport.cpython-312.opt-1.pyc
23-Sep-2026 13:27:16 casa-CAS-14882-1-py3.12.el8/lib/py/lib/python3.12/__pycache__/os.cpython-312.opt-1.pyc
23-Sep-2026 13:27:16 casa-CAS-14882-1-py3.12.el8/lib/py/lib/python3.12/__pycache__/gettext.cpython-312.opt-1.pyc
23-Sep-2026 13:27:16 casa-CAS-14882-1-py3.12.el8/lib/py/lib/python3.12/__pycache__/datetime.cpython-312.pyc
23-Sep-2026 13:27:16 casa-CAS-14882-1-py3.12.el8/lib/py/lib/python3.12/__pycache__/codecs.cpython-312.opt-2.pyc
23-Sep-2026 13:27:16 casa-CAS-14882-1-py3.12.el8/lib/py/lib/python3.12/__pycache__/secrets.cpython-312.pyc
23-Sep-2026 13:27:16 casa-CAS-14882-1-py3.12.el8/lib/py/lib/python3.12/__pycache__/numbers.cpython-312.pyc
23-Sep-2026 13:27:16 casa-CAS-14882-1-py3.12.el8/lib/py/lib/python3.12/__pycache__/modulefinder.cpython-312.opt-2.pyc
23-Sep-2026 13:27:16 casa-CAS-14882-1-py3.12.el8/lib/py/lib/python3.12/__pycache__/linecache.cpython-312.opt-1.pyc
23-Sep-2026 13:27:16 casa-CAS-14882-1-py3.12.el8/lib/py/lib/python3.12/__pycache__/telnetlib.cpython-312.pyc
23-Sep-2026 13:27:16 casa-CAS-14882-1-py3.12.el8/lib/py/lib/python3.12/__pycache__/lzma.cpython-312.opt-2.pyc
23-Sep-2026 13:27:16 casa-CAS-14882-1-py3.12.el8/lib/py/lib/python3.12/__pycache__/traceback.cpython-312.pyc
23-Sep-2026 13:27:16 casa-CAS-14882-1-py3.12.el8/lib/py/lib/python3.12/__pycache__/subprocess.cpython-312.opt-2.pyc
23-Sep-2026 13:27:16 casa-CAS-14882-1-py3.12.el8/lib/py/lib/python3.12/__pycache__/mailbox.cpython-312.opt-1.pyc
23-Sep-2026 13:27:16 casa-CAS-14882-1-py3.12.el8/lib/py/lib/python3.12/__pycache__/shutil.cpython-312.opt-2.pyc
23-Sep-2026 13:27:16 casa-CAS-14882-1-py3.12.el8/lib/py/lib/python3.12/__pycache__/imaplib.cpython-312.opt-1.pyc
23-Sep-2026 13:27:16 casa-CAS-14882-1-py3.12.el8/lib/py/lib/python3.12/__pycache__/plistlib.cpython-312.pyc
23-Sep-2026 13:27:16 casa-CAS-14882-1-py3.12.el8/lib/py/lib/python3.12/__pycache__/lzma.cpython-312.pyc
23-Sep-2026 13:27:16 casa-CAS-14882-1-py3.12.el8/lib/py/lib/python3.12/__pycache__/signal.cpython-312.opt-2.pyc
23-Sep-2026 13:27:16 casa-CAS-14882-1-py3.12.el8/lib/py/lib/python3.12/__pycache__/_osx_support.cpython-312.pyc
23-Sep-2026 13:27:16 casa-CAS-14882-1-py3.12.el8/lib/py/lib/python3.12/__pycache__/contextlib.cpython-312.pyc
23-Sep-2026 13:27:16 casa-CAS-14882-1-py3.12.el8/lib/py/lib/python3.12/__pycache__/codecs.cpython-312.pyc
23-Sep-2026 13:27:16 casa-CAS-14882-1-py3.12.el8/lib/py/lib/python3.12/__pycache__/runpy.cpython-312.opt-1.pyc
23-Sep-2026 13:27:16 casa-CAS-14882-1-py3.12.el8/lib/py/lib/python3.12/__pycache__/pickletools.cpython-312.opt-1.pyc
23-Sep-2026 13:27:16 casa-CAS-14882-1-py3.12.el8/lib/py/lib/python3.12/__pycache__/antigravity.cpython-312.opt-1.pyc
23-Sep-2026 13:27:16 casa-CAS-14882-1-py3.12.el8/lib/py/lib/python3.12/__pycache__/cProfile.cpython-312.opt-1.pyc
23-Sep-2026 13:27:16 casa-CAS-14882-1-py3.12.el8/lib/py/lib/python3.12/__pycache__/fileinput.cpython-312.opt-2.pyc
23-Sep-2026 13:27:16 casa-CAS-14882-1-py3.12.el8/lib/py/lib/python3.12/__pycache__/imaplib.cpython-312.pyc
23-Sep-2026 13:27:16 casa-CAS-14882-1-py3.12.el8/lib/py/lib/python3.12/__pycache__/cProfile.cpython-312.opt-2.pyc
23-Sep-2026 13:27:16 casa-CAS-14882-1-py3.12.el8/lib/py/lib/python3.12/__pycache__/_weakrefset.cpython-312.opt-1.pyc
23-Sep-2026 13:27:16 casa-CAS-14882-1-py3.12.el8/lib/py/lib/python3.12/__pycache__/functools.cpython-312.pyc
23-Sep-2026 13:27:16 casa-CAS-14882-1-py3.12.el8/lib/py/lib/python3.12/__pycache__/uu.cpython-312.opt-2.pyc
23-Sep-2026 13:27:16 casa-CAS-14882-1-py3.12.el8/lib/py/lib/python3.12/__pycache__/csv.cpython-312.pyc
23-Sep-2026 13:27:16 casa-CAS-14882-1-py3.12.el8/lib/py/lib/python3.12/__pycache__/secrets.cpython-312.opt-1.pyc
23-Sep-2026 13:27:16 casa-CAS-14882-1-py3.12.el8/lib/py/lib/python3.12/__pycache__/trace.cpython-312.pyc
23-Sep-2026 13:27:16 casa-CAS-14882-1-py3.12.el8/lib/py/lib/python3.12/__pycache__/sre_compile.cpython-312.opt-2.pyc
23-Sep-2026 13:27:16 casa-CAS-14882-1-py3.12.el8/lib/py/lib/python3.12/__pycache__/netrc.cpython-312.pyc
23-Sep-2026 13:27:16 casa-CAS-14882-1-py3.12.el8/lib/py/lib/python3.12/__pycache__/sunau.cpython-312.opt-2.pyc
23-Sep-2026 13:27:16 casa-CAS-14882-1-py3.12.el8/lib/py/lib/python3.12/__pycache__/profile.cpython-312.pyc
23-Sep-2026 13:27:16 casa-CAS-14882-1-py3.12.el8/lib/py/lib/python3.12/json/
23-Sep-2026 13:27:16 casa-CAS-14882-1-py3.12.el8/lib/py/lib/python3.12/json/tool.py
23-Sep-2026 13:27:16 casa-CAS-14882-1-py3.12.el8/lib/py/lib/python3.12/json/decoder.py
23-Sep-2026 13:27:16 casa-CAS-14882-1-py3.12.el8/lib/py/lib/python3.12/json/encoder.py
23-Sep-2026 13:27:16 casa-CAS-14882-1-py3.12.el8/lib/py/lib/python3.12/json/__pycache__/
23-Sep-2026 13:27:16 casa-CAS-14882-1-py3.12.el8/lib/py/lib/python3.12/json/__pycache__/scanner.cpython-312.opt-2.pyc
23-Sep-2026 13:27:16 casa-CAS-14882-1-py3.12.el8/lib/py/lib/python3.12/json/__pycache__/encoder.cpython-312.opt-2.pyc
23-Sep-2026 13:27:16 casa-CAS-14882-1-py3.12.el8/lib/py/lib/python3.12/json/__pycache__/tool.cpython-312.opt-1.pyc
23-Sep-2026 13:27:16 casa-CAS-14882-1-py3.12.el8/lib/py/lib/python3.12/json/__pycache__/tool.cpython-312.opt-2.pyc
23-Sep-2026 13:27:16 casa-CAS-14882-1-py3.12.el8/lib/py/lib/python3.12/json/__pycache__/decoder.cpython-312.pyc
23-Sep-2026 13:27:16 casa-CAS-14882-1-py3.12.el8/lib/py/lib/python3.12/json/__pycache__/decoder.cpython-312.opt-2.pyc
23-Sep-2026 13:27:16 casa-CAS-14882-1-py3.12.el8/lib/py/lib/python3.12/json/__pycache__/__init__.cpython-312.pyc
23-Sep-2026 13:27:16 casa-CAS-14882-1-py3.12.el8/lib/py/lib/python3.12/json/__pycache__/__init__.cpython-312.opt-1.pyc
23-Sep-2026 13:27:16 casa-CAS-14882-1-py3.12.el8/lib/py/lib/python3.12/json/__pycache__/encoder.cpython-312.pyc
23-Sep-2026 13:27:16 casa-CAS-14882-1-py3.12.el8/lib/py/lib/python3.12/json/__pycache__/__init__.cpython-312.opt-2.pyc
23-Sep-2026 13:27:16 casa-CAS-14882-1-py3.12.el8/lib/py/lib/python3.12/json/__pycache__/tool.cpython-312.pyc
23-Sep-2026 13:27:16 casa-CAS-14882-1-py3.12.el8/lib/py/lib/python3.12/json/__pycache__/scanner.cpython-312.opt-1.pyc
23-Sep-2026 13:27:16 casa-CAS-14882-1-py3.12.el8/lib/py/lib/python3.12/json/__pycache__/encoder.cpython-312.opt-1.pyc
23-Sep-2026 13:27:16 casa-CAS-14882-1-py3.12.el8/lib/py/lib/python3.12/json/__pycache__/scanner.cpython-312.pyc
23-Sep-2026 13:27:16 casa-CAS-14882-1-py3.12.el8/lib/py/lib/python3.12/json/__pycache__/decoder.cpython-312.opt-1.pyc
23-Sep-2026 13:27:16 casa-CAS-14882-1-py3.12.el8/lib/py/lib/python3.12/json/scanner.py
23-Sep-2026 13:27:16 casa-CAS-14882-1-py3.12.el8/lib/py/lib/python3.12/json/__init__.py
23-Sep-2026 13:27:16 casa-CAS-14882-1-py3.12.el8/lib/py/lib/python3.12/cgi.py
23-Sep-2026 13:27:16 casa-CAS-14882-1-py3.12.el8/lib/py/lib/python3.12/_pydecimal.py
23-Sep-2026 13:27:16 casa-CAS-14882-1-py3.12.el8/lib/py/lib/python3.12/compileall.py
23-Sep-2026 13:27:16 casa-CAS-14882-1-py3.12.el8/lib/py/lib/python3.12/typing.py
23-Sep-2026 13:27:16 casa-CAS-14882-1-py3.12.el8/lib/py/lib/python3.12/_markupbase.py
23-Sep-2026 13:27:16 casa-CAS-14882-1-py3.12.el8/lib/py/lib/python3.12/antigravity.py
23-Sep-2026 13:27:16 casa-CAS-14882-1-py3.12.el8/lib/py/lib/python3.12/token.py
23-Sep-2026 13:27:16 casa-CAS-14882-1-py3.12.el8/lib/py/lib/python3.12/socket.py
23-Sep-2026 13:27:16 casa-CAS-14882-1-py3.12.el8/lib/py/lib/python3.12/tomllib/
23-Sep-2026 13:27:16 casa-CAS-14882-1-py3.12.el8/lib/py/lib/python3.12/tomllib/_parser.py
23-Sep-2026 13:27:16 casa-CAS-14882-1-py3.12.el8/lib/py/lib/python3.12/tomllib/_types.py
23-Sep-2026 13:27:16 casa-CAS-14882-1-py3.12.el8/lib/py/lib/python3.12/tomllib/_re.py
23-Sep-2026 13:27:16 casa-CAS-14882-1-py3.12.el8/lib/py/lib/python3.12/tomllib/__pycache__/
23-Sep-2026 13:27:16 casa-CAS-14882-1-py3.12.el8/lib/py/lib/python3.12/tomllib/__pycache__/_re.cpython-312.opt-1.pyc
23-Sep-2026 13:27:16 casa-CAS-14882-1-py3.12.el8/lib/py/lib/python3.12/tomllib/__pycache__/_parser.cpython-312.pyc
23-Sep-2026 13:27:16 casa-CAS-14882-1-py3.12.el8/lib/py/lib/python3.12/tomllib/__pycache__/_types.cpython-312.opt-1.pyc
23-Sep-2026 13:27:16 casa-CAS-14882-1-py3.12.el8/lib/py/lib/python3.12/tomllib/__pycache__/__init__.cpython-312.pyc
23-Sep-2026 13:27:16 casa-CAS-14882-1-py3.12.el8/lib/py/lib/python3.12/tomllib/__pycache__/__init__.cpython-312.opt-1.pyc
23-Sep-2026 13:27:16 casa-CAS-14882-1-py3.12.el8/lib/py/lib/python3.12/tomllib/__pycache__/_parser.cpython-312.opt-1.pyc
23-Sep-2026 13:27:16 casa-CAS-14882-1-py3.12.el8/lib/py/lib/python3.12/tomllib/__pycache__/__init__.cpython-312.opt-2.pyc
23-Sep-2026 13:27:16 casa-CAS-14882-1-py3.12.el8/lib/py/lib/python3.12/tomllib/__pycache__/_re.cpython-312.opt-2.pyc
23-Sep-2026 13:27:16 casa-CAS-14882-1-py3.12.el8/lib/py/lib/python3.12/tomllib/__pycache__/_parser.cpython-312.opt-2.pyc
23-Sep-2026 13:27:16 casa-CAS-14882-1-py3.12.el8/lib/py/lib/python3.12/tomllib/__pycache__/_types.cpython-312.pyc
23-Sep-2026 13:27:16 casa-CAS-14882-1-py3.12.el8/lib/py/lib/python3.12/tomllib/__pycache__/_re.cpython-312.pyc
23-Sep-2026 13:27:16 casa-CAS-14882-1-py3.12.el8/lib/py/lib/python3.12/tomllib/__pycache__/_types.cpython-312.opt-2.pyc
23-Sep-2026 13:27:16 casa-CAS-14882-1-py3.12.el8/lib/py/lib/python3.12/tomllib/__init__.py
23-Sep-2026 13:27:16 casa-CAS-14882-1-py3.12.el8/lib/py/lib/python3.12/xdrlib.py
23-Sep-2026 13:27:16 casa-CAS-14882-1-py3.12.el8/lib/py/lib/python3.12/sqlite3/
23-Sep-2026 13:27:16 casa-CAS-14882-1-py3.12.el8/lib/py/lib/python3.12/sqlite3/dbapi2.py
23-Sep-2026 13:27:16 casa-CAS-14882-1-py3.12.el8/lib/py/lib/python3.12/sqlite3/dump.py
23-Sep-2026 13:27:16 casa-CAS-14882-1-py3.12.el8/lib/py/lib/python3.12/sqlite3/__main__.py
23-Sep-2026 13:27:16 casa-CAS-14882-1-py3.12.el8/lib/py/lib/python3.12/sqlite3/__pycache__/
23-Sep-2026 13:27:16 casa-CAS-14882-1-py3.12.el8/lib/py/lib/python3.12/sqlite3/__pycache__/__main__.cpython-312.pyc
23-Sep-2026 13:27:16 casa-CAS-14882-1-py3.12.el8/lib/py/lib/python3.12/sqlite3/__pycache__/dbapi2.cpython-312.opt-1.pyc
23-Sep-2026 13:27:16 casa-CAS-14882-1-py3.12.el8/lib/py/lib/python3.12/sqlite3/__pycache__/dump.cpython-312.opt-2.pyc
23-Sep-2026 13:27:16 casa-CAS-14882-1-py3.12.el8/lib/py/lib/python3.12/sqlite3/__pycache__/dump.cpython-312.opt-1.pyc
23-Sep-2026 13:27:16 casa-CAS-14882-1-py3.12.el8/lib/py/lib/python3.12/sqlite3/__pycache__/__main__.cpython-312.opt-2.pyc
23-Sep-2026 13:27:16 casa-CAS-14882-1-py3.12.el8/lib/py/lib/python3.12/sqlite3/__pycache__/dump.cpython-312.pyc
23-Sep-2026 13:27:16 casa-CAS-14882-1-py3.12.el8/lib/py/lib/python3.12/sqlite3/__pycache__/__init__.cpython-312.pyc
23-Sep-2026 13:27:16 casa-CAS-14882-1-py3.12.el8/lib/py/lib/python3.12/sqlite3/__pycache__/__init__.cpython-312.opt-1.pyc
23-Sep-2026 13:27:16 casa-CAS-14882-1-py3.12.el8/lib/py/lib/python3.12/sqlite3/__pycache__/dbapi2.cpython-312.pyc
23-Sep-2026 13:27:16 casa-CAS-14882-1-py3.12.el8/lib/py/lib/python3.12/sqlite3/__pycache__/dbapi2.cpython-312.opt-2.pyc
23-Sep-2026 13:27:16 casa-CAS-14882-1-py3.12.el8/lib/py/lib/python3.12/sqlite3/__pycache__/__init__.cpython-312.opt-2.pyc
23-Sep-2026 13:27:16 casa-CAS-14882-1-py3.12.el8/lib/py/lib/python3.12/sqlite3/__pycache__/__main__.cpython-312.opt-1.pyc
23-Sep-2026 13:27:16 casa-CAS-14882-1-py3.12.el8/lib/py/lib/python3.12/sqlite3/__init__.py
23-Sep-2026 13:27:16 casa-CAS-14882-1-py3.12.el8/lib/py/lib/python3.12/fileinput.py
23-Sep-2026 13:27:16 casa-CAS-14882-1-py3.12.el8/lib/py/lib/python3.12/py_compile.py
23-Sep-2026 13:27:16 casa-CAS-14882-1-py3.12.el8/lib/py/lib/python3.12/types.py
23-Sep-2026 13:27:16 casa-CAS-14882-1-py3.12.el8/lib/py/lib/python3.12/ctypes/
23-Sep-2026 13:27:16 casa-CAS-14882-1-py3.12.el8/lib/py/lib/python3.12/ctypes/_endian.py
23-Sep-2026 13:27:16 casa-CAS-14882-1-py3.12.el8/lib/py/lib/python3.12/ctypes/util.py
23-Sep-2026 13:27:16 casa-CAS-14882-1-py3.12.el8/lib/py/lib/python3.12/ctypes/wintypes.py
23-Sep-2026 13:27:16 casa-CAS-14882-1-py3.12.el8/lib/py/lib/python3.12/ctypes/__pycache__/
23-Sep-2026 13:27:16 casa-CAS-14882-1-py3.12.el8/lib/py/lib/python3.12/ctypes/__pycache__/_endian.cpython-312.opt-1.pyc
23-Sep-2026 13:27:16 casa-CAS-14882-1-py3.12.el8/lib/py/lib/python3.12/ctypes/__pycache__/wintypes.cpython-312.pyc
23-Sep-2026 13:27:16 casa-CAS-14882-1-py3.12.el8/lib/py/lib/python3.12/ctypes/__pycache__/wintypes.cpython-312.opt-2.pyc
23-Sep-2026 13:27:16 casa-CAS-14882-1-py3.12.el8/lib/py/lib/python3.12/ctypes/__pycache__/_endian.cpython-312.opt-2.pyc
23-Sep-2026 13:27:16 casa-CAS-14882-1-py3.12.el8/lib/py/lib/python3.12/ctypes/__pycache__/util.cpython-312.opt-2.pyc
23-Sep-2026 13:27:16 casa-CAS-14882-1-py3.12.el8/lib/py/lib/python3.12/ctypes/__pycache__/util.cpython-312.opt-1.pyc
23-Sep-2026 13:27:16 casa-CAS-14882-1-py3.12.el8/lib/py/lib/python3.12/ctypes/__pycache__/__init__.cpython-312.pyc
23-Sep-2026 13:27:16 casa-CAS-14882-1-py3.12.el8/lib/py/lib/python3.12/ctypes/__pycache__/_aix.cpython-312.opt-1.pyc
23-Sep-2026 13:27:16 casa-CAS-14882-1-py3.12.el8/lib/py/lib/python3.12/ctypes/__pycache__/wintypes.cpython-312.opt-1.pyc
23-Sep-2026 13:27:16 casa-CAS-14882-1-py3.12.el8/lib/py/lib/python3.12/ctypes/__pycache__/util.cpython-312.pyc
23-Sep-2026 13:27:16 casa-CAS-14882-1-py3.12.el8/lib/py/lib/python3.12/ctypes/__pycache__/__init__.cpython-312.opt-1.pyc
23-Sep-2026 13:27:16 casa-CAS-14882-1-py3.12.el8/lib/py/lib/python3.12/ctypes/__pycache__/_aix.cpython-312.pyc
23-Sep-2026 13:27:16 casa-CAS-14882-1-py3.12.el8/lib/py/lib/python3.12/ctypes/__pycache__/__init__.cpython-312.opt-2.pyc
23-Sep-2026 13:27:16 casa-CAS-14882-1-py3.12.el8/lib/py/lib/python3.12/ctypes/__pycache__/_aix.cpython-312.opt-2.pyc
23-Sep-2026 13:27:16 casa-CAS-14882-1-py3.12.el8/lib/py/lib/python3.12/ctypes/__pycache__/_endian.cpython-312.pyc
23-Sep-2026 13:27:16 casa-CAS-14882-1-py3.12.el8/lib/py/lib/python3.12/ctypes/_aix.py
23-Sep-2026 13:27:16 casa-CAS-14882-1-py3.12.el8/lib/py/lib/python3.12/ctypes/__init__.py
23-Sep-2026 13:27:16 casa-CAS-14882-1-py3.12.el8/lib/py/lib/python3.12/ctypes/macholib/
23-Sep-2026 13:27:16 casa-CAS-14882-1-py3.12.el8/lib/py/lib/python3.12/ctypes/macholib/dylib.py
23-Sep-2026 13:27:16 casa-CAS-14882-1-py3.12.el8/lib/py/lib/python3.12/ctypes/macholib/README.ctypes
23-Sep-2026 13:27:16 casa-CAS-14882-1-py3.12.el8/lib/py/lib/python3.12/ctypes/macholib/framework.py
23-Sep-2026 13:27:16 casa-CAS-14882-1-py3.12.el8/lib/py/lib/python3.12/ctypes/macholib/fetch_macholib.bat
23-Sep-2026 13:27:16 casa-CAS-14882-1-py3.12.el8/lib/py/lib/python3.12/ctypes/macholib/__pycache__/
23-Sep-2026 13:27:16 casa-CAS-14882-1-py3.12.el8/lib/py/lib/python3.12/ctypes/macholib/__pycache__/dyld.cpython-312.opt-1.pyc
23-Sep-2026 13:27:16 casa-CAS-14882-1-py3.12.el8/lib/py/lib/python3.12/ctypes/macholib/__pycache__/dylib.cpython-312.pyc
23-Sep-2026 13:27:16 casa-CAS-14882-1-py3.12.el8/lib/py/lib/python3.12/ctypes/macholib/__pycache__/__init__.cpython-312.pyc
23-Sep-2026 13:27:16 casa-CAS-14882-1-py3.12.el8/lib/py/lib/python3.12/ctypes/macholib/__pycache__/dyld.cpython-312.pyc
23-Sep-2026 13:27:16 casa-CAS-14882-1-py3.12.el8/lib/py/lib/python3.12/ctypes/macholib/__pycache__/__init__.cpython-312.opt-1.pyc
23-Sep-2026 13:27:16 casa-CAS-14882-1-py3.12.el8/lib/py/lib/python3.12/ctypes/macholib/__pycache__/framework.cpython-312.opt-2.pyc
23-Sep-2026 13:27:16 casa-CAS-14882-1-py3.12.el8/lib/py/lib/python3.12/ctypes/macholib/__pycache__/dylib.cpython-312.opt-2.pyc
23-Sep-2026 13:27:16 casa-CAS-14882-1-py3.12.el8/lib/py/lib/python3.12/ctypes/macholib/__pycache__/dyld.cpython-312.opt-2.pyc
23-Sep-2026 13:27:16 casa-CAS-14882-1-py3.12.el8/lib/py/lib/python3.12/ctypes/macholib/__pycache__/__init__.cpython-312.opt-2.pyc
23-Sep-2026 13:27:16 casa-CAS-14882-1-py3.12.el8/lib/py/lib/python3.12/ctypes/macholib/__pycache__/framework.cpython-312.pyc
23-Sep-2026 13:27:16 casa-CAS-14882-1-py3.12.el8/lib/py/lib/python3.12/ctypes/macholib/__pycache__/framework.cpython-312.opt-1.pyc
23-Sep-2026 13:27:16 casa-CAS-14882-1-py3.12.el8/lib/py/lib/python3.12/ctypes/macholib/__pycache__/dylib.cpython-312.opt-1.pyc
23-Sep-2026 13:27:16 casa-CAS-14882-1-py3.12.el8/lib/py/lib/python3.12/ctypes/macholib/dyld.py
23-Sep-2026 13:27:16 casa-CAS-14882-1-py3.12.el8/lib/py/lib/python3.12/ctypes/macholib/__init__.py
23-Sep-2026 13:27:16 casa-CAS-14882-1-py3.12.el8/lib/py/lib/python3.12/ctypes/macholib/fetch_macholib
23-Sep-2026 13:27:16 casa-CAS-14882-1-py3.12.el8/lib/py/lib/python3.12/pathlib.py
23-Sep-2026 13:27:16 casa-CAS-14882-1-py3.12.el8/lib/py/lib/python3.12/abc.py
23-Sep-2026 13:27:16 casa-CAS-14882-1-py3.12.el8/lib/py/lib/python3.12/aifc.py
23-Sep-2026 13:27:16 casa-CAS-14882-1-py3.12.el8/lib/py/lib/python3.12/os.py
23-Sep-2026 13:27:16 casa-CAS-14882-1-py3.12.el8/lib/py/lib/python3.12/base64.py
23-Sep-2026 13:27:16 casa-CAS-14882-1-py3.12.el8/lib/py/lib/python3.12/doctest.py
23-Sep-2026 13:27:16 casa-CAS-14882-1-py3.12.el8/lib/py/lib/python3.12/_sitebuiltins.py
23-Sep-2026 13:27:16 casa-CAS-14882-1-py3.12.el8/lib/py/lib/python3.12/zipfile/
23-Sep-2026 13:27:16 casa-CAS-14882-1-py3.12.el8/lib/py/lib/python3.12/zipfile/_path/
23-Sep-2026 13:27:16 casa-CAS-14882-1-py3.12.el8/lib/py/lib/python3.12/zipfile/_path/glob.py
23-Sep-2026 13:27:16 casa-CAS-14882-1-py3.12.el8/lib/py/lib/python3.12/zipfile/_path/__pycache__/
23-Sep-2026 13:27:16 casa-CAS-14882-1-py3.12.el8/lib/py/lib/python3.12/zipfile/_path/__pycache__/glob.cpython-312.opt-1.pyc
23-Sep-2026 13:27:16 casa-CAS-14882-1-py3.12.el8/lib/py/lib/python3.12/zipfile/_path/__pycache__/glob.cpython-312.opt-2.pyc
23-Sep-2026 13:27:16 casa-CAS-14882-1-py3.12.el8/lib/py/lib/python3.12/zipfile/_path/__pycache__/__init__.cpython-312.pyc
23-Sep-2026 13:27:16 casa-CAS-14882-1-py3.12.el8/lib/py/lib/python3.12/zipfile/_path/__pycache__/__init__.cpython-312.opt-1.pyc
23-Sep-2026 13:27:16 casa-CAS-14882-1-py3.12.el8/lib/py/lib/python3.12/zipfile/_path/__pycache__/__init__.cpython-312.opt-2.pyc
23-Sep-2026 13:27:16 casa-CAS-14882-1-py3.12.el8/lib/py/lib/python3.12/zipfile/_path/__pycache__/glob.cpython-312.pyc
23-Sep-2026 13:27:16 casa-CAS-14882-1-py3.12.el8/lib/py/lib/python3.12/zipfile/_path/__init__.py
23-Sep-2026 13:27:16 casa-CAS-14882-1-py3.12.el8/lib/py/lib/python3.12/zipfile/__main__.py
23-Sep-2026 13:27:16 casa-CAS-14882-1-py3.12.el8/lib/py/lib/python3.12/zipfile/__pycache__/
23-Sep-2026 13:27:16 casa-CAS-14882-1-py3.12.el8/lib/py/lib/python3.12/zipfile/__pycache__/__main__.cpython-312.pyc
23-Sep-2026 13:27:16 casa-CAS-14882-1-py3.12.el8/lib/py/lib/python3.12/zipfile/__pycache__/__main__.cpython-312.opt-2.pyc
23-Sep-2026 13:27:16 casa-CAS-14882-1-py3.12.el8/lib/py/lib/python3.12/zipfile/__pycache__/__init__.cpython-312.pyc
23-Sep-2026 13:27:16 casa-CAS-14882-1-py3.12.el8/lib/py/lib/python3.12/zipfile/__pycache__/__init__.cpython-312.opt-1.pyc
23-Sep-2026 13:27:16 casa-CAS-14882-1-py3.12.el8/lib/py/lib/python3.12/zipfile/__pycache__/__init__.cpython-312.opt-2.pyc
23-Sep-2026 13:27:16 casa-CAS-14882-1-py3.12.el8/lib/py/lib/python3.12/zipfile/__pycache__/__main__.cpython-312.opt-1.pyc
23-Sep-2026 13:27:16 casa-CAS-14882-1-py3.12.el8/lib/py/lib/python3.12/zipfile/__init__.py
23-Sep-2026 13:27:16 casa-CAS-14882-1-py3.12.el8/lib/py/lib/python3.12/imaplib.py
23-Sep-2026 13:27:16 casa-CAS-14882-1-py3.12.el8/lib/py/lib/python3.12/hashlib.py
23-Sep-2026 13:27:16 casa-CAS-14882-1-py3.12.el8/lib/py/lib/python3.12/__phello__/
23-Sep-2026 13:27:16 casa-CAS-14882-1-py3.12.el8/lib/py/lib/python3.12/__phello__/spam.py
23-Sep-2026 13:27:16 casa-CAS-14882-1-py3.12.el8/lib/py/lib/python3.12/__phello__/__pycache__/
23-Sep-2026 13:27:16 casa-CAS-14882-1-py3.12.el8/lib/py/lib/python3.12/__phello__/__pycache__/spam.cpython-312.opt-1.pyc
23-Sep-2026 13:27:16 casa-CAS-14882-1-py3.12.el8/lib/py/lib/python3.12/__phello__/__pycache__/spam.cpython-312.opt-2.pyc
23-Sep-2026 13:27:16 casa-CAS-14882-1-py3.12.el8/lib/py/lib/python3.12/__phello__/__pycache__/__init__.cpython-312.pyc
23-Sep-2026 13:27:16 casa-CAS-14882-1-py3.12.el8/lib/py/lib/python3.12/__phello__/__pycache__/__init__.cpython-312.opt-1.pyc
23-Sep-2026 13:27:16 casa-CAS-14882-1-py3.12.el8/lib/py/lib/python3.12/__phello__/__pycache__/__init__.cpython-312.opt-2.pyc
23-Sep-2026 13:27:16 casa-CAS-14882-1-py3.12.el8/lib/py/lib/python3.12/__phello__/__pycache__/spam.cpython-312.pyc
23-Sep-2026 13:27:16 casa-CAS-14882-1-py3.12.el8/lib/py/lib/python3.12/__phello__/__init__.py
23-Sep-2026 13:27:16 casa-CAS-14882-1-py3.12.el8/lib/py/lib/python3.12/traceback.py
23-Sep-2026 13:27:16 casa-CAS-14882-1-py3.12.el8/lib/py/lib/python3.12/csv.py
23-Sep-2026 13:27:16 casa-CAS-14882-1-py3.12.el8/lib/py/lib/python3.12/signal.py
23-Sep-2026 13:27:16 casa-CAS-14882-1-py3.12.el8/lib/py/lib/python3.12/pstats.py
23-Sep-2026 13:27:16 casa-CAS-14882-1-py3.12.el8/lib/py/lib/python3.12/heapq.py
23-Sep-2026 13:27:16 casa-CAS-14882-1-py3.12.el8/lib/py/lib/python3.12/dataclasses.py
23-Sep-2026 13:27:16 casa-CAS-14882-1-py3.12.el8/lib/py/lib/python3.12/poplib.py
23-Sep-2026 13:27:16 casa-CAS-14882-1-py3.12.el8/lib/py/lib/python3.12/_strptime.py
23-Sep-2026 13:27:16 casa-CAS-14882-1-py3.12.el8/lib/py/lib/python3.12/turtledemo/
23-Sep-2026 13:27:16 casa-CAS-14882-1-py3.12.el8/lib/py/lib/python3.12/turtledemo/minimal_hanoi.py
23-Sep-2026 13:27:16 casa-CAS-14882-1-py3.12.el8/lib/py/lib/python3.12/turtledemo/fractalcurves.py
23-Sep-2026 13:27:16 casa-CAS-14882-1-py3.12.el8/lib/py/lib/python3.12/turtledemo/bytedesign.py
23-Sep-2026 13:27:16 casa-CAS-14882-1-py3.12.el8/lib/py/lib/python3.12/turtledemo/paint.py
23-Sep-2026 13:27:16 casa-CAS-14882-1-py3.12.el8/lib/py/lib/python3.12/turtledemo/round_dance.py
23-Sep-2026 13:27:16 casa-CAS-14882-1-py3.12.el8/lib/py/lib/python3.12/turtledemo/yinyang.py
23-Sep-2026 13:27:16 casa-CAS-14882-1-py3.12.el8/lib/py/lib/python3.12/turtledemo/forest.py
23-Sep-2026 13:27:16 casa-CAS-14882-1-py3.12.el8/lib/py/lib/python3.12/turtledemo/peace.py
23-Sep-2026 13:27:16 casa-CAS-14882-1-py3.12.el8/lib/py/lib/python3.12/turtledemo/planet_and_moon.py
23-Sep-2026 13:27:16 casa-CAS-14882-1-py3.12.el8/lib/py/lib/python3.12/turtledemo/chaos.py
23-Sep-2026 13:27:16 casa-CAS-14882-1-py3.12.el8/lib/py/lib/python3.12/turtledemo/colormixer.py
23-Sep-2026 13:27:16 casa-CAS-14882-1-py3.12.el8/lib/py/lib/python3.12/turtledemo/sorting_animate.py
23-Sep-2026 13:27:16 casa-CAS-14882-1-py3.12.el8/lib/py/lib/python3.12/turtledemo/turtle.cfg
23-Sep-2026 13:27:16 casa-CAS-14882-1-py3.12.el8/lib/py/lib/python3.12/turtledemo/two_canvases.py
23-Sep-2026 13:27:16 casa-CAS-14882-1-py3.12.el8/lib/py/lib/python3.12/turtledemo/rosette.py
23-Sep-2026 13:27:16 casa-CAS-14882-1-py3.12.el8/lib/py/lib/python3.12/turtledemo/__main__.py
23-Sep-2026 13:27:16 casa-CAS-14882-1-py3.12.el8/lib/py/lib/python3.12/turtledemo/lindenmayer.py
23-Sep-2026 13:27:16 casa-CAS-14882-1-py3.12.el8/lib/py/lib/python3.12/turtledemo/__pycache__/
23-Sep-2026 13:27:16 casa-CAS-14882-1-py3.12.el8/lib/py/lib/python3.12/turtledemo/__pycache__/sorting_animate.cpython-312.opt-1.pyc
23-Sep-2026 13:27:16 casa-CAS-14882-1-py3.12.el8/lib/py/lib/python3.12/turtledemo/__pycache__/__main__.cpython-312.pyc
23-Sep-2026 13:27:16 casa-CAS-14882-1-py3.12.el8/lib/py/lib/python3.12/turtledemo/__pycache__/minimal_hanoi.cpython-312.opt-2.pyc
23-Sep-2026 13:27:16 casa-CAS-14882-1-py3.12.el8/lib/py/lib/python3.12/turtledemo/__pycache__/two_canvases.cpython-312.pyc
23-Sep-2026 13:27:16 casa-CAS-14882-1-py3.12.el8/lib/py/lib/python3.12/turtledemo/__pycache__/nim.cpython-312.opt-2.pyc
23-Sep-2026 13:27:16 casa-CAS-14882-1-py3.12.el8/lib/py/lib/python3.12/turtledemo/__pycache__/round_dance.cpython-312.opt-1.pyc
23-Sep-2026 13:27:16 casa-CAS-14882-1-py3.12.el8/lib/py/lib/python3.12/turtledemo/__pycache__/planet_and_moon.cpython-312.opt-1.pyc
23-Sep-2026 13:27:16 casa-CAS-14882-1-py3.12.el8/lib/py/lib/python3.12/turtledemo/__pycache__/__main__.cpython-312.opt-2.pyc
23-Sep-2026 13:27:16 casa-CAS-14882-1-py3.12.el8/lib/py/lib/python3.12/turtledemo/__pycache__/forest.cpython-312.opt-2.pyc
23-Sep-2026 13:27:16 casa-CAS-14882-1-py3.12.el8/lib/py/lib/python3.12/turtledemo/__pycache__/yinyang.cpython-312.opt-2.pyc
23-Sep-2026 13:27:16 casa-CAS-14882-1-py3.12.el8/lib/py/lib/python3.12/turtledemo/__pycache__/chaos.cpython-312.opt-1.pyc
23-Sep-2026 13:27:16 casa-CAS-14882-1-py3.12.el8/lib/py/lib/python3.12/turtledemo/__pycache__/planet_and_moon.cpython-312.pyc
23-Sep-2026 13:27:16 casa-CAS-14882-1-py3.12.el8/lib/py/lib/python3.12/turtledemo/__pycache__/rosette.cpython-312.opt-2.pyc
23-Sep-2026 13:27:16 casa-CAS-14882-1-py3.12.el8/lib/py/lib/python3.12/turtledemo/__pycache__/chaos.cpython-312.pyc
23-Sep-2026 13:27:16 casa-CAS-14882-1-py3.12.el8/lib/py/lib/python3.12/turtledemo/__pycache__/clock.cpython-312.opt-2.pyc
23-Sep-2026 13:27:16 casa-CAS-14882-1-py3.12.el8/lib/py/lib/python3.12/turtledemo/__pycache__/minimal_hanoi.cpython-312.pyc
23-Sep-2026 13:27:16 casa-CAS-14882-1-py3.12.el8/lib/py/lib/python3.12/turtledemo/__pycache__/colormixer.cpython-312.opt-2.pyc
23-Sep-2026 13:27:16 casa-CAS-14882-1-py3.12.el8/lib/py/lib/python3.12/turtledemo/__pycache__/round_dance.cpython-312.pyc
23-Sep-2026 13:27:16 casa-CAS-14882-1-py3.12.el8/lib/py/lib/python3.12/turtledemo/__pycache__/chaos.cpython-312.opt-2.pyc
23-Sep-2026 13:27:16 casa-CAS-14882-1-py3.12.el8/lib/py/lib/python3.12/turtledemo/__pycache__/fractalcurves.cpython-312.opt-1.pyc
23-Sep-2026 13:27:16 casa-CAS-14882-1-py3.12.el8/lib/py/lib/python3.12/turtledemo/__pycache__/paint.cpython-312.pyc
23-Sep-2026 13:27:16 casa-CAS-14882-1-py3.12.el8/lib/py/lib/python3.12/turtledemo/__pycache__/sorting_animate.cpython-312.pyc
23-Sep-2026 13:27:16 casa-CAS-14882-1-py3.12.el8/lib/py/lib/python3.12/turtledemo/__pycache__/two_canvases.cpython-312.opt-2.pyc
23-Sep-2026 13:27:16 casa-CAS-14882-1-py3.12.el8/lib/py/lib/python3.12/turtledemo/__pycache__/forest.cpython-312.pyc
23-Sep-2026 13:27:16 casa-CAS-14882-1-py3.12.el8/lib/py/lib/python3.12/turtledemo/__pycache__/sorting_animate.cpython-312.opt-2.pyc
23-Sep-2026 13:27:16 casa-CAS-14882-1-py3.12.el8/lib/py/lib/python3.12/turtledemo/__pycache__/penrose.cpython-312.opt-2.pyc
23-Sep-2026 13:27:16 casa-CAS-14882-1-py3.12.el8/lib/py/lib/python3.12/turtledemo/__pycache__/minimal_hanoi.cpython-312.opt-1.pyc
23-Sep-2026 13:27:16 casa-CAS-14882-1-py3.12.el8/lib/py/lib/python3.12/turtledemo/__pycache__/__init__.cpython-312.pyc
23-Sep-2026 13:27:16 casa-CAS-14882-1-py3.12.el8/lib/py/lib/python3.12/turtledemo/__pycache__/yinyang.cpython-312.pyc
23-Sep-2026 13:27:16 casa-CAS-14882-1-py3.12.el8/lib/py/lib/python3.12/turtledemo/__pycache__/paint.cpython-312.opt-1.pyc
23-Sep-2026 13:27:16 casa-CAS-14882-1-py3.12.el8/lib/py/lib/python3.12/turtledemo/__pycache__/colormixer.cpython-312.pyc
23-Sep-2026 13:27:16 casa-CAS-14882-1-py3.12.el8/lib/py/lib/python3.12/turtledemo/__pycache__/colormixer.cpython-312.opt-1.pyc
23-Sep-2026 13:27:16 casa-CAS-14882-1-py3.12.el8/lib/py/lib/python3.12/turtledemo/__pycache__/penrose.cpython-312.pyc
23-Sep-2026 13:27:16 casa-CAS-14882-1-py3.12.el8/lib/py/lib/python3.12/turtledemo/__pycache__/__init__.cpython-312.opt-1.pyc
23-Sep-2026 13:27:16 casa-CAS-14882-1-py3.12.el8/lib/py/lib/python3.12/turtledemo/__pycache__/paint.cpython-312.opt-2.pyc
23-Sep-2026 13:27:16 casa-CAS-14882-1-py3.12.el8/lib/py/lib/python3.12/turtledemo/__pycache__/peace.cpython-312.pyc
23-Sep-2026 13:27:16 casa-CAS-14882-1-py3.12.el8/lib/py/lib/python3.12/turtledemo/__pycache__/bytedesign.cpython-312.pyc
23-Sep-2026 13:27:16 casa-CAS-14882-1-py3.12.el8/lib/py/lib/python3.12/turtledemo/__pycache__/tree.cpython-312.opt-2.pyc
23-Sep-2026 13:27:16 casa-CAS-14882-1-py3.12.el8/lib/py/lib/python3.12/turtledemo/__pycache__/lindenmayer.cpython-312.opt-1.pyc
23-Sep-2026 13:27:16 casa-CAS-14882-1-py3.12.el8/lib/py/lib/python3.12/turtledemo/__pycache__/tree.cpython-312.pyc
23-Sep-2026 13:27:16 casa-CAS-14882-1-py3.12.el8/lib/py/lib/python3.12/turtledemo/__pycache__/forest.cpython-312.opt-1.pyc
23-Sep-2026 13:27:16 casa-CAS-14882-1-py3.12.el8/lib/py/lib/python3.12/turtledemo/__pycache__/rosette.cpython-312.pyc
23-Sep-2026 13:27:16 casa-CAS-14882-1-py3.12.el8/lib/py/lib/python3.12/turtledemo/__pycache__/two_canvases.cpython-312.opt-1.pyc
23-Sep-2026 13:27:16 casa-CAS-14882-1-py3.12.el8/lib/py/lib/python3.12/turtledemo/__pycache__/__init__.cpython-312.opt-2.pyc
23-Sep-2026 13:27:16 casa-CAS-14882-1-py3.12.el8/lib/py/lib/python3.12/turtledemo/__pycache__/__main__.cpython-312.opt-1.pyc
23-Sep-2026 13:27:16 casa-CAS-14882-1-py3.12.el8/lib/py/lib/python3.12/turtledemo/__pycache__/round_dance.cpython-312.opt-2.pyc
23-Sep-2026 13:27:16 casa-CAS-14882-1-py3.12.el8/lib/py/lib/python3.12/turtledemo/__pycache__/lindenmayer.cpython-312.pyc
23-Sep-2026 13:27:16 casa-CAS-14882-1-py3.12.el8/lib/py/lib/python3.12/turtledemo/__pycache__/bytedesign.cpython-312.opt-1.pyc
23-Sep-2026 13:27:16 casa-CAS-14882-1-py3.12.el8/lib/py/lib/python3.12/turtledemo/__pycache__/rosette.cpython-312.opt-1.pyc
23-Sep-2026 13:27:16 casa-CAS-14882-1-py3.12.el8/lib/py/lib/python3.12/turtledemo/__pycache__/fractalcurves.cpython-312.opt-2.pyc
23-Sep-2026 13:27:16 casa-CAS-14882-1-py3.12.el8/lib/py/lib/python3.12/turtledemo/__pycache__/fractalcurves.cpython-312.pyc
23-Sep-2026 13:27:16 casa-CAS-14882-1-py3.12.el8/lib/py/lib/python3.12/turtledemo/__pycache__/tree.cpython-312.opt-1.pyc
23-Sep-2026 13:27:16 casa-CAS-14882-1-py3.12.el8/lib/py/lib/python3.12/turtledemo/__pycache__/peace.cpython-312.opt-2.pyc
23-Sep-2026 13:27:16 casa-CAS-14882-1-py3.12.el8/lib/py/lib/python3.12/turtledemo/__pycache__/clock.cpython-312.opt-1.pyc
23-Sep-2026 13:27:16 casa-CAS-14882-1-py3.12.el8/lib/py/lib/python3.12/turtledemo/__pycache__/yinyang.cpython-312.opt-1.pyc
23-Sep-2026 13:27:16 casa-CAS-14882-1-py3.12.el8/lib/py/lib/python3.12/turtledemo/__pycache__/penrose.cpython-312.opt-1.pyc
23-Sep-2026 13:27:16 casa-CAS-14882-1-py3.12.el8/lib/py/lib/python3.12/turtledemo/__pycache__/clock.cpython-312.pyc
23-Sep-2026 13:27:16 casa-CAS-14882-1-py3.12.el8/lib/py/lib/python3.12/turtledemo/__pycache__/nim.cpython-312.pyc
23-Sep-2026 13:27:16 casa-CAS-14882-1-py3.12.el8/lib/py/lib/python3.12/turtledemo/__pycache__/lindenmayer.cpython-312.opt-2.pyc
23-Sep-2026 13:27:16 casa-CAS-14882-1-py3.12.el8/lib/py/lib/python3.12/turtledemo/__pycache__/peace.cpython-312.opt-1.pyc
23-Sep-2026 13:27:16 casa-CAS-14882-1-py3.12.el8/lib/py/lib/python3.12/turtledemo/__pycache__/nim.cpython-312.opt-1.pyc
23-Sep-2026 13:27:16 casa-CAS-14882-1-py3.12.el8/lib/py/lib/python3.12/turtledemo/__pycache__/bytedesign.cpython-312.opt-2.pyc
23-Sep-2026 13:27:16 casa-CAS-14882-1-py3.12.el8/lib/py/lib/python3.12/turtledemo/__pycache__/planet_and_moon.cpython-312.opt-2.pyc
23-Sep-2026 13:27:16 casa-CAS-14882-1-py3.12.el8/lib/py/lib/python3.12/turtledemo/tree.py
23-Sep-2026 13:27:16 casa-CAS-14882-1-py3.12.el8/lib/py/lib/python3.12/turtledemo/clock.py
23-Sep-2026 13:27:16 casa-CAS-14882-1-py3.12.el8/lib/py/lib/python3.12/turtledemo/nim.py
23-Sep-2026 13:27:16 casa-CAS-14882-1-py3.12.el8/lib/py/lib/python3.12/turtledemo/__init__.py
23-Sep-2026 13:27:16 casa-CAS-14882-1-py3.12.el8/lib/py/lib/python3.12/turtledemo/penrose.py
23-Sep-2026 13:27:16 casa-CAS-14882-1-py3.12.el8/lib/py/lib/python3.12/stat.py
23-Sep-2026 13:27:16 casa-CAS-14882-1-py3.12.el8/lib/py/lib/python3.12/pkgutil.py
23-Sep-2026 13:27:16 casa-CAS-14882-1-py3.12.el8/lib/py/lib/python3.12/dbm/
23-Sep-2026 13:27:16 casa-CAS-14882-1-py3.12.el8/lib/py/lib/python3.12/dbm/ndbm.py
23-Sep-2026 13:27:16 casa-CAS-14882-1-py3.12.el8/lib/py/lib/python3.12/dbm/__pycache__/
23-Sep-2026 13:27:16 casa-CAS-14882-1-py3.12.el8/lib/py/lib/python3.12/dbm/__pycache__/ndbm.cpython-312.opt-1.pyc
23-Sep-2026 13:27:16 casa-CAS-14882-1-py3.12.el8/lib/py/lib/python3.12/dbm/__pycache__/gnu.cpython-312.pyc
23-Sep-2026 13:27:16 casa-CAS-14882-1-py3.12.el8/lib/py/lib/python3.12/dbm/__pycache__/gnu.cpython-312.opt-2.pyc
23-Sep-2026 13:27:16 casa-CAS-14882-1-py3.12.el8/lib/py/lib/python3.12/dbm/__pycache__/ndbm.cpython-312.pyc
23-Sep-2026 13:27:16 casa-CAS-14882-1-py3.12.el8/lib/py/lib/python3.12/dbm/__pycache__/gnu.cpython-312.opt-1.pyc
23-Sep-2026 13:27:16 casa-CAS-14882-1-py3.12.el8/lib/py/lib/python3.12/dbm/__pycache__/__init__.cpython-312.pyc
23-Sep-2026 13:27:16 casa-CAS-14882-1-py3.12.el8/lib/py/lib/python3.12/dbm/__pycache__/__init__.cpython-312.opt-1.pyc
23-Sep-2026 13:27:16 casa-CAS-14882-1-py3.12.el8/lib/py/lib/python3.12/dbm/__pycache__/ndbm.cpython-312.opt-2.pyc
23-Sep-2026 13:27:16 casa-CAS-14882-1-py3.12.el8/lib/py/lib/python3.12/dbm/__pycache__/dumb.cpython-312.pyc
23-Sep-2026 13:27:16 casa-CAS-14882-1-py3.12.el8/lib/py/lib/python3.12/dbm/__pycache__/__init__.cpython-312.opt-2.pyc
23-Sep-2026 13:27:16 casa-CAS-14882-1-py3.12.el8/lib/py/lib/python3.12/dbm/__pycache__/dumb.cpython-312.opt-2.pyc
23-Sep-2026 13:27:16 casa-CAS-14882-1-py3.12.el8/lib/py/lib/python3.12/dbm/__pycache__/dumb.cpython-312.opt-1.pyc
23-Sep-2026 13:27:16 casa-CAS-14882-1-py3.12.el8/lib/py/lib/python3.12/dbm/dumb.py
23-Sep-2026 13:27:16 casa-CAS-14882-1-py3.12.el8/lib/py/lib/python3.12/dbm/__init__.py
23-Sep-2026 13:27:16 casa-CAS-14882-1-py3.12.el8/lib/py/lib/python3.12/dbm/gnu.py
23-Sep-2026 13:27:16 casa-CAS-14882-1-py3.12.el8/lib/py/lib/python3.12/reprlib.py
23-Sep-2026 13:27:16 casa-CAS-14882-1-py3.12.el8/lib/py/lib/python3.12/inspect.py
23-Sep-2026 13:27:16 casa-CAS-14882-1-py3.12.el8/lib/py/lib/libpython3.12.a
23-Sep-2026 13:27:17 casa-CAS-14882-1-py3.12.el8/lib/py/bin/
23-Sep-2026 13:27:17 casa-CAS-14882-1-py3.12.el8/lib/py/bin/pytest
23-Sep-2026 13:27:17 casa-CAS-14882-1-py3.12.el8/lib/py/bin/pyftmerge
23-Sep-2026 13:27:17 casa-CAS-14882-1-py3.12.el8/lib/py/bin/py-root-dir
23-Sep-2026 13:27:17 casa-CAS-14882-1-py3.12.el8/lib/py/bin/volint
23-Sep-2026 13:27:17 casa-CAS-14882-1-py3.12.el8/lib/py/bin/2to3-3.12
23-Sep-2026 13:27:17 casa-CAS-14882-1-py3.12.el8/lib/py/bin/samp_hub
23-Sep-2026 13:27:17 casa-CAS-14882-1-py3.12.el8/lib/py/bin/2to3
23-Sep-2026 13:27:17 casa-CAS-14882-1-py3.12.el8/lib/py/bin/showtable-astropy
23-Sep-2026 13:27:17 casa-CAS-14882-1-py3.12.el8/lib/py/bin/wcslint
23-Sep-2026 13:27:17 casa-CAS-14882-1-py3.12.el8/lib/py/bin/fonttools
23-Sep-2026 13:27:17 casa-CAS-14882-1-py3.12.el8/lib/py/bin/python3.12-config
23-Sep-2026 13:27:17 casa-CAS-14882-1-py3.12.el8/lib/py/bin/pydoc3.12
23-Sep-2026 13:27:17 casa-CAS-14882-1-py3.12.el8/lib/py/bin/showtable
23-Sep-2026 13:27:17 casa-CAS-14882-1-py3.12.el8/lib/py/bin/python3
23-Sep-2026 13:27:17 casa-CAS-14882-1-py3.12.el8/lib/py/bin/fits2bitmap
23-Sep-2026 13:27:17 casa-CAS-14882-1-py3.12.el8/lib/py/bin/pip3.12
23-Sep-2026 13:27:17 casa-CAS-14882-1-py3.12.el8/lib/py/bin/python3-config
23-Sep-2026 13:27:17 casa-CAS-14882-1-py3.12.el8/lib/py/bin/2to3.rej
23-Sep-2026 13:27:17 casa-CAS-14882-1-py3.12.el8/lib/py/bin/fitsheader
23-Sep-2026 13:27:17 casa-CAS-14882-1-py3.12.el8/lib/py/bin/ipython
23-Sep-2026 13:27:17 casa-CAS-14882-1-py3.12.el8/lib/py/bin/idle3
23-Sep-2026 13:27:17 casa-CAS-14882-1-py3.12.el8/lib/py/bin/bokeh
23-Sep-2026 13:27:17 casa-CAS-14882-1-py3.12.el8/lib/py/bin/fitsinfo
23-Sep-2026 13:27:17 casa-CAS-14882-1-py3.12.el8/lib/py/bin/fitsdiff
23-Sep-2026 13:27:17 casa-CAS-14882-1-py3.12.el8/lib/py/bin/pygmentize
23-Sep-2026 13:27:17 casa-CAS-14882-1-py3.12.el8/lib/py/bin/idle3.12
23-Sep-2026 13:27:17 casa-CAS-14882-1-py3.12.el8/lib/py/bin/idle3.rej
23-Sep-2026 13:27:17 casa-CAS-14882-1-py3.12.el8/lib/py/bin/wheel
23-Sep-2026 13:27:17 casa-CAS-14882-1-py3.12.el8/lib/py/bin/fitscheck
23-Sep-2026 13:27:17 casa-CAS-14882-1-py3.12.el8/lib/py/bin/py.test
23-Sep-2026 13:27:17 casa-CAS-14882-1-py3.12.el8/lib/py/bin/ttx
23-Sep-2026 13:27:17 casa-CAS-14882-1-py3.12.el8/lib/py/bin/numpy-config
23-Sep-2026 13:27:17 casa-CAS-14882-1-py3.12.el8/lib/py/bin/python3.12
23-Sep-2026 13:27:17 casa-CAS-14882-1-py3.12.el8/lib/py/bin/websockets
23-Sep-2026 13:27:17 casa-CAS-14882-1-py3.12.el8/lib/py/bin/pydoc3
23-Sep-2026 13:27:17 casa-CAS-14882-1-py3.12.el8/lib/py/bin/f2py
23-Sep-2026 13:27:17 casa-CAS-14882-1-py3.12.el8/lib/py/bin/pyftsubset
23-Sep-2026 13:27:17 casa-CAS-14882-1-py3.12.el8/lib/py/bin/ipython3
23-Sep-2026 13:27:17 casa-CAS-14882-1-py3.12.el8/lib/py/bin/pydoc3.rej
23-Sep-2026 13:27:17 casa-CAS-14882-1-py3.12.el8/lib/py/bin/pip3
23-Sep-2026 13:27:17 casa-CAS-14882-1-py3.12.el8/readme.txt
23-Sep-2026 13:27:17 casa-CAS-14882-1-py3.12.el8/bin/
23-Sep-2026 13:27:17 casa-CAS-14882-1-py3.12.el8/bin/2to3
23-Sep-2026 13:27:17 casa-CAS-14882-1-py3.12.el8/bin/casa
23-Sep-2026 13:27:17 casa-CAS-14882-1-py3.12.el8/bin/python3
23-Sep-2026 13:27:17 casa-CAS-14882-1-py3.12.el8/bin/mpicasa
23-Sep-2026 13:27:17 casa-CAS-14882-1-py3.12.el8/bin/casaviewer
23-Sep-2026 13:27:17 casa-CAS-14882-1-py3.12.el8/bin/pip3
23-Sep-2026 13:27:17 casa-CAS-14882-1-py3.12.el8
23-Sep-2026 13:27:17 casa-CAS-14882-1-py3.12.el8.tar.xz
23-Sep-2026 13:30:19 Switched to a new branch 'CAS-14882'
23-Sep-2026 13:30:19 branch 'CAS-14882' set up to track 'origin/CAS-14882'.
23-Sep-2026 13:30:19 Defaulting to user installation because normal site-packages is not writeable
23-Sep-2026 13:30:20 Collecting unittest-xml-reporting
23-Sep-2026 13:30:20   Downloading unittest_xml_reporting-4.0.0-py2.py3-none-any.whl.metadata (11 kB)
23-Sep-2026 13:30:20 Collecting lxml (from unittest-xml-reporting)
23-Sep-2026 13:30:20   Downloading lxml-6.1.3-cp312-cp312-manylinux_2_26_x86_64.manylinux_2_28_x86_64.whl.metadata (3.3 kB)
23-Sep-2026 13:30:20 Downloading unittest_xml_reporting-4.0.0-py2.py3-none-any.whl (20 kB)
23-Sep-2026 13:30:20 Downloading lxml-6.1.3-cp312-cp312-manylinux_2_26_x86_64.manylinux_2_28_x86_64.whl (5.2 MB)
23-Sep-2026 13:30:20    ━━━━━━━━━━━━━━━━━━━━━━━━━━━━━━━━━━━━━━━━ 5.2/5.2 MB 52.1 MB/s eta 0:00:00
23-Sep-2026 13:30:21 Installing collected packages: lxml, unittest-xml-reporting
23-Sep-2026 13:30:21 Successfully installed lxml-6.1.3 unittest-xml-reporting-4.0.0
23-Sep-2026 13:30:21
23-Sep-2026 13:30:21 [notice] A new release of pip is available: 24.0 -> 26.2.1
23-Sep-2026 13:30:21 [notice] To update, run: pip3 install --upgrade pip
23-Sep-2026 13:30:22 Name: unittest-xml-reporting
23-Sep-2026 13:30:22 Version: 4.0.0
23-Sep-2026 13:30:22 Summary: unittest-based test runner with Ant/JUnit like XML reporting.
23-Sep-2026 13:30:22 Home-page:
23-Sep-2026 13:30:22 Author: Daniel Fernandes Martins, Damien Nozay
23-Sep-2026 13:30:22 Author-email:
23-Sep-2026 13:30:22 License:
23-Sep-2026 13:30:22 Location: /home/casatest/.local/lib/python3.12/site-packages
23-Sep-2026 13:30:22 Requires: lxml
23-Sep-2026 13:30:22 Required-by:
23-Sep-2026 13:30:29 2026-09-23 17:30:30        INFO        ::casa        Using user configuration file /home/casatest/.casa/config.py
23-Sep-2026 13:30:29 2026-09-23 17:30:30        INFO        ::casa        loaded config file : /wheeldirectory/casa-CAS-14882-1-py3.12.el8/lib/py/lib/python3.12/site-packages/casaconfig/config.py
23-Sep-2026 13:30:29 2026-09-23 17:30:30        INFO        ::casa        loaded config file : /home/casatest/.casa/config.py
23-Sep-2026 13:30:29 2026-09-23 17:30:30        INFO        ::casa        
23-Sep-2026 13:30:29 2026-09-23 17:30:30        INFO        ::casa        config values
23-Sep-2026 13:30:29 2026-09-23 17:30:30        INFO        ::casa            agg = False
23-Sep-2026 13:30:29 2026-09-23 17:30:30        INFO        ::casa            cachedir = '/home/casatest/.casa'
23-Sep-2026 13:30:29 2026-09-23 17:30:30        INFO        ::casa            casaconfig_verbose = 1
23-Sep-2026 13:30:29 2026-09-23 17:30:30        INFO        ::casa            colors = 'Neutral'
23-Sep-2026 13:30:29 2026-09-23 17:30:30        INFO        ::casa            data_auto_update = False
23-Sep-2026 13:30:29 2026-09-23 17:30:30        INFO        ::casa            data_update_interval = 1
23-Sep-2026 13:30:29 2026-09-23 17:30:30        INFO        ::casa            datapath = ['/opt/casa/data/master', '/opt/casa/data/casatestdata']
23-Sep-2026 13:30:29 2026-09-23 17:30:30        INFO        ::casa            iplog = False
23-Sep-2026 13:30:29 2026-09-23 17:30:30        INFO        ::casa            iplogfile = '/home/casatest/casa6/casatasks/tests/casashell_tests/work/test_task_getantposalma_casashell/ipython-20260923-173023.log'
23-Sep-2026 13:30:29 2026-09-23 17:30:30        INFO        ::casa            log2term = True
23-Sep-2026 13:30:29 2026-09-23 17:30:30        INFO        ::casa            logfile = '/home/casatest/casa6/casatasks/tests/casashell_tests/work/test_task_getantposalma_casashell/casa-20260923-173023.log'
23-Sep-2026 13:30:29 2026-09-23 17:30:30        INFO        ::casa            measures_auto_update = False
23-Sep-2026 13:30:29 2026-09-23 17:30:30        INFO        ::casa            measures_site = ['https://www.astron.nl/iers/', 'https://go.nrao.edu/iers/']
23-Sep-2026 13:30:29 2026-09-23 17:30:30        INFO        ::casa            measures_site_interval = 2
23-Sep-2026 13:30:29 2026-09-23 17:30:30        INFO        ::casa            measures_update_interval = 1
23-Sep-2026 13:30:29 2026-09-23 17:30:30        INFO        ::casa            measurespath = '/opt/casa/data/master'
23-Sep-2026 13:30:29 2026-09-23 17:30:30        INFO        ::casa            nogui = False
23-Sep-2026 13:30:29 2026-09-23 17:30:30        INFO        ::casa            nologfile = False
23-Sep-2026 13:30:29 2026-09-23 17:30:30        INFO        ::casa            nologger = True
23-Sep-2026 13:30:29 2026-09-23 17:30:30        INFO        ::casa            pipeline = False
23-Sep-2026 13:30:29 2026-09-23 17:30:30        INFO        ::casa            skipnetworkcheck = False
23-Sep-2026 13:30:29 2026-09-23 17:30:30        INFO        ::casa            startupfile = '/home/casatest/.casa/startup.py'
23-Sep-2026 13:30:29 2026-09-23 17:30:30        INFO        ::casa            user_site = False
23-Sep-2026 13:30:29 2026-09-23 17:30:30        INFO        ::casa        
23-Sep-2026 13:30:29 2026-09-23 17:30:30        INFO        ::casa        casarundata version is unknown, this is probably a legacy version not installed by casaconfig
23-Sep-2026 13:30:29 2026-09-23 17:30:30        INFO        ::casa        measures version is unknown, this is probably a legacy version not installed by casaconfig
23-Sep-2026 13:30:29 2026-09-23 17:30:30        INFO        ::casa        
23-Sep-2026 13:30:29 2026-09-23 17:30:30        INFO        ::casa        Checking Measures tables in data repository sub-directory /opt/casa/data/master/geodetic
23-Sep-2026 13:30:29 2026-09-23 17:30:30        INFO        ::casa          IERSeop2000 (version date, last date in table (UTC)): 2026/09/10/15:15, 2026/08/11/00:00:00
23-Sep-2026 13:30:29 2026-09-23 17:30:30        INFO        ::casa          IERSeop97 (version date, last date in table (UTC)): 2026/09/10/15:15, 2026/08/11/00:00:00
23-Sep-2026 13:30:29 2026-09-23 17:30:30        INFO        ::casa          IERSpredict (version date, last date in table (UTC)): 2026/09/22/15:15, 2026/12/21/00:00:00
23-Sep-2026 13:30:29 2026-09-23 17:30:30        INFO        ::casa          TAI_UTC (version date, last date in table (UTC)): 2026/09/03/15:15, 2017/01/01/00:00:00
23-Sep-2026 13:30:29 Traceback (most recent call last):
23-Sep-2026 13:30:29   File "/wheeldirectory/casa-CAS-14882-1-py3.12.el8/lib/py/lib/python3.12/site-packages/casashell/private/init_system.py", line 280, in __evprop__
23-Sep-2026 13:30:29     run_path( args[0], init_globals=exec_globals, run_name='__main__' )
23-Sep-2026 13:30:29   File "<frozen runpy>", line 286, in run_path
23-Sep-2026 13:30:29   File "<frozen runpy>", line 98, in _run_module_code
23-Sep-2026 13:30:29   File "<frozen runpy>", line 88, in _run_code
23-Sep-2026 13:30:29   File "/home/casatest/casa6/casatasks/tests/casashell_tests/test_task_getantposalma_casashell.py", line 35, in <module>
23-Sep-2026 13:30:29     from casashell import getantposalma, casalog
23-Sep-2026 13:30:29 ImportError: cannot import name 'casalog' from 'casashell' (/wheeldirectory/casa-CAS-14882-1-py3.12.el8/lib/py/lib/python3.12/site-packages/casashell/__init__.py)
23-Sep-2026 13:30:29
23-Sep-2026 13:30:29 Using user configuration file /home/casatest/.casa/config.py
23-Sep-2026 13:30:29
23-Sep-2026 13:30:29 No event loop hook running.
23-Sep-2026 13:30:29 Using matplotlib backend: agg
23-Sep-2026 13:30:29 CASA 6.7.7.7a14882.dev1 -- Common Astronomy Software Applications [6.7.7.7a14882.dev1]
23-Sep-2026 13:30:29 CASA exits with a non-zero status : exception: <class 'ImportError'>
23-Sep-2026 13:30:34 2026-09-23 17:30:34        INFO        ::casa        Using user configuration file /home/casatest/.casa/config.py
23-Sep-2026 13:30:34 2026-09-23 17:30:34        INFO        ::casa        loaded config file : /wheeldirectory/casa-CAS-14882-1-py3.12.el8/lib/py/lib/python3.12/site-packages/casaconfig/config.py
23-Sep-2026 13:30:34 2026-09-23 17:30:34        INFO        ::casa        loaded config file : /home/casatest/.casa/config.py
23-Sep-2026 13:30:34 2026-09-23 17:30:34        INFO        ::casa        
23-Sep-2026 13:30:34 2026-09-23 17:30:34        INFO        ::casa        config values
23-Sep-2026 13:30:34 2026-09-23 17:30:34        INFO        ::casa            agg = False
23-Sep-2026 13:30:34 2026-09-23 17:30:34        INFO        ::casa            cachedir = '/home/casatest/.casa'
23-Sep-2026 13:30:34 2026-09-23 17:30:34        INFO        ::casa            casaconfig_verbose = 1
23-Sep-2026 13:30:34 2026-09-23 17:30:34        INFO        ::casa            colors = 'Neutral'
23-Sep-2026 13:30:34 2026-09-23 17:30:34        INFO        ::casa            data_auto_update = False
23-Sep-2026 13:30:34 2026-09-23 17:30:34        INFO        ::casa            data_update_interval = 1
23-Sep-2026 13:30:34 2026-09-23 17:30:34        INFO        ::casa            datapath = ['/opt/casa/data/master', '/opt/casa/data/casatestdata']
23-Sep-2026 13:30:34 2026-09-23 17:30:34        INFO        ::casa            iplog = False
23-Sep-2026 13:30:34 2026-09-23 17:30:34        INFO        ::casa            iplogfile = '/home/casatest/casa6/casatasks/tests/casashell_tests/work/test_task_getcalmodvla_casashell/ipython-20260923-173030.log'
23-Sep-2026 13:30:34 2026-09-23 17:30:34        INFO        ::casa            log2term = True
23-Sep-2026 13:30:34 2026-09-23 17:30:34        INFO        ::casa            logfile = '/home/casatest/casa6/casatasks/tests/casashell_tests/work/test_task_getcalmodvla_casashell/casa-20260923-173030.log'
23-Sep-2026 13:30:34 2026-09-23 17:30:34        INFO        ::casa            measures_auto_update = False
23-Sep-2026 13:30:34 2026-09-23 17:30:34        INFO        ::casa            measures_site = ['https://www.astron.nl/iers/', 'https://go.nrao.edu/iers/']
23-Sep-2026 13:30:34 2026-09-23 17:30:34        INFO        ::casa            measures_site_interval = 2
23-Sep-2026 13:30:34 2026-09-23 17:30:34        INFO        ::casa            measures_update_interval = 1
23-Sep-2026 13:30:34 2026-09-23 17:30:34        INFO        ::casa            measurespath = '/opt/casa/data/master'
23-Sep-2026 13:30:34 2026-09-23 17:30:34        INFO        ::casa            nogui = False
23-Sep-2026 13:30:34 2026-09-23 17:30:34        INFO        ::casa            nologfile = False
23-Sep-2026 13:30:34 2026-09-23 17:30:34        INFO        ::casa            nologger = True
23-Sep-2026 13:30:34 2026-09-23 17:30:34        INFO        ::casa            pipeline = False
23-Sep-2026 13:30:34 2026-09-23 17:30:34        INFO        ::casa            skipnetworkcheck = False
23-Sep-2026 13:30:34 2026-09-23 17:30:34        INFO        ::casa            startupfile = '/home/casatest/.casa/startup.py'
23-Sep-2026 13:30:34 2026-09-23 17:30:34        INFO        ::casa            user_site = False
23-Sep-2026 13:30:34 2026-09-23 17:30:34        INFO        ::casa        
23-Sep-2026 13:30:34 2026-09-23 17:30:34        INFO        ::casa        casarundata version is unknown, this is probably a legacy version not installed by casaconfig
23-Sep-2026 13:30:34 2026-09-23 17:30:34        INFO        ::casa        measures version is unknown, this is probably a legacy version not installed by casaconfig
23-Sep-2026 13:30:34 2026-09-23 17:30:34        INFO        ::casa        
23-Sep-2026 13:30:34 2026-09-23 17:30:34        INFO        ::casa        Checking Measures tables in data repository sub-directory /opt/casa/data/master/geodetic
23-Sep-2026 13:30:34 2026-09-23 17:30:34        INFO        ::casa          IERSeop2000 (version date, last date in table (UTC)): 2026/09/10/15:15, 2026/08/11/00:00:00
23-Sep-2026 13:30:34 2026-09-23 17:30:34        INFO        ::casa          IERSeop97 (version date, last date in table (UTC)): 2026/09/10/15:15, 2026/08/11/00:00:00
23-Sep-2026 13:30:34 2026-09-23 17:30:34        INFO        ::casa          IERSpredict (version date, last date in table (UTC)): 2026/09/22/15:15, 2026/12/21/00:00:00
23-Sep-2026 13:30:34 2026-09-23 17:30:34        INFO        ::casa          TAI_UTC (version date, last date in table (UTC)): 2026/09/03/15:15, 2017/01/01/00:00:00
23-Sep-2026 13:30:34 Traceback (most recent call last):
23-Sep-2026 13:30:34   File "/wheeldirectory/casa-CAS-14882-1-py3.12.el8/lib/py/lib/python3.12/site-packages/casashell/private/init_system.py", line 280, in __evprop__
23-Sep-2026 13:30:34     run_path( args[0], init_globals=exec_globals, run_name='__main__' )
23-Sep-2026 13:30:34   File "<frozen runpy>", line 286, in run_path
23-Sep-2026 13:30:34   File "<frozen runpy>", line 98, in _run_module_code
23-Sep-2026 13:30:34   File "<frozen runpy>", line 88, in _run_code
23-Sep-2026 13:30:34   File "/home/casatest/casa6/casatasks/tests/casashell_tests/test_task_getcalmodvla_casashell.py", line 38, in <module>
23-Sep-2026 13:30:34     from casashell import casalog
23-Sep-2026 13:30:34 ImportError: cannot import name 'casalog' from 'casashell' (/wheeldirectory/casa-CAS-14882-1-py3.12.el8/lib/py/lib/python3.12/site-packages/casashell/__init__.py)
23-Sep-2026 13:30:34
23-Sep-2026 13:30:34 Using user configuration file /home/casatest/.casa/config.py
23-Sep-2026 13:30:34
23-Sep-2026 13:30:34 No event loop hook running.
23-Sep-2026 13:30:34 Using matplotlib backend: agg
23-Sep-2026 13:30:34 CASA 6.7.7.7a14882.dev1 -- Common Astronomy Software Applications [6.7.7.7a14882.dev1]
23-Sep-2026 13:30:34 CASA exits with a non-zero status : exception: <class 'ImportError'>
23-Sep-2026 13:30:39 2026-09-23 17:30:39        INFO        ::casa        Using user configuration file /home/casatest/.casa/config.py
23-Sep-2026 13:30:39 2026-09-23 17:30:39        INFO        ::casa        loaded config file : /wheeldirectory/casa-CAS-14882-1-py3.12.el8/lib/py/lib/python3.12/site-packages/casaconfig/config.py
23-Sep-2026 13:30:39 2026-09-23 17:30:39        INFO        ::casa        loaded config file : /home/casatest/.casa/config.py
23-Sep-2026 13:30:39 2026-09-23 17:30:39        INFO        ::casa        
23-Sep-2026 13:30:39 2026-09-23 17:30:39        INFO        ::casa        config values
23-Sep-2026 13:30:39 2026-09-23 17:30:39        INFO        ::casa            agg = False
23-Sep-2026 13:30:39 2026-09-23 17:30:39        INFO        ::casa            cachedir = '/home/casatest/.casa'
23-Sep-2026 13:30:39 2026-09-23 17:30:39        INFO        ::casa            casaconfig_verbose = 1
23-Sep-2026 13:30:39 2026-09-23 17:30:39        INFO        ::casa            colors = 'Neutral'
23-Sep-2026 13:30:39 2026-09-23 17:30:39        INFO        ::casa            data_auto_update = False
23-Sep-2026 13:30:39 2026-09-23 17:30:39        INFO        ::casa            data_update_interval = 1
23-Sep-2026 13:30:39 2026-09-23 17:30:39        INFO        ::casa            datapath = ['/opt/casa/data/master', '/opt/casa/data/casatestdata']
23-Sep-2026 13:30:39 2026-09-23 17:30:39        INFO        ::casa            iplog = False
23-Sep-2026 13:30:39 2026-09-23 17:30:39        INFO        ::casa            iplogfile = '/home/casatest/casa6/casatasks/tests/casashell_tests/work/test_task_getephemtable_casashell/ipython-20260923-173035.log'
23-Sep-2026 13:30:39 2026-09-23 17:30:39        INFO        ::casa            log2term = True
23-Sep-2026 13:30:39 2026-09-23 17:30:39        INFO        ::casa            logfile = '/home/casatest/casa6/casatasks/tests/casashell_tests/work/test_task_getephemtable_casashell/casa-20260923-173035.log'
23-Sep-2026 13:30:39 2026-09-23 17:30:39        INFO        ::casa            measures_auto_update = False
23-Sep-2026 13:30:39 2026-09-23 17:30:39        INFO        ::casa            measures_site = ['https://www.astron.nl/iers/', 'https://go.nrao.edu/iers/']
23-Sep-2026 13:30:39 2026-09-23 17:30:39        INFO        ::casa            measures_site_interval = 2
23-Sep-2026 13:30:39 2026-09-23 17:30:39        INFO        ::casa            measures_update_interval = 1
23-Sep-2026 13:30:39 2026-09-23 17:30:39        INFO        ::casa            measurespath = '/opt/casa/data/master'
23-Sep-2026 13:30:39 2026-09-23 17:30:39        INFO        ::casa            nogui = False
23-Sep-2026 13:30:39 2026-09-23 17:30:39        INFO        ::casa            nologfile = False
23-Sep-2026 13:30:39 2026-09-23 17:30:39        INFO        ::casa            nologger = True
23-Sep-2026 13:30:39 2026-09-23 17:30:39        INFO        ::casa            pipeline = False
23-Sep-2026 13:30:39 2026-09-23 17:30:39        INFO        ::casa            skipnetworkcheck = False
23-Sep-2026 13:30:39 2026-09-23 17:30:39        INFO        ::casa            startupfile = '/home/casatest/.casa/startup.py'
23-Sep-2026 13:30:39 2026-09-23 17:30:39        INFO        ::casa            user_site = False
23-Sep-2026 13:30:39 2026-09-23 17:30:39        INFO        ::casa        
23-Sep-2026 13:30:39 2026-09-23 17:30:39        INFO        ::casa        casarundata version is unknown, this is probably a legacy version not installed by casaconfig
23-Sep-2026 13:30:39 2026-09-23 17:30:39        INFO        ::casa        measures version is unknown, this is probably a legacy version not installed by casaconfig
23-Sep-2026 13:30:39 2026-09-23 17:30:39        INFO        ::casa        
23-Sep-2026 13:30:39 2026-09-23 17:30:39        INFO        ::casa        Checking Measures tables in data repository sub-directory /opt/casa/data/master/geodetic
23-Sep-2026 13:30:39 2026-09-23 17:30:39        INFO        ::casa          IERSeop2000 (version date, last date in table (UTC)): 2026/09/10/15:15, 2026/08/11/00:00:00
23-Sep-2026 13:30:39 2026-09-23 17:30:39        INFO        ::casa          IERSeop97 (version date, last date in table (UTC)): 2026/09/10/15:15, 2026/08/11/00:00:00
23-Sep-2026 13:30:39 2026-09-23 17:30:39        INFO        ::casa          IERSpredict (version date, last date in table (UTC)): 2026/09/22/15:15, 2026/12/21/00:00:00
23-Sep-2026 13:30:39 2026-09-23 17:30:39        INFO        ::casa          TAI_UTC (version date, last date in table (UTC)): 2026/09/03/15:15, 2017/01/01/00:00:00
23-Sep-2026 13:30:39 Traceback (most recent call last):
23-Sep-2026 13:30:39   File "/wheeldirectory/casa-CAS-14882-1-py3.12.el8/lib/py/lib/python3.12/site-packages/casashell/private/init_system.py", line 280, in __evprop__
23-Sep-2026 13:30:39     run_path( args[0], init_globals=exec_globals, run_name='__main__' )
23-Sep-2026 13:30:39   File "<frozen runpy>", line 286, in run_path
23-Sep-2026 13:30:39   File "<frozen runpy>", line 98, in _run_module_code
23-Sep-2026 13:30:39   File "<frozen runpy>", line 88, in _run_code
23-Sep-2026 13:30:39   File "/home/casatest/casa6/casatasks/tests/casashell_tests/test_task_getephemtable_casashell.py", line 37, in <module>
23-Sep-2026 13:30:39     from casashell.private import jplhorizons_query
23-Sep-2026 13:30:39 ImportError: cannot import name 'jplhorizons_query' from 'casashell.private' (unknown location)
23-Sep-2026 13:30:39
23-Sep-2026 13:30:39 Using user configuration file /home/casatest/.casa/config.py
23-Sep-2026 13:30:39
23-Sep-2026 13:30:39 No event loop hook running.
23-Sep-2026 13:30:39 Using matplotlib backend: agg
23-Sep-2026 13:30:39 CASA 6.7.7.7a14882.dev1 -- Common Astronomy Software Applications [6.7.7.7a14882.dev1]
23-Sep-2026 13:30:39 CASA exits with a non-zero status : exception: <class 'ImportError'>
23-Sep-2026 13:30:43 2026-09-23 17:30:44        INFO        ::casa        Using user configuration file /home/casatest/.casa/config.py
23-Sep-2026 13:30:43 2026-09-23 17:30:44        INFO        ::casa        loaded config file : /wheeldirectory/casa-CAS-14882-1-py3.12.el8/lib/py/lib/python3.12/site-packages/casaconfig/config.py
23-Sep-2026 13:30:43 2026-09-23 17:30:44        INFO        ::casa        loaded config file : /home/casatest/.casa/config.py
23-Sep-2026 13:30:43 2026-09-23 17:30:44        INFO        ::casa        
23-Sep-2026 13:30:43 2026-09-23 17:30:44        INFO        ::casa        config values
23-Sep-2026 13:30:43 2026-09-23 17:30:44        INFO        ::casa            agg = False
23-Sep-2026 13:30:43 2026-09-23 17:30:44        INFO        ::casa            cachedir = '/home/casatest/.casa'
23-Sep-2026 13:30:43 2026-09-23 17:30:44        INFO        ::casa            casaconfig_verbose = 1
23-Sep-2026 13:30:43 2026-09-23 17:30:44        INFO        ::casa            colors = 'Neutral'
23-Sep-2026 13:30:43 2026-09-23 17:30:44        INFO        ::casa            data_auto_update = False
23-Sep-2026 13:30:43 2026-09-23 17:30:44        INFO        ::casa            data_update_interval = 1
23-Sep-2026 13:30:43 2026-09-23 17:30:44        INFO        ::casa            datapath = ['/opt/casa/data/master', '/opt/casa/data/casatestdata']
23-Sep-2026 13:30:43 2026-09-23 17:30:44        INFO        ::casa            iplog = False
23-Sep-2026 13:30:43 2026-09-23 17:30:44        INFO        ::casa            iplogfile = '/home/casatest/casa6/casatasks/tests/casashell_tests/work/test_task_getjyperkalma_casashell/ipython-20260923-173040.log'
23-Sep-2026 13:30:43 2026-09-23 17:30:44        INFO        ::casa            log2term = True
23-Sep-2026 13:30:43 2026-09-23 17:30:44        INFO        ::casa            logfile = '/home/casatest/casa6/casatasks/tests/casashell_tests/work/test_task_getjyperkalma_casashell/casa-20260923-173040.log'
23-Sep-2026 13:30:43 2026-09-23 17:30:44        INFO        ::casa            measures_auto_update = False
23-Sep-2026 13:30:43 2026-09-23 17:30:44        INFO        ::casa            measures_site = ['https://www.astron.nl/iers/', 'https://go.nrao.edu/iers/']
23-Sep-2026 13:30:43 2026-09-23 17:30:44        INFO        ::casa            measures_site_interval = 2
23-Sep-2026 13:30:43 2026-09-23 17:30:44        INFO        ::casa            measures_update_interval = 1
23-Sep-2026 13:30:43 2026-09-23 17:30:44        INFO        ::casa            measurespath = '/opt/casa/data/master'
23-Sep-2026 13:30:43 2026-09-23 17:30:44        INFO        ::casa            nogui = False
23-Sep-2026 13:30:43 2026-09-23 17:30:44        INFO        ::casa            nologfile = False
23-Sep-2026 13:30:43 2026-09-23 17:30:44        INFO        ::casa            nologger = True
23-Sep-2026 13:30:43 2026-09-23 17:30:44        INFO        ::casa            pipeline = False
23-Sep-2026 13:30:43 2026-09-23 17:30:44        INFO        ::casa            skipnetworkcheck = False
23-Sep-2026 13:30:43 2026-09-23 17:30:44        INFO        ::casa            startupfile = '/home/casatest/.casa/startup.py'
23-Sep-2026 13:30:43 2026-09-23 17:30:44        INFO        ::casa            user_site = False
23-Sep-2026 13:30:43 2026-09-23 17:30:44        INFO        ::casa        
23-Sep-2026 13:30:43 2026-09-23 17:30:44        INFO        ::casa        casarundata version is unknown, this is probably a legacy version not installed by casaconfig
23-Sep-2026 13:30:43 2026-09-23 17:30:44        INFO        ::casa        measures version is unknown, this is probably a legacy version not installed by casaconfig
23-Sep-2026 13:30:43 2026-09-23 17:30:44        INFO        ::casa        
23-Sep-2026 13:30:43 2026-09-23 17:30:44        INFO        ::casa        Checking Measures tables in data repository sub-directory /opt/casa/data/master/geodetic
23-Sep-2026 13:30:43 2026-09-23 17:30:44        INFO        ::casa          IERSeop2000 (version date, last date in table (UTC)): 2026/09/10/15:15, 2026/08/11/00:00:00
23-Sep-2026 13:30:43 2026-09-23 17:30:44        INFO        ::casa          IERSeop97 (version date, last date in table (UTC)): 2026/09/10/15:15, 2026/08/11/00:00:00
23-Sep-2026 13:30:43 2026-09-23 17:30:44        INFO        ::casa          IERSpredict (version date, last date in table (UTC)): 2026/09/22/15:15, 2026/12/21/00:00:00
23-Sep-2026 13:30:43 2026-09-23 17:30:44        INFO        ::casa          TAI_UTC (version date, last date in table (UTC)): 2026/09/03/15:15, 2017/01/01/00:00:00
23-Sep-2026 13:30:43
23-Sep-2026 13:30:43 Running tests...
23-Sep-2026 13:30:43 ----------------------------------------------------------------------
23-Sep-2026 13:30:44
23-Sep-2026 13:30:44 Using user configuration file /home/casatest/.casa/config.py
23-Sep-2026 13:30:44
23-Sep-2026 13:30:44 No event loop hook running.
23-Sep-2026 13:30:44 Using matplotlib backend: agg
23-Sep-2026 13:30:44 CASA 6.7.7.7a14882.dev1 -- Common Astronomy Software Applications [6.7.7.7a14882.dev1]
23-Sep-2026 13:30:44 EEE2026-09-23 17:30:44        INFO        getjyperkalma::::casa        ##########################################
23-Sep-2026 13:30:44 2026-09-23 17:30:44        INFO        getjyperkalma::::casa        ##### Begin Task: getjyperkalma      #####
23-Sep-2026 13:30:44 2026-09-23 17:30:44        INFO        getjyperkalma::::casa        getjyperkalma( vis='uid___A002_X85c183_X36f.ms', caltable='jyperk_5b58fe7c-4c74-473d-93f6-c48247f21a34.cal', infile='', endpoint='bad', timeout=180, retry=3, retry_wait_time=5, spw='', pol='', backup_hosts=[] )
23-Sep-2026 13:30:44 2026-09-23 17:30:44        SEVERE        getjyperkalma::::casa        Exception Reported: Error in getjyperkalma: endpoint must be 'asdm', 'interpolation', or 'model-fit'
23-Sep-2026 13:30:44 2026-09-23 17:30:44        INFO        getjyperkalma::::casa        Traceback (most recent call last):
23-Sep-2026 13:30:44 2026-09-23 17:30:44        INFO        getjyperkalma::::casa+          File "/wheeldirectory/casa-CAS-14882-1-py3.12.el8/lib/py/lib/python3.12/site-packages/casashell/private/getjyperkalma.py", line 514, in __call__
23-Sep-2026 13:30:44 2026-09-23 17:30:44        INFO        getjyperkalma::::casa+            task_result = _getjyperkalma_t( _pc.document['vis'],_pc.document['caltable'],_pc.document['infile'],_pc.document['endpoint'],_pc.document['timeout'],_pc.document['retry'],_pc.document['retry_wait_time'],_pc.document['spw'],_pc.document['pol'],_pc.document['backup_hosts'] )
23-Sep-2026 13:30:44 2026-09-23 17:30:44        INFO        getjyperkalma::::casa+                          ^^^^^^^^^^^^^^^^^^^^^^^^^^^^^^^^^^^^^^^^^^^^^^^^^^^^^^^^^^^^^^^^^^^^^^^^^^^^^^^^^^^^^^^^^^^^^^^^^^^^^^^^^^^^^^^^^^^^^^^^^^^^^^^^^^^^^^^^^^^^^^^^^^^^^^^^^^^^^^^^^^^^^^^^^^^^^^^^^^^^^^^^^^^^^^^^^^^^^^^^^^^^^^^^^^^^^^^^^^^^^^^^^^^^^^^^^^^^^^^^^^^^^^^^^^^^^^^^^^^
23-Sep-2026 13:30:44 2026-09-23 17:30:44        INFO        getjyperkalma::::casa+          File "/wheeldirectory/casa-CAS-14882-1-py3.12.el8/lib/py/lib/python3.12/site-packages/casatasks/private/task_getjyperkalma.py", line 50, in getjyperkalma
23-Sep-2026 13:30:44 2026-09-23 17:30:44        INFO        getjyperkalma::::casa+            raise ValueError("endpoint must be 'asdm', 'interpolation', or 'model-fit'")
23-Sep-2026 13:30:44 2026-09-23 17:30:44        INFO        getjyperkalma::::casa+        ValueError: endpoint must be 'asdm', 'interpolation', or 'model-fit'
23-Sep-2026 13:30:44 2026-09-23 17:30:44        INFO        getjyperkalma::::casa        Task getjyperkalma complete. Start time: 2026-09-23 17:30:44.096966 End time: 2026-09-23 17:30:44.098709
23-Sep-2026 13:30:44 2026-09-23 17:30:44        INFO        getjyperkalma::::casa        ##### End Task: getjyperkalma        #####
23-Sep-2026 13:30:44 2026-09-23 17:30:44        INFO        getjyperkalma::::casa        ##########################################
23-Sep-2026 13:30:44 .EEE2026-09-23 17:30:44        SEVERE        getjyperkalma::::casa        Exception Reported: Error in getjyperkalma: the vis parameter must be a path that exists ('no_such.ms' does not exist)
23-Sep-2026 13:30:44 2026-09-23 17:30:44        INFO        getjyperkalma::::casa        Traceback (most recent call last):
23-Sep-2026 13:30:44 2026-09-23 17:30:44        INFO        getjyperkalma::::casa+          File "/wheeldirectory/casa-CAS-14882-1-py3.12.el8/lib/py/lib/python3.12/site-packages/casashell/private/getjyperkalma.py", line 512, in __call__
23-Sep-2026 13:30:44 2026-09-23 17:30:44        INFO        getjyperkalma::::casa+            assert _pc.validate(_invocation_parameters,self.__schema), create_error_string(_pc.errors)
23-Sep-2026 13:30:44 2026-09-23 17:30:44        INFO        getjyperkalma::::casa+                   ^^^^^^^^^^^^^^^^^^^^^^^^^^^^^^^^^^^^^^^^^^^^^^^^^^
23-Sep-2026 13:30:44 2026-09-23 17:30:44        INFO        getjyperkalma::::casa+        AssertionError: the vis parameter must be a path that exists ('no_such.ms' does not exist)
23-Sep-2026 13:30:44 .2026-09-23 17:30:44        INFO        getjyperkalma::::casa        ##########################################
23-Sep-2026 13:30:44 2026-09-23 17:30:44        INFO        getjyperkalma::::casa        ##### Begin Task: getjyperkalma      #####
23-Sep-2026 13:30:44 2026-09-23 17:30:44        INFO        getjyperkalma::::casa        getjyperkalma( vis='non-existent-observation.ms', caltable='jyperk_f026f3d6-48ed-45eb-9af0-2f69eb286a9f.cal', infile='/opt/casa/data/casatestdata//unittest/gencal/jyperk_factor.csv', endpoint='asdm', timeout=180, retry=3, retry_wait_time=5, spw='', pol='', backup_hosts=[] )
23-Sep-2026 13:30:44 2026-09-23 17:30:44        INFO        calibrater::open        ****Using NEW VI2-driven calibrater tool****
23-Sep-2026 13:30:44 2026-09-23 17:30:44        INFO        calibrater::open        Opening MS: non-existent-observation.ms for calibration.
23-Sep-2026 13:30:44 2026-09-23 17:30:44        INFO        Calibrater::        Initializing nominal selection to the whole MS.
23-Sep-2026 13:30:44 2026-09-23 17:30:44        INFO        getjyperkalma::::casa        JYPERKDB_URL is not set.
23-Sep-2026 13:30:44 2026-09-23 17:30:44        INFO        getjyperkalma::::casa        Reading Jy/K factors from file: /opt/casa/data/casatestdata//unittest/gencal/jyperk_factor.csv
23-Sep-2026 13:30:44 2026-09-23 17:30:44        SEVERE        getjyperkalma::::casa        Exception Reported: Error in getjyperkalma: No valid Jy/K factors found for this MS
23-Sep-2026 13:30:44 2026-09-23 17:30:44        INFO        getjyperkalma::::casa        Traceback (most recent call last):
23-Sep-2026 13:30:44 2026-09-23 17:30:44        INFO        getjyperkalma::::casa+          File "/wheeldirectory/casa-CAS-14882-1-py3.12.el8/lib/py/lib/python3.12/site-packages/casashell/private/getjyperkalma.py", line 514, in __call__
23-Sep-2026 13:30:44 2026-09-23 17:30:44        INFO        getjyperkalma::::casa+            task_result = _getjyperkalma_t( _pc.document['vis'],_pc.document['caltable'],_pc.document['infile'],_pc.document['endpoint'],_pc.document['timeout'],_pc.document['retry'],_pc.document['retry_wait_time'],_pc.document['spw'],_pc.document['pol'],_pc.document['backup_hosts'] )
23-Sep-2026 13:30:44 2026-09-23 17:30:44        INFO        getjyperkalma::::casa+                          ^^^^^^^^^^^^^^^^^^^^^^^^^^^^^^^^^^^^^^^^^^^^^^^^^^^^^^^^^^^^^^^^^^^^^^^^^^^^^^^^^^^^^^^^^^^^^^^^^^^^^^^^^^^^^^^^^^^^^^^^^^^^^^^^^^^^^^^^^^^^^^^^^^^^^^^^^^^^^^^^^^^^^^^^^^^^^^^^^^^^^^^^^^^^^^^^^^^^^^^^^^^^^^^^^^^^^^^^^^^^^^^^^^^^^^^^^^^^^^^^^^^^^^^^^^^^^^^^^^^
23-Sep-2026 13:30:44 2026-09-23 17:30:44        INFO        getjyperkalma::::casa+          File "/wheeldirectory/casa-CAS-14882-1-py3.12.el8/lib/py/lib/python3.12/site-packages/casatasks/private/task_getjyperkalma.py", line 66, in getjyperkalma
23-Sep-2026 13:30:44 2026-09-23 17:30:44        INFO        getjyperkalma::::casa+            for selection, param in specifycal_input_list:
23-Sep-2026 13:30:44 2026-09-23 17:30:44        INFO        getjyperkalma::::casa+          File "/wheeldirectory/casa-CAS-14882-1-py3.12.el8/lib/py/lib/python3.12/site-packages/casatasks/private/task_getjyperkalma.py", line 104, in _gen_specifycal_input
23-Sep-2026 13:30:44 2026-09-23 17:30:44        INFO        getjyperkalma::::casa+            raise RuntimeError("No valid Jy/K factors found for this MS")
23-Sep-2026 13:30:44 2026-09-23 17:30:44        INFO        getjyperkalma::::casa+        RuntimeError: No valid Jy/K factors found for this MS
23-Sep-2026 13:30:44 2026-09-23 17:30:44        INFO        getjyperkalma::::casa        Task getjyperkalma complete. Start time: 2026-09-23 17:30:44.110042 End time: 2026-09-23 17:30:44.124973
23-Sep-2026 13:30:44 2026-09-23 17:30:44        INFO        getjyperkalma::::casa        ##### End Task: getjyperkalma        #####
23-Sep-2026 13:30:44 2026-09-23 17:30:44        INFO        getjyperkalma::::casa        ##########################################
23-Sep-2026 13:30:44 .
23-Sep-2026 13:30:44 ======================================================================
23-Sep-2026 13:30:44 ERROR [0.006s]: test_getjyperkalma_all_failed (__main__.TestGetJyPerKALMA.test_getjyperkalma_all_failed)
23-Sep-2026 13:30:44 Test to check all failed situation.
23-Sep-2026 13:30:44 ----------------------------------------------------------------------
23-Sep-2026 13:30:44 Traceback (most recent call last):
23-Sep-2026 13:30:44   File "/wheeldirectory/casa-CAS-14882-1-py3.12.el8/lib/py/lib/python3.12/unittest/mock.py", line 1843, in _inner
23-Sep-2026 13:30:44     return f(*args, **kw)
23-Sep-2026 13:30:44            ^^^^^^^^^^^^^^
23-Sep-2026 13:30:44   File "/wheeldirectory/casa-CAS-14882-1-py3.12.el8/lib/py/lib/python3.12/unittest/mock.py", line 1387, in patched
23-Sep-2026 13:30:44     with self.decoration_helper(patched,
23-Sep-2026 13:30:44   File "/wheeldirectory/casa-CAS-14882-1-py3.12.el8/lib/py/lib/python3.12/contextlib.py", line 137, in __enter__
23-Sep-2026 13:30:44     return next(self.gen)
23-Sep-2026 13:30:44            ^^^^^^^^^^^^^^
23-Sep-2026 13:30:44   File "/wheeldirectory/casa-CAS-14882-1-py3.12.el8/lib/py/lib/python3.12/unittest/mock.py", line 1369, in decoration_helper
23-Sep-2026 13:30:44     arg = exit_stack.enter_context(patching)
23-Sep-2026 13:30:44           ^^^^^^^^^^^^^^^^^^^^^^^^^^^^^^^^^^
23-Sep-2026 13:30:44   File "/wheeldirectory/casa-CAS-14882-1-py3.12.el8/lib/py/lib/python3.12/contextlib.py", line 526, in enter_context
23-Sep-2026 13:30:44     result = _enter(cm)
23-Sep-2026 13:30:44              ^^^^^^^^^^
23-Sep-2026 13:30:44   File "/wheeldirectory/casa-CAS-14882-1-py3.12.el8/lib/py/lib/python3.12/unittest/mock.py", line 1442, in __enter__
23-Sep-2026 13:30:44     self.target = self.getter()
23-Sep-2026 13:30:44                   ^^^^^^^^^^^^^
23-Sep-2026 13:30:44   File "/wheeldirectory/casa-CAS-14882-1-py3.12.el8/lib/py/lib/python3.12/pkgutil.py", line 528, in resolve_name
23-Sep-2026 13:30:44     result = getattr(result, p)
23-Sep-2026 13:30:44              ^^^^^^^^^^^^^^^^^^
23-Sep-2026 13:30:44 AttributeError: module 'casashell.private' has no attribute 'jyperk'
23-Sep-2026 13:30:44
23-Sep-2026 13:30:44 ======================================================================
23-Sep-2026 13:30:44 ERROR [0.003s]: test_getjyperkalma_env_var_NG_backup2_success (__main__.TestGetJyPerKALMA.test_getjyperkalma_env_var_NG_backup2_success)
23-Sep-2026 13:30:44 Test JYPERKDB_URL failed, first backup host failed, second succeeded.
23-Sep-2026 13:30:44 ----------------------------------------------------------------------
23-Sep-2026 13:30:44 Traceback (most recent call last):
23-Sep-2026 13:30:44   File "/wheeldirectory/casa-CAS-14882-1-py3.12.el8/lib/py/lib/python3.12/unittest/mock.py", line 1843, in _inner
23-Sep-2026 13:30:44     return f(*args, **kw)
23-Sep-2026 13:30:44            ^^^^^^^^^^^^^^
23-Sep-2026 13:30:44   File "/wheeldirectory/casa-CAS-14882-1-py3.12.el8/lib/py/lib/python3.12/unittest/mock.py", line 1387, in patched
23-Sep-2026 13:30:44     with self.decoration_helper(patched,
23-Sep-2026 13:30:44   File "/wheeldirectory/casa-CAS-14882-1-py3.12.el8/lib/py/lib/python3.12/contextlib.py", line 137, in __enter__
23-Sep-2026 13:30:44     return next(self.gen)
23-Sep-2026 13:30:44            ^^^^^^^^^^^^^^
23-Sep-2026 13:30:44   File "/wheeldirectory/casa-CAS-14882-1-py3.12.el8/lib/py/lib/python3.12/unittest/mock.py", line 1369, in decoration_helper
23-Sep-2026 13:30:44     arg = exit_stack.enter_context(patching)
23-Sep-2026 13:30:44           ^^^^^^^^^^^^^^^^^^^^^^^^^^^^^^^^^^
23-Sep-2026 13:30:44   File "/wheeldirectory/casa-CAS-14882-1-py3.12.el8/lib/py/lib/python3.12/contextlib.py", line 526, in enter_context
23-Sep-2026 13:30:44     result = _enter(cm)
23-Sep-2026 13:30:44              ^^^^^^^^^^
23-Sep-2026 13:30:44   File "/wheeldirectory/casa-CAS-14882-1-py3.12.el8/lib/py/lib/python3.12/unittest/mock.py", line 1442, in __enter__
23-Sep-2026 13:30:44     self.target = self.getter()
23-Sep-2026 13:30:44                   ^^^^^^^^^^^^^
23-Sep-2026 13:30:44   File "/wheeldirectory/casa-CAS-14882-1-py3.12.el8/lib/py/lib/python3.12/pkgutil.py", line 528, in resolve_name
23-Sep-2026 13:30:44     result = getattr(result, p)
23-Sep-2026 13:30:44              ^^^^^^^^^^^^^^^^^^
23-Sep-2026 13:30:44 AttributeError: module 'casashell.private' has no attribute 'jyperk'
23-Sep-2026 13:30:44
23-Sep-2026 13:30:44 ======================================================================
23-Sep-2026 13:30:44 ERROR [0.003s]: test_getjyperkalma_env_var_NG_backup_called (__main__.TestGetJyPerKALMA.test_getjyperkalma_env_var_NG_backup_called)
23-Sep-2026 13:30:44 JYPERKDB_URL fails, proceed with backup host.
23-Sep-2026 13:30:44 ----------------------------------------------------------------------
23-Sep-2026 13:30:44 Traceback (most recent call last):
23-Sep-2026 13:30:44   File "/wheeldirectory/casa-CAS-14882-1-py3.12.el8/lib/py/lib/python3.12/unittest/mock.py", line 1843, in _inner
23-Sep-2026 13:30:44     return f(*args, **kw)
23-Sep-2026 13:30:44            ^^^^^^^^^^^^^^
23-Sep-2026 13:30:44   File "/wheeldirectory/casa-CAS-14882-1-py3.12.el8/lib/py/lib/python3.12/unittest/mock.py", line 1387, in patched
23-Sep-2026 13:30:44     with self.decoration_helper(patched,
23-Sep-2026 13:30:44   File "/wheeldirectory/casa-CAS-14882-1-py3.12.el8/lib/py/lib/python3.12/contextlib.py", line 137, in __enter__
23-Sep-2026 13:30:44     return next(self.gen)
23-Sep-2026 13:30:44            ^^^^^^^^^^^^^^
23-Sep-2026 13:30:44   File "/wheeldirectory/casa-CAS-14882-1-py3.12.el8/lib/py/lib/python3.12/unittest/mock.py", line 1369, in decoration_helper
23-Sep-2026 13:30:44     arg = exit_stack.enter_context(patching)
23-Sep-2026 13:30:44           ^^^^^^^^^^^^^^^^^^^^^^^^^^^^^^^^^^
23-Sep-2026 13:30:44   File "/wheeldirectory/casa-CAS-14882-1-py3.12.el8/lib/py/lib/python3.12/contextlib.py", line 526, in enter_context
23-Sep-2026 13:30:44     result = _enter(cm)
23-Sep-2026 13:30:44              ^^^^^^^^^^
23-Sep-2026 13:30:44   File "/wheeldirectory/casa-CAS-14882-1-py3.12.el8/lib/py/lib/python3.12/unittest/mock.py", line 1442, in __enter__
23-Sep-2026 13:30:44     self.target = self.getter()
23-Sep-2026 13:30:44                   ^^^^^^^^^^^^^
23-Sep-2026 13:30:44   File "/wheeldirectory/casa-CAS-14882-1-py3.12.el8/lib/py/lib/python3.12/pkgutil.py", line 528, in resolve_name
23-Sep-2026 13:30:44     result = getattr(result, p)
23-Sep-2026 13:30:44              ^^^^^^^^^^^^^^^^^^
23-Sep-2026 13:30:44 AttributeError: module 'casashell.private' has no attribute 'jyperk'
23-Sep-2026 13:30:44
23-Sep-2026 13:30:44 ======================================================================
23-Sep-2026 13:30:44 ERROR [0.003s]: test_jyperk_NO_env_var_backup_OK (__main__.TestGetJyPerKALMA.test_jyperk_NO_env_var_backup_OK)
23-Sep-2026 13:30:44 Test that web API error raises RuntimeError.
23-Sep-2026 13:30:44 ----------------------------------------------------------------------
23-Sep-2026 13:30:44 Traceback (most recent call last):
23-Sep-2026 13:30:44   File "/wheeldirectory/casa-CAS-14882-1-py3.12.el8/lib/py/lib/python3.12/unittest/mock.py", line 1843, in _inner
23-Sep-2026 13:30:44     return f(*args, **kw)
23-Sep-2026 13:30:44            ^^^^^^^^^^^^^^
23-Sep-2026 13:30:44   File "/wheeldirectory/casa-CAS-14882-1-py3.12.el8/lib/py/lib/python3.12/unittest/mock.py", line 1387, in patched
23-Sep-2026 13:30:44     with self.decoration_helper(patched,
23-Sep-2026 13:30:44   File "/wheeldirectory/casa-CAS-14882-1-py3.12.el8/lib/py/lib/python3.12/contextlib.py", line 137, in __enter__
23-Sep-2026 13:30:44     return next(self.gen)
23-Sep-2026 13:30:44            ^^^^^^^^^^^^^^
23-Sep-2026 13:30:44   File "/wheeldirectory/casa-CAS-14882-1-py3.12.el8/lib/py/lib/python3.12/unittest/mock.py", line 1369, in decoration_helper
23-Sep-2026 13:30:44     arg = exit_stack.enter_context(patching)
23-Sep-2026 13:30:44           ^^^^^^^^^^^^^^^^^^^^^^^^^^^^^^^^^^
23-Sep-2026 13:30:44   File "/wheeldirectory/casa-CAS-14882-1-py3.12.el8/lib/py/lib/python3.12/contextlib.py", line 526, in enter_context
23-Sep-2026 13:30:44     result = _enter(cm)
23-Sep-2026 13:30:44              ^^^^^^^^^^
23-Sep-2026 13:30:44   File "/wheeldirectory/casa-CAS-14882-1-py3.12.el8/lib/py/lib/python3.12/unittest/mock.py", line 1442, in __enter__
23-Sep-2026 13:30:44     self.target = self.getter()
23-Sep-2026 13:30:44                   ^^^^^^^^^^^^^
23-Sep-2026 13:30:44   File "/wheeldirectory/casa-CAS-14882-1-py3.12.el8/lib/py/lib/python3.12/pkgutil.py", line 528, in resolve_name
23-Sep-2026 13:30:44     result = getattr(result, p)
23-Sep-2026 13:30:44              ^^^^^^^^^^^^^^^^^^
23-Sep-2026 13:30:44 AttributeError: module 'casashell.private' has no attribute 'jyperk'
23-Sep-2026 13:30:44
23-Sep-2026 13:30:44 ======================================================================
23-Sep-2026 13:30:44 ERROR [0.003s]: test_jyperk_env_var_OK (__main__.TestGetJyPerKALMA.test_jyperk_env_var_OK)
23-Sep-2026 13:30:44 Test that web API error raises RuntimeError.
23-Sep-2026 13:30:44 ----------------------------------------------------------------------
23-Sep-2026 13:30:44 Traceback (most recent call last):
23-Sep-2026 13:30:44   File "/wheeldirectory/casa-CAS-14882-1-py3.12.el8/lib/py/lib/python3.12/unittest/mock.py", line 1843, in _inner
23-Sep-2026 13:30:44     return f(*args, **kw)
23-Sep-2026 13:30:44            ^^^^^^^^^^^^^^
23-Sep-2026 13:30:44   File "/wheeldirectory/casa-CAS-14882-1-py3.12.el8/lib/py/lib/python3.12/unittest/mock.py", line 1387, in patched
23-Sep-2026 13:30:44     with self.decoration_helper(patched,
23-Sep-2026 13:30:44   File "/wheeldirectory/casa-CAS-14882-1-py3.12.el8/lib/py/lib/python3.12/contextlib.py", line 137, in __enter__
23-Sep-2026 13:30:44     return next(self.gen)
23-Sep-2026 13:30:44            ^^^^^^^^^^^^^^
23-Sep-2026 13:30:44   File "/wheeldirectory/casa-CAS-14882-1-py3.12.el8/lib/py/lib/python3.12/unittest/mock.py", line 1369, in decoration_helper
23-Sep-2026 13:30:44     arg = exit_stack.enter_context(patching)
23-Sep-2026 13:30:44           ^^^^^^^^^^^^^^^^^^^^^^^^^^^^^^^^^^
23-Sep-2026 13:30:44   File "/wheeldirectory/casa-CAS-14882-1-py3.12.el8/lib/py/lib/python3.12/contextlib.py", line 526, in enter_context
23-Sep-2026 13:30:44     result = _enter(cm)
23-Sep-2026 13:30:44              ^^^^^^^^^^
23-Sep-2026 13:30:44   File "/wheeldirectory/casa-CAS-14882-1-py3.12.el8/lib/py/lib/python3.12/unittest/mock.py", line 1442, in __enter__
23-Sep-2026 13:30:44     self.target = self.getter()
23-Sep-2026 13:30:44                   ^^^^^^^^^^^^^
23-Sep-2026 13:30:44   File "/wheeldirectory/casa-CAS-14882-1-py3.12.el8/lib/py/lib/python3.12/pkgutil.py", line 528, in resolve_name
23-Sep-2026 13:30:44     result = getattr(result, p)
23-Sep-2026 13:30:44              ^^^^^^^^^^^^^^^^^^
23-Sep-2026 13:30:44 AttributeError: module 'casashell.private' has no attribute 'jyperk'
23-Sep-2026 13:30:44
23-Sep-2026 13:30:44 ======================================================================
23-Sep-2026 13:30:44 ERROR [0.003s]: test_jyperk_env_var_OK_backup_available (__main__.TestGetJyPerKALMA.test_jyperk_env_var_OK_backup_available)
23-Sep-2026 13:30:44 Test that web API error raises RuntimeError.
23-Sep-2026 13:30:44 ----------------------------------------------------------------------
23-Sep-2026 13:30:44 Traceback (most recent call last):
23-Sep-2026 13:30:44   File "/wheeldirectory/casa-CAS-14882-1-py3.12.el8/lib/py/lib/python3.12/unittest/mock.py", line 1843, in _inner
23-Sep-2026 13:30:44     return f(*args, **kw)
23-Sep-2026 13:30:44            ^^^^^^^^^^^^^^
23-Sep-2026 13:30:44   File "/wheeldirectory/casa-CAS-14882-1-py3.12.el8/lib/py/lib/python3.12/unittest/mock.py", line 1387, in patched
23-Sep-2026 13:30:44     with self.decoration_helper(patched,
23-Sep-2026 13:30:44   File "/wheeldirectory/casa-CAS-14882-1-py3.12.el8/lib/py/lib/python3.12/contextlib.py", line 137, in __enter__
23-Sep-2026 13:30:44     return next(self.gen)
23-Sep-2026 13:30:44            ^^^^^^^^^^^^^^
23-Sep-2026 13:30:44   File "/wheeldirectory/casa-CAS-14882-1-py3.12.el8/lib/py/lib/python3.12/unittest/mock.py", line 1369, in decoration_helper
23-Sep-2026 13:30:44     arg = exit_stack.enter_context(patching)
23-Sep-2026 13:30:44           ^^^^^^^^^^^^^^^^^^^^^^^^^^^^^^^^^^
23-Sep-2026 13:30:44   File "/wheeldirectory/casa-CAS-14882-1-py3.12.el8/lib/py/lib/python3.12/contextlib.py", line 526, in enter_context
23-Sep-2026 13:30:44     result = _enter(cm)
23-Sep-2026 13:30:44              ^^^^^^^^^^
23-Sep-2026 13:30:44   File "/wheeldirectory/casa-CAS-14882-1-py3.12.el8/lib/py/lib/python3.12/unittest/mock.py", line 1442, in __enter__
23-Sep-2026 13:30:44     self.target = self.getter()
23-Sep-2026 13:30:44                   ^^^^^^^^^^^^^
23-Sep-2026 13:30:44   File "/wheeldirectory/casa-CAS-14882-1-py3.12.el8/lib/py/lib/python3.12/pkgutil.py", line 528, in resolve_name
23-Sep-2026 13:30:44     result = getattr(result, p)
23-Sep-2026 13:30:44              ^^^^^^^^^^^^^^^^^^
23-Sep-2026 13:30:44 AttributeError: module 'casashell.private' has no attribute 'jyperk'
23-Sep-2026 13:30:44
23-Sep-2026 13:30:44 ----------------------------------------------------------------------
23-Sep-2026 13:30:44 Ran 9 tests in 0.212s
23-Sep-2026 13:30:44
23-Sep-2026 13:30:44 FAILED (errors=6)
23-Sep-2026 13:30:44
23-Sep-2026 13:30:44 Generating XML reports...
23-Sep-2026 13:30:44 CASA exits with a non-zero status : system exit called
23-Sep-2026 13:30:45 total 779068
23-Sep-2026 13:30:45 drwxr-xr-x 5 casaci casaci      4096 Sep 14 02:07 casa-CAS-14882-1-py3.12.el8
23-Sep-2026 13:30:45 -rw-r--r-- 1 casaci  15001 797748744 Sep 23 17:26 casa-CAS-14882-1-py3.12.el8.tar.xz
23-Sep-2026 13:30:45 drwxr-xr-x 2 casaci root        4096 Sep 23 17:30 logs
23-Sep-2026 13:30:45 drwxr-xr-x 2 casaci root        4096 Sep 23 17:30 xml
23-Sep-2026 13:30:45 total 32
23-Sep-2026 13:30:45 -rw-r--r-- 1 root root  4040 Sep 23 17:30 test_task_getantposalma_casashell_out.log
23-Sep-2026 13:30:45 -rw-r--r-- 1 root root  4022 Sep 23 17:30 test_task_getcalmodvla_casashell_out.log
23-Sep-2026 13:30:45 -rw-r--r-- 1 root root  3976 Sep 23 17:30 test_task_getephemtable_casashell_out.log
23-Sep-2026 13:30:45 -rw-r--r-- 1 root root 19600 Sep 23 17:30 test_task_getjyperkalma_casashell_out.log
23-Sep-2026 13:30:45 total 12
23-Sep-2026 13:30:45 -rw-r--r-- 1 root root 11981 Sep 23 17:30 test_task_getjyperkalma_casashell.py.xml
23-Sep-2026 13:30:45 Finished task 'Test wheel as casatest' with result: Success
23-Sep-2026 13:30:45 Starting task 'Parse tests' of type 'com.atlassian.bamboo.plugins.testresultparser:task.testresultparser.junit'
23-Sep-2026 13:30:45 Parsing test results under /export/home/cbt-el7-6/bamboohome/xml-data/build-dir/CASA-REDTFX30-TTML2RCWC...
23-Sep-2026 13:30:45 Failing task since 6 failing test cases were found.
23-Sep-2026 13:30:45 Finished task 'Parse tests' with result: Failed
23-Sep-2026 13:30:45 Running post build plugin 'Docker Container Cleanup'
23-Sep-2026 13:30:45
Beginning to execute external process for build 'CASA - Release Engineering Dev Test Full XML 3.12 - CAS-14882 - Test Tasks Many Linux 2.28 Replace Casatasks with casashell #4 (CASA-REDTFX30-TTML2RCWC-4)'
... running command line:
/usr/bin/docker rm -f wheel-container-test
... in: /export/home/cbt-el7-6/bamboohome/xml-data/build-dir/CASA-REDTFX30-TTML2RCWC
23-Sep-2026 13:30:48 wheel-container-test
23-Sep-2026 13:30:48 Running post build plugin 'NCover Results Collector'
23-Sep-2026 13:30:48 Running post build plugin 'Build Results Label Collector'
23-Sep-2026 13:30:48 Running post build plugin 'Clover Results Collector'
23-Sep-2026 13:30:48 Running post build plugin 'npm Cache Cleanup'
23-Sep-2026 13:30:48 Running post build plugin 'Artifact Copier'
23-Sep-2026 13:30:48 Publishing an artifact: Log Files
23-Sep-2026 13:30:48 Finished publishing of artifact Non required job artifact Http Compression On : [Log Files], patterns: [*.log] anchored at: [wheeldirectory/logs/] in 117.0 ms
23-Sep-2026 13:30:48 Publishing an artifact: XML Files
23-Sep-2026 13:30:48 Finished publishing of artifact Non required job artifact Http Compression On : [XML Files], patterns: [*.xml] anchored at: [wheeldirectory/xml/] in 14.38 ms
23-Sep-2026 13:30:48 Publishing an artifact: Workdir
23-Sep-2026 13:30:48 Failing as no matching files has been found and empty artifacts are not allowed.
23-Sep-2026 13:30:48 Unable to publish artifact [Workdir]:
23-Sep-2026 13:30:48 The artifact hasn't been successfully published after 10.31 ms
23-Sep-2026 13:30:48 Finalising the build...
23-Sep-2026 13:30:48 Stopping timer.
23-Sep-2026 13:30:48 Build CASA-REDTFX30-TTML2RCWC-4 completed.
23-Sep-2026 13:30:48 Running on server: post build plugin 'Build Hanging Detection Configuration'
23-Sep-2026 13:30:48 Running on server: post build plugin 'NCover Results Collector'
23-Sep-2026 13:30:48 Running on server: post build plugin 'Build Labeller'
23-Sep-2026 13:30:48 Running on server: post build plugin 'Clover Delta Calculator'
23-Sep-2026 13:30:48 Running on server: post build plugin 'Maven Dependencies Postprocessor'
23-Sep-2026 13:30:48 All post build plugins have finished
23-Sep-2026 13:30:48 Generating build results summary...
23-Sep-2026 13:30:48 Saving build results to disk...
23-Sep-2026 13:30:48 Store variable context...
23-Sep-2026 13:30:48 Finished building CASA-REDTFX30-TTML2RCWC-4.