Build: #4 failed

Job: Test Tasks Many Linux 2.28 Replace Casatasks import with casashell failed

Job result summary

Completed
Duration
4 minutes
Agent
cbt-el7-6.cv.nrao.edu (2)
Total tests
9
Fixed in
#5 (Manual run by Akeem Wells)

Tests

  • 9 tests in total
  • 6 tests failed
  • 6 failures are new
  • < 1 second taken in total.
New test failures 6
Status Test Duration
Collapse Failed TestGetJyPerKALMA test_getjyperkalma_all_failed
< 1 sec
AttributeError: module 'casashell.private' has no attribute 'jyperk'
Traceback (most recent call last):
  File "/wheeldirectory/casa-CAS-14882-1-py3.12.el8/lib/py/lib/python3.12/unittest/mock.py", line 1843, in _inner
    return f(*args, **kw)
           ^^^^^^^^^^^^^^
  File "/wheeldirectory/casa-CAS-14882-1-py3.12.el8/lib/py/lib/python3.12/unittest/mock.py", line 1387, in patched
    with self.decoration_helper(patched,
  File "/wheeldirectory/casa-CAS-14882-1-py3.12.el8/lib/py/lib/python3.12/contextlib.py", line 137, in __enter__
(15 more lines...)
Collapse Failed TestGetJyPerKALMA test_getjyperkalma_env_var_NG_backup2_success
< 1 sec
AttributeError: module 'casashell.private' has no attribute 'jyperk'
Traceback (most recent call last):
  File "/wheeldirectory/casa-CAS-14882-1-py3.12.el8/lib/py/lib/python3.12/unittest/mock.py", line 1843, in _inner
    return f(*args, **kw)
           ^^^^^^^^^^^^^^
  File "/wheeldirectory/casa-CAS-14882-1-py3.12.el8/lib/py/lib/python3.12/unittest/mock.py", line 1387, in patched
    with self.decoration_helper(patched,
  File "/wheeldirectory/casa-CAS-14882-1-py3.12.el8/lib/py/lib/python3.12/contextlib.py", line 137, in __enter__
(15 more lines...)
Collapse Failed TestGetJyPerKALMA test_getjyperkalma_env_var_NG_backup_called
< 1 sec
AttributeError: module 'casashell.private' has no attribute 'jyperk'
Traceback (most recent call last):
  File "/wheeldirectory/casa-CAS-14882-1-py3.12.el8/lib/py/lib/python3.12/unittest/mock.py", line 1843, in _inner
    return f(*args, **kw)
           ^^^^^^^^^^^^^^
  File "/wheeldirectory/casa-CAS-14882-1-py3.12.el8/lib/py/lib/python3.12/unittest/mock.py", line 1387, in patched
    with self.decoration_helper(patched,
  File "/wheeldirectory/casa-CAS-14882-1-py3.12.el8/lib/py/lib/python3.12/contextlib.py", line 137, in __enter__
(15 more lines...)
Collapse Failed TestGetJyPerKALMA test_jyperk_NO_env_var_backup_OK
< 1 sec
AttributeError: module 'casashell.private' has no attribute 'jyperk'
Traceback (most recent call last):
  File "/wheeldirectory/casa-CAS-14882-1-py3.12.el8/lib/py/lib/python3.12/unittest/mock.py", line 1843, in _inner
    return f(*args, **kw)
           ^^^^^^^^^^^^^^
  File "/wheeldirectory/casa-CAS-14882-1-py3.12.el8/lib/py/lib/python3.12/unittest/mock.py", line 1387, in patched
    with self.decoration_helper(patched,
  File "/wheeldirectory/casa-CAS-14882-1-py3.12.el8/lib/py/lib/python3.12/contextlib.py", line 137, in __enter__
(15 more lines...)
Collapse Failed TestGetJyPerKALMA test_jyperk_env_var_OK
< 1 sec
AttributeError: module 'casashell.private' has no attribute 'jyperk'
Traceback (most recent call last):
  File "/wheeldirectory/casa-CAS-14882-1-py3.12.el8/lib/py/lib/python3.12/unittest/mock.py", line 1843, in _inner
    return f(*args, **kw)
           ^^^^^^^^^^^^^^
  File "/wheeldirectory/casa-CAS-14882-1-py3.12.el8/lib/py/lib/python3.12/unittest/mock.py", line 1387, in patched
    with self.decoration_helper(patched,
  File "/wheeldirectory/casa-CAS-14882-1-py3.12.el8/lib/py/lib/python3.12/contextlib.py", line 137, in __enter__
(15 more lines...)
Collapse Failed TestGetJyPerKALMA test_jyperk_env_var_OK_backup_available
< 1 sec
AttributeError: module 'casashell.private' has no attribute 'jyperk'
Traceback (most recent call last):
  File "/wheeldirectory/casa-CAS-14882-1-py3.12.el8/lib/py/lib/python3.12/unittest/mock.py", line 1843, in _inner
    return f(*args, **kw)
           ^^^^^^^^^^^^^^
  File "/wheeldirectory/casa-CAS-14882-1-py3.12.el8/lib/py/lib/python3.12/unittest/mock.py", line 1387, in patched
    with self.decoration_helper(patched,
  File "/wheeldirectory/casa-CAS-14882-1-py3.12.el8/lib/py/lib/python3.12/contextlib.py", line 137, in __enter__
(15 more lines...)

Error summary

The build generated some errors. See the full build log for more details.

Error response from daemon: No such container: wheel-container-test
Error response from daemon: No such container: wheel-container-test
cat: /home/casatest/.casa/toolrc.py: No such file or directory
Switched to a new branch 'CAS-14882'

[notice] A new release of pip is available: 24.0 -> 26.2.1
[notice] To update, run: pip3 install --upgrade pip