Build: #4 failed Manual run by Akeem Wells
Build result summary
Details
- Completed
- Queue duration
- 1 second
- Duration
- 5 minutes
- Labels
- None
- Revisions
-
- CASA6
-
2d7c2aeedb405c4621983a18d494e753d8000bc5
- OPEN-CASA-PKG
-
e5285e68467f01199807a1f1a978aec8a4781be7
- Total tests
- 33
- Fixed in
- #5 (Manual run by Akeem Wells)
Tests
- 6 New failures
- 0 Existing failures
- 0 Fixed
Responsible
No one has taken responsibility for this failure
Configuration changes
Some of the jobs or stages referenced by this result no longer exist.
Tests
| Status | Test | View job | Duration | |
|---|---|---|---|---|
| Collapse |
TestGetJyPerKALMA
test_jyperk_env_var_OK_backup_available
|
Test Tasks Many Linux 2.28 Replace Casatasks with casashell | < 1 sec | |
AttributeError: module 'casashell.private' has no attribute 'jyperk'
Traceback (most recent call last):
File "/wheeldirectory/casa-CAS-14882-1-py3.12.el8/lib/py/lib/python3.12/unittest/mock.py", line 1843, in _inner
return f(*args, **kw)
^^^^^^^^^^^^^^
File "/wheeldirectory/casa-CAS-14882-1-py3.12.el8/lib/py/lib/python3.12/unittest/mock.py", line 1387, in patched
with self.decoration_helper(patched,
File "/wheeldirectory/casa-CAS-14882-1-py3.12.el8/lib/py/lib/python3.12/contextlib.py", line 137, in __enter__
(15 more lines...)
|
||||
| Collapse |
TestGetJyPerKALMA
test_getjyperkalma_env_var_NG_backup_called
|
Test Tasks Many Linux 2.28 Replace Casatasks with casashell | < 1 sec | |
AttributeError: module 'casashell.private' has no attribute 'jyperk'
Traceback (most recent call last):
File "/wheeldirectory/casa-CAS-14882-1-py3.12.el8/lib/py/lib/python3.12/unittest/mock.py", line 1843, in _inner
return f(*args, **kw)
^^^^^^^^^^^^^^
File "/wheeldirectory/casa-CAS-14882-1-py3.12.el8/lib/py/lib/python3.12/unittest/mock.py", line 1387, in patched
with self.decoration_helper(patched,
File "/wheeldirectory/casa-CAS-14882-1-py3.12.el8/lib/py/lib/python3.12/contextlib.py", line 137, in __enter__
(15 more lines...)
|
||||
| Collapse |
TestGetJyPerKALMA
test_jyperk_env_var_OK
|
Test Tasks Many Linux 2.28 Replace Casatasks with casashell | < 1 sec | |
AttributeError: module 'casashell.private' has no attribute 'jyperk'
Traceback (most recent call last):
File "/wheeldirectory/casa-CAS-14882-1-py3.12.el8/lib/py/lib/python3.12/unittest/mock.py", line 1843, in _inner
return f(*args, **kw)
^^^^^^^^^^^^^^
File "/wheeldirectory/casa-CAS-14882-1-py3.12.el8/lib/py/lib/python3.12/unittest/mock.py", line 1387, in patched
with self.decoration_helper(patched,
File "/wheeldirectory/casa-CAS-14882-1-py3.12.el8/lib/py/lib/python3.12/contextlib.py", line 137, in __enter__
(15 more lines...)
|
||||
| Collapse |
TestGetJyPerKALMA
test_getjyperkalma_env_var_NG_backup2_success
|
Test Tasks Many Linux 2.28 Replace Casatasks with casashell | < 1 sec | |
AttributeError: module 'casashell.private' has no attribute 'jyperk'
Traceback (most recent call last):
File "/wheeldirectory/casa-CAS-14882-1-py3.12.el8/lib/py/lib/python3.12/unittest/mock.py", line 1843, in _inner
return f(*args, **kw)
^^^^^^^^^^^^^^
File "/wheeldirectory/casa-CAS-14882-1-py3.12.el8/lib/py/lib/python3.12/unittest/mock.py", line 1387, in patched
with self.decoration_helper(patched,
File "/wheeldirectory/casa-CAS-14882-1-py3.12.el8/lib/py/lib/python3.12/contextlib.py", line 137, in __enter__
(15 more lines...)
|
||||
| Collapse |
TestGetJyPerKALMA
test_jyperk_NO_env_var_backup_OK
|
Test Tasks Many Linux 2.28 Replace Casatasks with casashell | < 1 sec | |
AttributeError: module 'casashell.private' has no attribute 'jyperk'
Traceback (most recent call last):
File "/wheeldirectory/casa-CAS-14882-1-py3.12.el8/lib/py/lib/python3.12/unittest/mock.py", line 1843, in _inner
return f(*args, **kw)
^^^^^^^^^^^^^^
File "/wheeldirectory/casa-CAS-14882-1-py3.12.el8/lib/py/lib/python3.12/unittest/mock.py", line 1387, in patched
with self.decoration_helper(patched,
File "/wheeldirectory/casa-CAS-14882-1-py3.12.el8/lib/py/lib/python3.12/contextlib.py", line 137, in __enter__
(15 more lines...)
|
||||
| Collapse |
TestGetJyPerKALMA
test_getjyperkalma_all_failed
|
Test Tasks Many Linux 2.28 Replace Casatasks with casashell | < 1 sec | |
AttributeError: module 'casashell.private' has no attribute 'jyperk'
Traceback (most recent call last):
File "/wheeldirectory/casa-CAS-14882-1-py3.12.el8/lib/py/lib/python3.12/unittest/mock.py", line 1843, in _inner
return f(*args, **kw)
^^^^^^^^^^^^^^
File "/wheeldirectory/casa-CAS-14882-1-py3.12.el8/lib/py/lib/python3.12/unittest/mock.py", line 1387, in patched
with self.decoration_helper(patched,
File "/wheeldirectory/casa-CAS-14882-1-py3.12.el8/lib/py/lib/python3.12/contextlib.py", line 137, in __enter__
(15 more lines...)
|
||||