Build: #7 failed Manual run by Akeem Wells

Test results

  • 4,666 tests in total
  • 2 tests failed
  • 2 failures are new
  • 181 tests were quarantined / skipped
  • 449 minutes taken in total.
New test failures 2
Status Test View job Duration
Collapse Failed plotbandpass_private_test test_sloppyUnique
Test Tasks Many Linux 2.28 Replace Casatasks import with casashell < 1 sec
ModuleNotFoundError: No module named 'casashell.private.task_plotbandpass'
Traceback (most recent call last):
  File "/home/casatest/casa6/casatasks/tests/casashell_tests/test_task_plotbandpass_casashell.py", line 1489, in test_sloppyUnique
    import casashell.private.task_plotbandpass as _plotbandpass
ModuleNotFoundError: No module named 'casashell.private.task_plotbandpass'
Collapse Failed test_widefield test_widefield_mvc_squint_awp2
Test Tasks Many Linux 2.28 Remove Casatasks import 21 mins
AssertionError: False is not true
Traceback (most recent call last):
  File "/home/casatest/casa6/casatasks/tests/casashell_tests/test_task_tclean_casashell.py", line 4339, in test_widefield_mvc_squint_awp2
    self.assertTrue(self.check_final(report))
AssertionError: False is not true
Skipped tests 100
Status Test Failing since View job
Skipped asdm_import8 test_mms5
Test Tasks Many Linux 2.28 Remove Casatasks import
Skipped cvel_test test44
Test Tasks Many Linux 2.28 Remove Casatasks import
Skipped cvel_test test43
Test Tasks Many Linux 2.28 Remove Casatasks import
Skipped cvel_test test22
Test Tasks Many Linux 2.28 Remove Casatasks import
Skipped cvel_test test20
Test Tasks Many Linux 2.28 Remove Casatasks import
Skipped cvel_test test29
Test Tasks Many Linux 2.28 Remove Casatasks import
Skipped cvel_test test19
Test Tasks Many Linux 2.28 Remove Casatasks import
Skipped cvel_test test28
Test Tasks Many Linux 2.28 Remove Casatasks import
Skipped cvel_test test47
Test Tasks Many Linux 2.28 Remove Casatasks import
Skipped cvel_test test45
Test Tasks Many Linux 2.28 Remove Casatasks import
Skipped cvel_test test24
Test Tasks Many Linux 2.28 Remove Casatasks import
Skipped cvel_test test29
Test Tasks Many Linux 2.28 Replace Casatasks import with casashell
Skipped cvel_test test28
Test Tasks Many Linux 2.28 Replace Casatasks import with casashell
Skipped cvel_test test47
Test Tasks Many Linux 2.28 Replace Casatasks import with casashell
Skipped cvel_test test20
Test Tasks Many Linux 2.28 Replace Casatasks import with casashell
Skipped cvel_test test44
Test Tasks Many Linux 2.28 Replace Casatasks import with casashell
Skipped cvel_test test22
Test Tasks Many Linux 2.28 Replace Casatasks import with casashell
Skipped cvel_test test43
Test Tasks Many Linux 2.28 Replace Casatasks import with casashell
Skipped cvel_test test19
Test Tasks Many Linux 2.28 Replace Casatasks import with casashell
Skipped cvel_test test24
Test Tasks Many Linux 2.28 Replace Casatasks import with casashell
Skipped cvel_test test45
Test Tasks Many Linux 2.28 Replace Casatasks import with casashell
Skipped exportasdm_test test10
Test Tasks Many Linux 2.28 Replace Casatasks import with casashell
Skipped exportasdm_test test10
Test Tasks Many Linux 2.28 Remove Casatasks import
Skipped predictcomp_test test_predicted_visplot
Test Tasks Many Linux 2.28 Remove Casatasks import
Skipped sdbaseline_bloutputTest test021
Test Tasks Many Linux 2.28 Remove Casatasks import
Skipped sdbaseline_bloutputTest test030
Test Tasks Many Linux 2.28 Remove Casatasks import
Skipped sdbaseline_bloutputTest test020
Test Tasks Many Linux 2.28 Remove Casatasks import
Skipped sdbaseline_multi_IF_test test200
Test Tasks Many Linux 2.28 Remove Casatasks import
Skipped sdcal_test_apply test_apply_sky08M
Test Tasks Many Linux 2.28 Remove Casatasks import
Skipped sdimaging_test_selection test_spw_mix_exprlist
Test Tasks Many Linux 2.28 Remove Casatasks import
Skipped sdimaging_test_selection test_pol_id_gt
Test Tasks Many Linux 2.28 Remove Casatasks import
Skipped sdimaging_test_selection test_spw_value_velocity
Test Tasks Many Linux 2.28 Remove Casatasks import
Skipped sdimaging_test_selection test_spw_value_frequency
Test Tasks Many Linux 2.28 Remove Casatasks import
Skipped sdimaging_test_selection test_beam_id_exprlist
Test Tasks Many Linux 2.28 Remove Casatasks import
Skipped sdimaging_test_selection test_spw_value_velocity_list
Test Tasks Many Linux 2.28 Remove Casatasks import
Skipped sdimaging_test_selection test_beam_id_range
Test Tasks Many Linux 2.28 Remove Casatasks import
Skipped sdimaging_test_selection test_spw_value_velocity_channel
Test Tasks Many Linux 2.28 Remove Casatasks import
Skipped sdimaging_test_selection test_spw_value_velocity_frequency
Test Tasks Many Linux 2.28 Remove Casatasks import
Skipped sdimaging_test_selection test_spw_id_exact_velocity
Test Tasks Many Linux 2.28 Remove Casatasks import
Skipped sdimaging_test_selection test_beam_id_gt
Test Tasks Many Linux 2.28 Remove Casatasks import
Skipped sdimaging_test_selection test_spw_id_pattern_velocity
Test Tasks Many Linux 2.28 Remove Casatasks import
Skipped sdimaging_test_selection test_pol_id_default
Test Tasks Many Linux 2.28 Remove Casatasks import
Skipped sdimaging_test_selection test_pol_id_range
Test Tasks Many Linux 2.28 Remove Casatasks import
Skipped sdimaging_test_selection test_pol_id_lt
Test Tasks Many Linux 2.28 Remove Casatasks import
Skipped sdimaging_test_selection test_spw_value_velocity_velocity
Test Tasks Many Linux 2.28 Remove Casatasks import
Skipped sdimaging_test_selection test_spw_id_default_velocity
Test Tasks Many Linux 2.28 Remove Casatasks import
Skipped sdimaging_test_selection test_beam_id_default
Test Tasks Many Linux 2.28 Remove Casatasks import
Skipped sdimaging_test_selection test_pol_id_list
Test Tasks Many Linux 2.28 Remove Casatasks import
Skipped sdimaging_test_selection test_spw_value_frequency_list
Test Tasks Many Linux 2.28 Remove Casatasks import
Skipped sdimaging_test_selection test_pol_id_exprlist
Test Tasks Many Linux 2.28 Remove Casatasks import
Skipped sdimaging_test_selection test_beam_id_exact
Test Tasks Many Linux 2.28 Remove Casatasks import
Skipped sdimaging_test_selection test_spw_value_frequency_velocity
Test Tasks Many Linux 2.28 Remove Casatasks import
Skipped sdimaging_test_selection test_beam_id_list
Test Tasks Many Linux 2.28 Remove Casatasks import
Skipped sdimaging_test_selection test_beam_id_lt
Test Tasks Many Linux 2.28 Remove Casatasks import
Skipped sdimaging_test_selection test_pol_id_exact
Test Tasks Many Linux 2.28 Remove Casatasks import
Skipped simanalyze_main_usage_modes_test_both test_imaging_True_interferometric_and_single_dish_analysis_False
Test Tasks Many Linux 2.28 Remove Casatasks import
Skipped simobserve_badinputs testBad_tau0
Test Tasks Many Linux 2.28 Remove Casatasks import
Skipped simobserve_badinputs testBad_maptype
Test Tasks Many Linux 2.28 Remove Casatasks import
Skipped simobserve_badinputs testBad_Tsky
Test Tasks Many Linux 2.28 Remove Casatasks import
Skipped simobserve_badinputs testBad_obsmode
Test Tasks Many Linux 2.28 Remove Casatasks import
Skipped simobserve_badinputs testBad_leakage
Test Tasks Many Linux 2.28 Remove Casatasks import
Skipped simobserve_badinputs testBad_noisetype
Test Tasks Many Linux 2.28 Remove Casatasks import
Skipped simobserve_badinputs testBad_Tground
Test Tasks Many Linux 2.28 Remove Casatasks import
Skipped simobserve_badinputs testBad_graphics
Test Tasks Many Linux 2.28 Remove Casatasks import
Skipped simobserve_badinputs testBad_pwv
Test Tasks Many Linux 2.28 Remove Casatasks import
Skipped simobserve_comp testComp_sdObs
Test Tasks Many Linux 2.28 Remove Casatasks import
Skipped simobserve_comp testComp_intLeak
Test Tasks Many Linux 2.28 Remove Casatasks import
Skipped simobserve_comp testComp_sdAll
Test Tasks Many Linux 2.28 Remove Casatasks import
Skipped simobserve_noise testNZ_intAtm
Test Tasks Many Linux 2.28 Remove Casatasks import
Skipped simobserve_skycomp testSC_sdAll
Test Tasks Many Linux 2.28 Remove Casatasks import
Skipped simobserve_skycomp testSC_intLeak
Test Tasks Many Linux 2.28 Remove Casatasks import
Skipped simobserve_skycomp testSC_sdObs
Test Tasks Many Linux 2.28 Remove Casatasks import
Skipped split_test_fc test_fc_straightselection
Test Tasks Many Linux 2.28 Remove Casatasks import
Skipped split_test_fc test_fc_cav
Test Tasks Many Linux 2.28 Remove Casatasks import
Skipped split_test_fc test_fc_categories
Test Tasks Many Linux 2.28 Remove Casatasks import
Skipped split_test_fc test_fc_tav
Test Tasks Many Linux 2.28 Remove Casatasks import
Skipped split_test_tav test_data_ll
Test Tasks Many Linux 2.28 Remove Casatasks import
Skipped split_test_tav test_sts_rr
Test Tasks Many Linux 2.28 Remove Casatasks import
Skipped split_test_tav test_data_rr
Test Tasks Many Linux 2.28 Remove Casatasks import
Skipped split_test_tav test_sts_ll
Test Tasks Many Linux 2.28 Remove Casatasks import
Skipped split_test_tav test_data_rllr
Test Tasks Many Linux 2.28 Remove Casatasks import
Skipped split_test_tav test_sigma
Test Tasks Many Linux 2.28 Remove Casatasks import
Skipped split_test_tav test_data
Test Tasks Many Linux 2.28 Remove Casatasks import
Skipped split_test_tav test_wt_rrll
Test Tasks Many Linux 2.28 Remove Casatasks import
Skipped split_test_tav test_sts_rllr
Test Tasks Many Linux 2.28 Remove Casatasks import
Skipped split_test_tav test_wt_ll
Test Tasks Many Linux 2.28 Remove Casatasks import
Skipped split_test_tav test_wt_rr
Test Tasks Many Linux 2.28 Remove Casatasks import
Skipped split_test_tav test_data_rrll
Test Tasks Many Linux 2.28 Remove Casatasks import
Skipped split_test_tav test_wt_rllr
Test Tasks Many Linux 2.28 Remove Casatasks import
Skipped split_test_tav test_sigma_rrll
Test Tasks Many Linux 2.28 Remove Casatasks import
Skipped split_test_tav test_sigma_rr
Test Tasks Many Linux 2.28 Remove Casatasks import
Skipped split_test_tav test_sts_rrll
Test Tasks Many Linux 2.28 Remove Casatasks import
Skipped split_test_tav test_sigma_rllr
Test Tasks Many Linux 2.28 Remove Casatasks import
Skipped split_test_tav test_sts
Test Tasks Many Linux 2.28 Remove Casatasks import
Skipped split_test_tav test_wt
Test Tasks Many Linux 2.28 Remove Casatasks import
Skipped split_test_tav test_sigma_ll
Test Tasks Many Linux 2.28 Remove Casatasks import
Skipped split_test_tav_then_cvel test_tav_int
Test Tasks Many Linux 2.28 Remove Casatasks import
Skipped split_test_tav_then_cvel test_tav_data
Test Tasks Many Linux 2.28 Remove Casatasks import
Skipped split_test_tav_then_cvel test_tav_state_id
Test Tasks Many Linux 2.28 Remove Casatasks import
Skipped split_test_tav_then_cvel test_tav_wt
Test Tasks Many Linux 2.28 Remove Casatasks import