Build: #4 failed Manual run by Akeem Wells

Test results

  • 33 tests in total
  • 6 tests failed
  • 6 failures are new
  • 18 seconds taken in total.
New test failures 6
Status Test View job Duration
Collapse Failed TestGetJyPerKALMA test_jyperk_env_var_OK_backup_available
Test Tasks Many Linux 2.28 Replace Casatasks with casashell < 1 sec
AttributeError: module 'casashell.private' has no attribute 'jyperk'
Traceback (most recent call last):
  File "/wheeldirectory/casa-CAS-14882-1-py3.12.el8/lib/py/lib/python3.12/unittest/mock.py", line 1843, in _inner
    return f(*args, **kw)
           ^^^^^^^^^^^^^^
  File "/wheeldirectory/casa-CAS-14882-1-py3.12.el8/lib/py/lib/python3.12/unittest/mock.py", line 1387, in patched
    with self.decoration_helper(patched,
  File "/wheeldirectory/casa-CAS-14882-1-py3.12.el8/lib/py/lib/python3.12/contextlib.py", line 137, in __enter__
(15 more lines...)
Collapse Failed TestGetJyPerKALMA test_getjyperkalma_env_var_NG_backup_called
Test Tasks Many Linux 2.28 Replace Casatasks with casashell < 1 sec
AttributeError: module 'casashell.private' has no attribute 'jyperk'
Traceback (most recent call last):
  File "/wheeldirectory/casa-CAS-14882-1-py3.12.el8/lib/py/lib/python3.12/unittest/mock.py", line 1843, in _inner
    return f(*args, **kw)
           ^^^^^^^^^^^^^^
  File "/wheeldirectory/casa-CAS-14882-1-py3.12.el8/lib/py/lib/python3.12/unittest/mock.py", line 1387, in patched
    with self.decoration_helper(patched,
  File "/wheeldirectory/casa-CAS-14882-1-py3.12.el8/lib/py/lib/python3.12/contextlib.py", line 137, in __enter__
(15 more lines...)
Collapse Failed TestGetJyPerKALMA test_jyperk_env_var_OK
Test Tasks Many Linux 2.28 Replace Casatasks with casashell < 1 sec
AttributeError: module 'casashell.private' has no attribute 'jyperk'
Traceback (most recent call last):
  File "/wheeldirectory/casa-CAS-14882-1-py3.12.el8/lib/py/lib/python3.12/unittest/mock.py", line 1843, in _inner
    return f(*args, **kw)
           ^^^^^^^^^^^^^^
  File "/wheeldirectory/casa-CAS-14882-1-py3.12.el8/lib/py/lib/python3.12/unittest/mock.py", line 1387, in patched
    with self.decoration_helper(patched,
  File "/wheeldirectory/casa-CAS-14882-1-py3.12.el8/lib/py/lib/python3.12/contextlib.py", line 137, in __enter__
(15 more lines...)
Collapse Failed TestGetJyPerKALMA test_getjyperkalma_env_var_NG_backup2_success
Test Tasks Many Linux 2.28 Replace Casatasks with casashell < 1 sec
AttributeError: module 'casashell.private' has no attribute 'jyperk'
Traceback (most recent call last):
  File "/wheeldirectory/casa-CAS-14882-1-py3.12.el8/lib/py/lib/python3.12/unittest/mock.py", line 1843, in _inner
    return f(*args, **kw)
           ^^^^^^^^^^^^^^
  File "/wheeldirectory/casa-CAS-14882-1-py3.12.el8/lib/py/lib/python3.12/unittest/mock.py", line 1387, in patched
    with self.decoration_helper(patched,
  File "/wheeldirectory/casa-CAS-14882-1-py3.12.el8/lib/py/lib/python3.12/contextlib.py", line 137, in __enter__
(15 more lines...)
Collapse Failed TestGetJyPerKALMA test_jyperk_NO_env_var_backup_OK
Test Tasks Many Linux 2.28 Replace Casatasks with casashell < 1 sec
AttributeError: module 'casashell.private' has no attribute 'jyperk'
Traceback (most recent call last):
  File "/wheeldirectory/casa-CAS-14882-1-py3.12.el8/lib/py/lib/python3.12/unittest/mock.py", line 1843, in _inner
    return f(*args, **kw)
           ^^^^^^^^^^^^^^
  File "/wheeldirectory/casa-CAS-14882-1-py3.12.el8/lib/py/lib/python3.12/unittest/mock.py", line 1387, in patched
    with self.decoration_helper(patched,
  File "/wheeldirectory/casa-CAS-14882-1-py3.12.el8/lib/py/lib/python3.12/contextlib.py", line 137, in __enter__
(15 more lines...)
Collapse Failed TestGetJyPerKALMA test_getjyperkalma_all_failed
Test Tasks Many Linux 2.28 Replace Casatasks with casashell < 1 sec
AttributeError: module 'casashell.private' has no attribute 'jyperk'
Traceback (most recent call last):
  File "/wheeldirectory/casa-CAS-14882-1-py3.12.el8/lib/py/lib/python3.12/unittest/mock.py", line 1843, in _inner
    return f(*args, **kw)
           ^^^^^^^^^^^^^^
  File "/wheeldirectory/casa-CAS-14882-1-py3.12.el8/lib/py/lib/python3.12/unittest/mock.py", line 1387, in patched
    with self.decoration_helper(patched,
  File "/wheeldirectory/casa-CAS-14882-1-py3.12.el8/lib/py/lib/python3.12/contextlib.py", line 137, in __enter__
(15 more lines...)