Build: #4 failed
Job: Pipeline PR Test 6.7.4 failed
Job result summary
- Completed
- Duration
- 36 seconds
- Agent
- casaci-4.cv.nrao.edu test agent2
- Revision
-
67f02aaf7ce9aa05a825029bd8c06b4d9762251c
- Fixed in
- #5 (Changes by Rui Xue)
Error summary
The build generated some errors. See the full build log for more details.
Cloning into 'casa-build-utils'...
X11 forwarding request failed on channel 0
% Total % Received % Xferd Average Speed Time Time Time Current
Dload Upload Total Spent Left Speed
0 0 0 0 0 0 0 0 --:--:-- --:--:-- --:--:-- 0
100 472 100 472 0 0 24842 0 --:--:-- --:--:-- --:--:-- 24842
% Total % Received % Xferd Average Speed Time Time Time Current
Dload Upload Total Spent Left Speed
0 0 0 0 0 0 0 0 --:--:-- --:--:-- --:--:-- 0
11 793M 11 93.3M 0 0 335M 0 0:00:02 --:--:-- 0:00:02 334M
56 793M 56 448M 0 0 351M 0 0:00:02 0:00:01 0:00:01 350M
90 793M 90 722M 0 0 317M 0 0:00:02 0:00:02 --:--:-- 316M
100 793M 100 793M 0 0 323M 0 0:00:02 0:00:02 --:--:-- 323M
Cloning into 'casa-build-utils'...
WARNING: The script distro is installed in '/home/casatest/.local/bin' which is not on PATH.
Consider adding this directory to PATH or, if you prefer to suppress this warning, use --no-warn-script-location.
[notice] A new release of pip is available: 24.3.1 -> 26.2.2
[notice] To update, run: pip3 install --upgrade pip
Traceback (most recent call last):
File "/home/casatest/casa-build-utils/pipeline/testpipeline.py", line 62, in <module>
raise Exception("Merge failed")
Exception: Merge failed
mkdir: cannot create directory 'workdir': File exists
cp: cannot stat '/home/casatest/casa-build-utils/pipeline/workdir/pipeline_test_result.xml': No such file or directory
chown: cannot access '/pkgout/*': No such file or directory
X11 forwarding request failed on channel 0
% Total % Received % Xferd Average Speed Time Time Time Current
Dload Upload Total Spent Left Speed
0 0 0 0 0 0 0 0 --:--:-- --:--:-- --:--:-- 0
100 472 100 472 0 0 24842 0 --:--:-- --:--:-- --:--:-- 24842
% Total % Received % Xferd Average Speed Time Time Time Current
Dload Upload Total Spent Left Speed
0 0 0 0 0 0 0 0 --:--:-- --:--:-- --:--:-- 0
11 793M 11 93.3M 0 0 335M 0 0:00:02 --:--:-- 0:00:02 334M
56 793M 56 448M 0 0 351M 0 0:00:02 0:00:01 0:00:01 350M
90 793M 90 722M 0 0 317M 0 0:00:02 0:00:02 --:--:-- 316M
100 793M 100 793M 0 0 323M 0 0:00:02 0:00:02 --:--:-- 323M
Cloning into 'casa-build-utils'...
WARNING: The script distro is installed in '/home/casatest/.local/bin' which is not on PATH.
Consider adding this directory to PATH or, if you prefer to suppress this warning, use --no-warn-script-location.
[notice] A new release of pip is available: 24.3.1 -> 26.2.2
[notice] To update, run: pip3 install --upgrade pip
Traceback (most recent call last):
File "/home/casatest/casa-build-utils/pipeline/testpipeline.py", line 62, in <module>
raise Exception("Merge failed")
Exception: Merge failed
mkdir: cannot create directory 'workdir': File exists
cp: cannot stat '/home/casatest/casa-build-utils/pipeline/workdir/pipeline_test_result.xml': No such file or directory
chown: cannot access '/pkgout/*': No such file or directory