Build: #1 failed

Job: Test Tools macOS15 was successful

Build log

The build generated 53,286 lines of output.   The output is too long and has been truncated to the last 1,000 lines. Download or view full build log.

21-Oct-2026 16:59:01 2026-10-21 20:59:01        INFO        ImageRegion::fromRecord        Selected bounding box :
21-Oct-2026 16:59:01 2026-10-21 20:59:01        INFO        ImageRegion::fromRecord+            [0, 0, 2445] to [2, 2, 2555]  (02:00:00.000, +30.00.00.000, 9.99142e+13Hz to 02:00:00.154, +30.00.02.000, 9.67228e+13Hz)
21-Oct-2026 16:59:01 2026-10-21 20:59:01        INFO        AsciiRegionFileParser::_parse        Combined 1 image regions (which excludes any annotation regions)
21-Oct-2026 16:59:01 2026-10-21 20:59:01        INFO        AsciiRegionFileParser::_parse        The specified region will select all pixels that are included in the region. Full pixels will be included even when they are only partially covered by the region(s).
21-Oct-2026 16:59:01 2026-10-21 20:59:01        INFO        ImageRegion::fromRecord        Selected bounding box :
21-Oct-2026 16:59:01 2026-10-21 20:59:01        INFO        ImageRegion::fromRecord+            [0, 0, 2445] to [2, 2, 2555]  (02:00:00.000, +30.00.00.000, 9.99142e+13Hz to 02:00:00.154, +30.00.02.000, 9.67228e+13Hz)
21-Oct-2026 16:59:01 2026-10-21 20:59:01        INFO        name::        No table opened.
21-Oct-2026 16:59:01 2026-10-21 20:59:01        INFO        showcache::        The Table Cache is empty.
21-Oct-2026 16:59:01 2026-10-21 20:59:01        INFO        name::        No table opened.
21-Oct-2026 16:59:01 2026-10-21 20:59:01        INFO        name::        No table opened.
21-Oct-2026 16:59:01 test_tool_image_collapse.py::ia_collapse_test::test_CAS3737
21-Oct-2026 16:59:01 ia.collapse(): test tabular spectral axis has correct collapsed reference value 
21-Oct-2026 16:59:01 PASSED
21-Oct-2026 16:59:01
21-Oct-2026 16:59:01 2026-10-21 20:59:01        INFO        FITSCoordinateUtil::fromFITSHeader        Neither SPECSYS nor VELREF keyword given, spectral reference frame not defined ...
21-Oct-2026 16:59:01 2026-10-21 20:59:01        INFO        FITSCoordinateUtil::fromFITSHeader        Neither SPECSYS nor VELREF keyword given, spectral reference frame not defined ...
21-Oct-2026 16:59:01 2026-10-21 20:59:01        INFO        ImageRegion::fromRecord        Selected bounding box :
21-Oct-2026 16:59:01 2026-10-21 20:59:01        INFO        ImageRegion::fromRecord+            [0, 0, 0, 0] to [2, 2, 2, 2]  (04:46:00.576, +44.50.12.522, 4.7351e+09Hz, I to 04:46:00.520, +44.50.13.123, 5.5351e+09Hz, U)
21-Oct-2026 16:59:01 2026-10-21 20:59:01        INFO        ImageRegion::fromRecord        Selected bounding box :
21-Oct-2026 16:59:01 2026-10-21 20:59:01        INFO        ImageRegion::fromRecord+            [0, 0, 0, 0] to [0, 2, 2, 2]  (04:46:00.548, +44.50.12.750, 4.7351e+09Hz, I to 04:46:00.548, +44.50.13.350, 5.5351e+09Hz, U)
21-Oct-2026 16:59:01 2026-10-21 20:59:01        INFO        FITSCoordinateUtil::fromFITSHeader        Neither SPECSYS nor VELREF keyword given, spectral reference frame not defined ...
21-Oct-2026 16:59:01 2026-10-21 20:59:02        INFO        FITSCoordinateUtil::fromFITSHeader        Neither SPECSYS nor VELREF keyword given, spectral reference frame not defined ...
21-Oct-2026 16:59:01 2026-10-21 20:59:02        INFO        ImageRegion::fromRecord        Selected bounding box :
21-Oct-2026 16:59:01 2026-10-21 20:59:02        INFO        ImageRegion::fromRecord+            [0, 0, 0, 0] to [2, 2, 2, 2]  (04:46:00.576, +44.50.12.522, 4.7351e+09Hz, I to 04:46:00.520, +44.50.13.123, 5.5351e+09Hz, U)
21-Oct-2026 16:59:01 2026-10-21 20:59:02        INFO        ImageRegion::fromRecord        Selected bounding box :
21-Oct-2026 16:59:01 2026-10-21 20:59:02        INFO        ImageRegion::fromRecord+            [0, 0, 0, 0] to [2, 0, 2, 2]  (04:46:00.576, +44.50.12.595, 4.7351e+09Hz, I to 04:46:00.520, +44.50.12.596, 5.5351e+09Hz, U)
21-Oct-2026 16:59:01 2026-10-21 20:59:02        INFO        FITSCoordinateUtil::fromFITSHeader        Neither SPECSYS nor VELREF keyword given, spectral reference frame not defined ...
21-Oct-2026 16:59:01 2026-10-21 20:59:02        INFO        FITSCoordinateUtil::fromFITSHeader        Neither SPECSYS nor VELREF keyword given, spectral reference frame not defined ...
21-Oct-2026 16:59:01 2026-10-21 20:59:02        INFO        ImageRegion::fromRecord        Selected bounding box :
21-Oct-2026 16:59:01 2026-10-21 20:59:02        INFO        ImageRegion::fromRecord+            [0, 0, 0, 0] to [2, 2, 2, 2]  (04:46:00.576, +44.50.12.522, 4.7351e+09Hz, I to 04:46:00.520, +44.50.13.123, 5.5351e+09Hz, U)
21-Oct-2026 16:59:01 2026-10-21 20:59:02        INFO        ImageRegion::fromRecord        Selected bounding box :
21-Oct-2026 16:59:01 2026-10-21 20:59:02        INFO        ImageRegion::fromRecord+            [0, 0, 0, 0] to [2, 2, 0, 2]  (04:46:00.576, +44.50.12.522, 5.1351e+09Hz, I to 04:46:00.520, +44.50.13.123, 5.1351e+09Hz, U)
21-Oct-2026 16:59:01 2026-10-21 20:59:02        INFO        FITSCoordinateUtil::fromFITSHeader        Neither SPECSYS nor VELREF keyword given, spectral reference frame not defined ...
21-Oct-2026 16:59:01 2026-10-21 20:59:02        INFO        FITSCoordinateUtil::fromFITSHeader        Neither SPECSYS nor VELREF keyword given, spectral reference frame not defined ...
21-Oct-2026 16:59:01 2026-10-21 20:59:02        INFO        ImageRegion::fromRecord        Selected bounding box :
21-Oct-2026 16:59:01 2026-10-21 20:59:02        INFO        ImageRegion::fromRecord+            [0, 0, 0, 0] to [2, 2, 2, 2]  (04:46:00.576, +44.50.12.522, 4.7351e+09Hz, I to 04:46:00.520, +44.50.13.123, 5.5351e+09Hz, U)
21-Oct-2026 16:59:01 2026-10-21 20:59:02        INFO        ImageRegion::fromRecord        Selected bounding box :
21-Oct-2026 16:59:01 2026-10-21 20:59:02        INFO        ImageRegion::fromRecord+            [0, 0, 0, 0] to [2, 2, 2, 0]  (04:46:00.576, +44.50.12.522, 4.7351e+09Hz, I to 04:46:00.520, +44.50.13.123, 5.5351e+09Hz, I)
21-Oct-2026 16:59:01 2026-10-21 20:59:02        INFO        name::        No table opened.
21-Oct-2026 16:59:01 2026-10-21 20:59:02        INFO        showcache::        The Table Cache is empty.
21-Oct-2026 16:59:01 2026-10-21 20:59:02        INFO        name::        No table opened.
21-Oct-2026 16:59:01 2026-10-21 20:59:02        INFO        name::        No table opened.
21-Oct-2026 16:59:01 test_tool_image_collapse.py::ia_collapse_test::test_CAS_3418
21-Oct-2026 16:59:01 ia.collapse(): Test separate code for median due to performance issues
21-Oct-2026 16:59:01 PASSED
21-Oct-2026 16:59:01
21-Oct-2026 16:59:01 2026-10-21 20:59:02        INFO        ImageFactory::createImage        Created Temp image  of shape [10, 10, 10, 4] with float valued pixels.
21-Oct-2026 16:59:01 2026-10-21 20:59:02        INFO        image::_casaQuantityFromVar         Will use values specified in major, minor, pa to set beam
21-Oct-2026 16:59:01 2026-10-21 20:59:02        INFO        BeamManipulator::set        This image currently has no beams of any kind. Since channel and/or polarization were specified, a set of per plane beams, each equal to the specified beam, will be created.
21-Oct-2026 16:59:01 2026-10-21 20:59:02        INFO        BeamManipulator::set        Beam parameters:  Major          : 4 arcsec
21-Oct-2026 16:59:01 2026-10-21 20:59:02        INFO        BeamManipulator::set+          Minor          : 3 arcsec
21-Oct-2026 16:59:01 2026-10-21 20:59:02        INFO        BeamManipulator::set+          Position Angle : 20 deg
21-Oct-2026 16:59:01 2026-10-21 20:59:02        INFO        image::_casaQuantityFromVar         Will use values specified in major, minor, pa to set beam
21-Oct-2026 16:59:01 2026-10-21 20:59:02        INFO        BeamManipulator::set        Beam parameters:  Major          : 4 arcsec
21-Oct-2026 16:59:01 2026-10-21 20:59:02        INFO        BeamManipulator::set+          Minor          : 2 arcsec
21-Oct-2026 16:59:01 2026-10-21 20:59:02        INFO        BeamManipulator::set+          Position Angle : 0 deg
21-Oct-2026 16:59:01 2026-10-21 20:59:02        INFO        image::_casaQuantityFromVar         Will use values specified in major, minor, pa to set beam
21-Oct-2026 16:59:01 2026-10-21 20:59:02        INFO        BeamManipulator::set        Beam parameters:  Major          : 5 arcsec
21-Oct-2026 16:59:01 2026-10-21 20:59:02        INFO        BeamManipulator::set+          Minor          : 2.5 arcsec
21-Oct-2026 16:59:01 2026-10-21 20:59:02        INFO        BeamManipulator::set+          Position Angle : 1 deg
21-Oct-2026 16:59:01 2026-10-21 20:59:02        INFO        image::_casaQuantityFromVar         Will use values specified in major, minor, pa to set beam
21-Oct-2026 16:59:01 2026-10-21 20:59:02        INFO        BeamManipulator::set        Beam parameters:  Major          : 6 arcsec
21-Oct-2026 16:59:01 2026-10-21 20:59:02        INFO        BeamManipulator::set+          Minor          : 3 arcsec
21-Oct-2026 16:59:01 2026-10-21 20:59:02        INFO        BeamManipulator::set+          Position Angle : 2 deg
21-Oct-2026 16:59:01 2026-10-21 20:59:02        INFO        image::_casaQuantityFromVar         Will use values specified in major, minor, pa to set beam
21-Oct-2026 16:59:01 2026-10-21 20:59:02        INFO        BeamManipulator::set        Beam parameters:  Major          : 7 arcsec
21-Oct-2026 16:59:01 2026-10-21 20:59:02        INFO        BeamManipulator::set+          Minor          : 3.5 arcsec
21-Oct-2026 16:59:01 2026-10-21 20:59:02        INFO        BeamManipulator::set+          Position Angle : 3 deg
21-Oct-2026 16:59:01 2026-10-21 20:59:02        INFO        image::_casaQuantityFromVar         Will use values specified in major, minor, pa to set beam
21-Oct-2026 16:59:01 2026-10-21 20:59:02        INFO        BeamManipulator::set        Beam parameters:  Major          : 5 arcsec
21-Oct-2026 16:59:01 2026-10-21 20:59:02        INFO        BeamManipulator::set+          Minor          : 3 arcsec
21-Oct-2026 16:59:01 2026-10-21 20:59:02        INFO        BeamManipulator::set+          Position Angle : 10 deg
21-Oct-2026 16:59:01 2026-10-21 20:59:02        INFO        image::_casaQuantityFromVar         Will use values specified in major, minor, pa to set beam
21-Oct-2026 16:59:01 2026-10-21 20:59:02        INFO        BeamManipulator::set        Beam parameters:  Major          : 6 arcsec
21-Oct-2026 16:59:01 2026-10-21 20:59:02        INFO        BeamManipulator::set+          Minor          : 3.5 arcsec
21-Oct-2026 16:59:01 2026-10-21 20:59:02        INFO        BeamManipulator::set+          Position Angle : 11 deg
21-Oct-2026 16:59:01 2026-10-21 20:59:02        INFO        image::_casaQuantityFromVar         Will use values specified in major, minor, pa to set beam
21-Oct-2026 16:59:01 2026-10-21 20:59:02        INFO        BeamManipulator::set        Beam parameters:  Major          : 7 arcsec
21-Oct-2026 16:59:01 2026-10-21 20:59:02        INFO        BeamManipulator::set+          Minor          : 4 arcsec
21-Oct-2026 16:59:01 2026-10-21 20:59:02        INFO        BeamManipulator::set+          Position Angle : 12 deg
21-Oct-2026 16:59:01 2026-10-21 20:59:02        INFO        image::_casaQuantityFromVar         Will use values specified in major, minor, pa to set beam
21-Oct-2026 16:59:01 2026-10-21 20:59:02        INFO        BeamManipulator::set        Beam parameters:  Major          : 8 arcsec
21-Oct-2026 16:59:01 2026-10-21 20:59:02        INFO        BeamManipulator::set+          Minor          : 4.5 arcsec
21-Oct-2026 16:59:01 2026-10-21 20:59:02        INFO        BeamManipulator::set+          Position Angle : 13 deg
21-Oct-2026 16:59:01 2026-10-21 20:59:02        INFO        image::_casaQuantityFromVar         Will use values specified in major, minor, pa to set beam
21-Oct-2026 16:59:01 2026-10-21 20:59:02        INFO        BeamManipulator::set        Beam parameters:  Major          : 6 arcsec
21-Oct-2026 16:59:01 2026-10-21 20:59:02        INFO        BeamManipulator::set+          Minor          : 4 arcsec
21-Oct-2026 16:59:01 2026-10-21 20:59:02        INFO        BeamManipulator::set+          Position Angle : 20 deg
21-Oct-2026 16:59:01 2026-10-21 20:59:02        INFO        image::_casaQuantityFromVar         Will use values specified in major, minor, pa to set beam
21-Oct-2026 16:59:01 2026-10-21 20:59:02        INFO        BeamManipulator::set        Beam parameters:  Major          : 7 arcsec
21-Oct-2026 16:59:01 2026-10-21 20:59:02        INFO        BeamManipulator::set+          Minor          : 4.5 arcsec
21-Oct-2026 16:59:01 2026-10-21 20:59:02        INFO        BeamManipulator::set+          Position Angle : 21 deg
21-Oct-2026 16:59:01 2026-10-21 20:59:02        INFO        image::_casaQuantityFromVar         Will use values specified in major, minor, pa to set beam
21-Oct-2026 16:59:01 2026-10-21 20:59:02        INFO        BeamManipulator::set        Beam parameters:  Major          : 8 arcsec
21-Oct-2026 16:59:01 2026-10-21 20:59:02        INFO        BeamManipulator::set+          Minor          : 5 arcsec
21-Oct-2026 16:59:01 2026-10-21 20:59:02        INFO        BeamManipulator::set+          Position Angle : 22 deg
21-Oct-2026 16:59:01 2026-10-21 20:59:02        INFO        image::_casaQuantityFromVar         Will use values specified in major, minor, pa to set beam
21-Oct-2026 16:59:01 2026-10-21 20:59:02        INFO        BeamManipulator::set        Beam parameters:  Major          : 9 arcsec
21-Oct-2026 16:59:01 2026-10-21 20:59:02        INFO        BeamManipulator::set+          Minor          : 5.5 arcsec
21-Oct-2026 16:59:01 2026-10-21 20:59:02        INFO        BeamManipulator::set+          Position Angle : 23 deg
21-Oct-2026 16:59:01 2026-10-21 20:59:02        INFO        image::_casaQuantityFromVar         Will use values specified in major, minor, pa to set beam
21-Oct-2026 16:59:01 2026-10-21 20:59:02        INFO        BeamManipulator::set        Beam parameters:  Major          : 7 arcsec
21-Oct-2026 16:59:01 2026-10-21 20:59:02        INFO        BeamManipulator::set+          Minor          : 5 arcsec
21-Oct-2026 16:59:01 2026-10-21 20:59:02        INFO        BeamManipulator::set+          Position Angle : 30 deg
21-Oct-2026 16:59:01 2026-10-21 20:59:02        INFO        image::_casaQuantityFromVar         Will use values specified in major, minor, pa to set beam
21-Oct-2026 16:59:01 2026-10-21 20:59:02        INFO        BeamManipulator::set        Beam parameters:  Major          : 8 arcsec
21-Oct-2026 16:59:01 2026-10-21 20:59:02        INFO        BeamManipulator::set+          Minor          : 5.5 arcsec
21-Oct-2026 16:59:01 2026-10-21 20:59:02        INFO        BeamManipulator::set+          Position Angle : 31 deg
21-Oct-2026 16:59:01 2026-10-21 20:59:02        INFO        image::_casaQuantityFromVar         Will use values specified in major, minor, pa to set beam
21-Oct-2026 16:59:01 2026-10-21 20:59:02        INFO        BeamManipulator::set        Beam parameters:  Major          : 9 arcsec
21-Oct-2026 16:59:01 2026-10-21 20:59:02        INFO        BeamManipulator::set+          Minor          : 6 arcsec
21-Oct-2026 16:59:01 2026-10-21 20:59:02        INFO        BeamManipulator::set+          Position Angle : 32 deg
21-Oct-2026 16:59:01 2026-10-21 20:59:02        INFO        image::_casaQuantityFromVar         Will use values specified in major, minor, pa to set beam
21-Oct-2026 16:59:01 2026-10-21 20:59:02        INFO        BeamManipulator::set        Beam parameters:  Major          : 10 arcsec
21-Oct-2026 16:59:01 2026-10-21 20:59:02        INFO        BeamManipulator::set+          Minor          : 6.5 arcsec
21-Oct-2026 16:59:01 2026-10-21 20:59:02        INFO        BeamManipulator::set+          Position Angle : 33 deg
21-Oct-2026 16:59:01 2026-10-21 20:59:02        INFO        image::_casaQuantityFromVar         Will use values specified in major, minor, pa to set beam
21-Oct-2026 16:59:01 2026-10-21 20:59:02        INFO        BeamManipulator::set        Beam parameters:  Major          : 8 arcsec
21-Oct-2026 16:59:01 2026-10-21 20:59:02        INFO        BeamManipulator::set+          Minor          : 6 arcsec
21-Oct-2026 16:59:01 2026-10-21 20:59:02        INFO        BeamManipulator::set+          Position Angle : 40 deg
21-Oct-2026 16:59:01 2026-10-21 20:59:02        INFO        image::_casaQuantityFromVar         Will use values specified in major, minor, pa to set beam
21-Oct-2026 16:59:01 2026-10-21 20:59:02        INFO        BeamManipulator::set        Beam parameters:  Major          : 9 arcsec
21-Oct-2026 16:59:01 2026-10-21 20:59:02        INFO        BeamManipulator::set+          Minor          : 6.5 arcsec
21-Oct-2026 16:59:01 2026-10-21 20:59:02        INFO        BeamManipulator::set+          Position Angle : 41 deg
21-Oct-2026 16:59:01 2026-10-21 20:59:02        INFO        image::_casaQuantityFromVar         Will use values specified in major, minor, pa to set beam
21-Oct-2026 16:59:01 2026-10-21 20:59:02        INFO        BeamManipulator::set        Beam parameters:  Major          : 10 arcsec
21-Oct-2026 16:59:01 2026-10-21 20:59:02        INFO        BeamManipulator::set+          Minor          : 7 arcsec
21-Oct-2026 16:59:01 2026-10-21 20:59:02        INFO        BeamManipulator::set+          Position Angle : 42 deg
21-Oct-2026 16:59:01 2026-10-21 20:59:02        INFO        image::_casaQuantityFromVar         Will use values specified in major, minor, pa to set beam
21-Oct-2026 16:59:01 2026-10-21 20:59:02        INFO        BeamManipulator::set        Beam parameters:  Major          : 11 arcsec
21-Oct-2026 16:59:01 2026-10-21 20:59:02        INFO        BeamManipulator::set+          Minor          : 7.5 arcsec
21-Oct-2026 16:59:01 2026-10-21 20:59:02        INFO        BeamManipulator::set+          Position Angle : 43 deg
21-Oct-2026 16:59:01 2026-10-21 20:59:02        INFO        image::_casaQuantityFromVar         Will use values specified in major, minor, pa to set beam
21-Oct-2026 16:59:01 2026-10-21 20:59:02        INFO        BeamManipulator::set        Beam parameters:  Major          : 9 arcsec
21-Oct-2026 16:59:01 2026-10-21 20:59:02        INFO        BeamManipulator::set+          Minor          : 7 arcsec
21-Oct-2026 16:59:01 2026-10-21 20:59:02        INFO        BeamManipulator::set+          Position Angle : 50 deg
21-Oct-2026 16:59:01 2026-10-21 20:59:02        INFO        image::_casaQuantityFromVar         Will use values specified in major, minor, pa to set beam
21-Oct-2026 16:59:01 2026-10-21 20:59:02        INFO        BeamManipulator::set        Beam parameters:  Major          : 10 arcsec
21-Oct-2026 16:59:01 2026-10-21 20:59:02        INFO        BeamManipulator::set+          Minor          : 7.5 arcsec
21-Oct-2026 16:59:01 2026-10-21 20:59:02        INFO        BeamManipulator::set+          Position Angle : 51 deg
21-Oct-2026 16:59:01 2026-10-21 20:59:02        INFO        image::_casaQuantityFromVar         Will use values specified in major, minor, pa to set beam
21-Oct-2026 16:59:01 2026-10-21 20:59:02        INFO        BeamManipulator::set        Beam parameters:  Major          : 11 arcsec
21-Oct-2026 16:59:01 2026-10-21 20:59:02        INFO        BeamManipulator::set+          Minor          : 8 arcsec
21-Oct-2026 16:59:01 2026-10-21 20:59:02        INFO        BeamManipulator::set+          Position Angle : 52 deg
21-Oct-2026 16:59:01 2026-10-21 20:59:02        INFO        image::_casaQuantityFromVar         Will use values specified in major, minor, pa to set beam
21-Oct-2026 16:59:01 2026-10-21 20:59:02        INFO        BeamManipulator::set        Beam parameters:  Major          : 12 arcsec
21-Oct-2026 16:59:01 2026-10-21 20:59:02        INFO        BeamManipulator::set+          Minor          : 8.5 arcsec
21-Oct-2026 16:59:01 2026-10-21 20:59:02        INFO        BeamManipulator::set+          Position Angle : 53 deg
21-Oct-2026 16:59:01 2026-10-21 20:59:02        INFO        image::_casaQuantityFromVar         Will use values specified in major, minor, pa to set beam
21-Oct-2026 16:59:01 2026-10-21 20:59:02        INFO        BeamManipulator::set        Beam parameters:  Major          : 10 arcsec
21-Oct-2026 16:59:01 2026-10-21 20:59:02        INFO        BeamManipulator::set+          Minor          : 8 arcsec
21-Oct-2026 16:59:01 2026-10-21 20:59:02        INFO        BeamManipulator::set+          Position Angle : 60 deg
21-Oct-2026 16:59:01 2026-10-21 20:59:02        INFO        image::_casaQuantityFromVar         Will use values specified in major, minor, pa to set beam
21-Oct-2026 16:59:01 2026-10-21 20:59:02        INFO        BeamManipulator::set        Beam parameters:  Major          : 11 arcsec
21-Oct-2026 16:59:01 2026-10-21 20:59:02        INFO        BeamManipulator::set+          Minor          : 8.5 arcsec
21-Oct-2026 16:59:01 2026-10-21 20:59:02        INFO        BeamManipulator::set+          Position Angle : 61 deg
21-Oct-2026 16:59:01 2026-10-21 20:59:02        INFO        image::_casaQuantityFromVar         Will use values specified in major, minor, pa to set beam
21-Oct-2026 16:59:01 2026-10-21 20:59:02        INFO        BeamManipulator::set        Beam parameters:  Major          : 12 arcsec
21-Oct-2026 16:59:01 2026-10-21 20:59:02        INFO        BeamManipulator::set+          Minor          : 9 arcsec
21-Oct-2026 16:59:01 2026-10-21 20:59:02        INFO        BeamManipulator::set+          Position Angle : 62 deg
21-Oct-2026 16:59:01 2026-10-21 20:59:02        INFO        image::_casaQuantityFromVar         Will use values specified in major, minor, pa to set beam
21-Oct-2026 16:59:01 2026-10-21 20:59:02        INFO        BeamManipulator::set        Beam parameters:  Major          : 13 arcsec
21-Oct-2026 16:59:01 2026-10-21 20:59:02        INFO        BeamManipulator::set+          Minor          : 9.5 arcsec
21-Oct-2026 16:59:01 2026-10-21 20:59:02        INFO        BeamManipulator::set+          Position Angle : 63 deg
21-Oct-2026 16:59:01 2026-10-21 20:59:02        INFO        image::_casaQuantityFromVar         Will use values specified in major, minor, pa to set beam
21-Oct-2026 16:59:01 2026-10-21 20:59:02        INFO        BeamManipulator::set        Beam parameters:  Major          : 11 arcsec
21-Oct-2026 16:59:01 2026-10-21 20:59:02        INFO        BeamManipulator::set+          Minor          : 9 arcsec
21-Oct-2026 16:59:01 2026-10-21 20:59:02        INFO        BeamManipulator::set+          Position Angle : 70 deg
21-Oct-2026 16:59:01 2026-10-21 20:59:02        INFO        image::_casaQuantityFromVar         Will use values specified in major, minor, pa to set beam
21-Oct-2026 16:59:01 2026-10-21 20:59:02        INFO        BeamManipulator::set        Beam parameters:  Major          : 12 arcsec
21-Oct-2026 16:59:01 2026-10-21 20:59:02        INFO        BeamManipulator::set+          Minor          : 9.5 arcsec
21-Oct-2026 16:59:01 2026-10-21 20:59:02        INFO        BeamManipulator::set+          Position Angle : 71 deg
21-Oct-2026 16:59:01 2026-10-21 20:59:02        INFO        image::_casaQuantityFromVar         Will use values specified in major, minor, pa to set beam
21-Oct-2026 16:59:01 2026-10-21 20:59:02        INFO        BeamManipulator::set        Beam parameters:  Major          : 13 arcsec
21-Oct-2026 16:59:01 2026-10-21 20:59:02        INFO        BeamManipulator::set+          Minor          : 10 arcsec
21-Oct-2026 16:59:01 2026-10-21 20:59:02        INFO        BeamManipulator::set+          Position Angle : 72 deg
21-Oct-2026 16:59:01 2026-10-21 20:59:02        INFO        image::_casaQuantityFromVar         Will use values specified in major, minor, pa to set beam
21-Oct-2026 16:59:01 2026-10-21 20:59:02        INFO        BeamManipulator::set        Beam parameters:  Major          : 14 arcsec
21-Oct-2026 16:59:01 2026-10-21 20:59:02        INFO        BeamManipulator::set+          Minor          : 10.5 arcsec
21-Oct-2026 16:59:01 2026-10-21 20:59:02        INFO        BeamManipulator::set+          Position Angle : 73 deg
21-Oct-2026 16:59:01 2026-10-21 20:59:02        INFO        image::_casaQuantityFromVar         Will use values specified in major, minor, pa to set beam
21-Oct-2026 16:59:01 2026-10-21 20:59:02        INFO        BeamManipulator::set        Beam parameters:  Major          : 12 arcsec
21-Oct-2026 16:59:01 2026-10-21 20:59:02        INFO        BeamManipulator::set+          Minor          : 10 arcsec
21-Oct-2026 16:59:01 2026-10-21 20:59:02        INFO        BeamManipulator::set+          Position Angle : 80 deg
21-Oct-2026 16:59:01 2026-10-21 20:59:02        INFO        image::_casaQuantityFromVar         Will use values specified in major, minor, pa to set beam
21-Oct-2026 16:59:01 2026-10-21 20:59:02        INFO        BeamManipulator::set        Beam parameters:  Major          : 13 arcsec
21-Oct-2026 16:59:01 2026-10-21 20:59:02        INFO        BeamManipulator::set+          Minor          : 10.5 arcsec
21-Oct-2026 16:59:01 2026-10-21 20:59:02        INFO        BeamManipulator::set+          Position Angle : 81 deg
21-Oct-2026 16:59:01 2026-10-21 20:59:02        INFO        image::_casaQuantityFromVar         Will use values specified in major, minor, pa to set beam
21-Oct-2026 16:59:01 2026-10-21 20:59:02        INFO        BeamManipulator::set        Beam parameters:  Major          : 14 arcsec
21-Oct-2026 16:59:01 2026-10-21 20:59:02        INFO        BeamManipulator::set+          Minor          : 11 arcsec
21-Oct-2026 16:59:01 2026-10-21 20:59:02        INFO        BeamManipulator::set+          Position Angle : 82 deg
21-Oct-2026 16:59:01 2026-10-21 20:59:02        INFO        image::_casaQuantityFromVar         Will use values specified in major, minor, pa to set beam
21-Oct-2026 16:59:01 2026-10-21 20:59:02        INFO        BeamManipulator::set        Beam parameters:  Major          : 15 arcsec
21-Oct-2026 16:59:01 2026-10-21 20:59:02        INFO        BeamManipulator::set+          Minor          : 11.5 arcsec
21-Oct-2026 16:59:01 2026-10-21 20:59:02        INFO        BeamManipulator::set+          Position Angle : 83 deg
21-Oct-2026 16:59:01 2026-10-21 20:59:02        INFO        image::_casaQuantityFromVar         Will use values specified in major, minor, pa to set beam
21-Oct-2026 16:59:01 2026-10-21 20:59:02        INFO        BeamManipulator::set        Beam parameters:  Major          : 13 arcsec
21-Oct-2026 16:59:01 2026-10-21 20:59:02        INFO        BeamManipulator::set+          Minor          : 11 arcsec
21-Oct-2026 16:59:01 2026-10-21 20:59:02        INFO        BeamManipulator::set+          Position Angle : 90 deg
21-Oct-2026 16:59:01 2026-10-21 20:59:02        INFO        image::_casaQuantityFromVar         Will use values specified in major, minor, pa to set beam
21-Oct-2026 16:59:01 2026-10-21 20:59:02        INFO        BeamManipulator::set        Beam parameters:  Major          : 14 arcsec
21-Oct-2026 16:59:01 2026-10-21 20:59:02        INFO        BeamManipulator::set+          Minor          : 11.5 arcsec
21-Oct-2026 16:59:01 2026-10-21 20:59:02        INFO        BeamManipulator::set+          Position Angle : 91 deg
21-Oct-2026 16:59:01 2026-10-21 20:59:02        INFO        image::_casaQuantityFromVar         Will use values specified in major, minor, pa to set beam
21-Oct-2026 16:59:01 2026-10-21 20:59:02        INFO        BeamManipulator::set        Beam parameters:  Major          : 15 arcsec
21-Oct-2026 16:59:01 2026-10-21 20:59:02        INFO        BeamManipulator::set+          Minor          : 12 arcsec
21-Oct-2026 16:59:01 2026-10-21 20:59:02        INFO        BeamManipulator::set+          Position Angle : 92 deg
21-Oct-2026 16:59:01 2026-10-21 20:59:02        INFO        image::_casaQuantityFromVar         Will use values specified in major, minor, pa to set beam
21-Oct-2026 16:59:01 2026-10-21 20:59:02        INFO        BeamManipulator::set        Beam parameters:  Major          : 16 arcsec
21-Oct-2026 16:59:01 2026-10-21 20:59:02        INFO        BeamManipulator::set+          Minor          : 12.5 arcsec
21-Oct-2026 16:59:01 2026-10-21 20:59:02        INFO        BeamManipulator::set+          Position Angle : 93 deg
21-Oct-2026 16:59:01 2026-10-21 20:59:02        INFO        ImageRegion::fromRecord        Selected bounding box :
21-Oct-2026 16:59:01 2026-10-21 20:59:02        INFO        ImageRegion::fromRecord+            [1, 1, 1, 1] to [2, 2, 2, 2]  (00:00:16.000, -00.04.00.000, 1.415e+09Hz, Q to 00:00:12.000, -00.03.00.000, 1.415e+09Hz, U)
21-Oct-2026 16:59:01 2026-10-21 20:59:02        WARN        ImageCollapser::_doMultipleBeams        Input image has per plane beams but the collapse is not done exclusively along the direction axes. The output image will arbitrarily have a single beam which is the first beam available in the subimage.Thus, the image planes will not be convolved to a common restoring beam before collapsing. If, however, this is desired, then run the task imsmooth or the tool method ia.convolve2d() first, and use the output image of that as the input for collapsing.
21-Oct-2026 16:59:01 2026-10-21 20:59:02        INFO        name::        No table opened.
21-Oct-2026 16:59:01 2026-10-21 20:59:02        INFO        showcache::        The Table Cache is empty.
21-Oct-2026 16:59:01 2026-10-21 20:59:02        INFO        name::        No table opened.
21-Oct-2026 16:59:01 2026-10-21 20:59:02        INFO        name::        No table opened.
21-Oct-2026 16:59:01 test_tool_image_collapse.py::ia_collapse_test::test_beams
21-Oct-2026 16:59:01 test per plane beams
21-Oct-2026 16:59:01 PASSED
21-Oct-2026 16:59:01
21-Oct-2026 16:59:01 2026-10-21 20:59:02        INFO        ImageFactory::createImage        Created Temp image  of shape [2, 2, 2] with Complex valued pixels.
21-Oct-2026 16:59:01 2026-10-21 20:59:02        INFO        ImageRegion::fromRecord        Selected bounding box :
21-Oct-2026 16:59:01 2026-10-21 20:59:02        INFO        ImageRegion::fromRecord+            [0, 0, 0] to [1, 1, 1]  (00:00:04.000, -00.01.00.000, I to 00:00:00.000, +00.00.00.000, Q)
21-Oct-2026 16:59:01 2026-10-21 20:59:02        INFO        ImageRegion::fromRecord        Selected bounding box :
21-Oct-2026 16:59:01 2026-10-21 20:59:02        INFO        ImageRegion::fromRecord+            [0, 0, 0] to [1, 1, 0]  (00:00:04.000, -00.01.00.000, I to 00:00:00.000, +00.00.00.000, I)
21-Oct-2026 16:59:01 2026-10-21 20:59:02        INFO        ImageRegion::fromRecord        Selected bounding box :
21-Oct-2026 16:59:01 2026-10-21 20:59:02        INFO        ImageRegion::fromRecord+            [0, 0, 0] to [1, 1, 1]  (00:00:04.000, -00.01.00.000, I to 00:00:00.000, +00.00.00.000, Q)
21-Oct-2026 16:59:01 2026-10-21 20:59:02        INFO        ImageRegion::fromRecord        Selected bounding box :
21-Oct-2026 16:59:01 2026-10-21 20:59:02        INFO        ImageRegion::fromRecord+            [0, 0, 0] to [1, 1, 0]  (00:00:04.000, -00.01.00.000, I to 00:00:00.000, +00.00.00.000, I)
21-Oct-2026 16:59:01 2026-10-21 20:59:02        INFO        name::        No table opened.
21-Oct-2026 16:59:01 2026-10-21 20:59:02        INFO        showcache::        The Table Cache is empty.
21-Oct-2026 16:59:01 2026-10-21 20:59:02        INFO        name::        No table opened.
21-Oct-2026 16:59:01 2026-10-21 20:59:02        INFO        name::        No table opened.
21-Oct-2026 16:59:01 test_tool_image_collapse.py::ia_collapse_test::test_complex
21-Oct-2026 16:59:01 Test support for complex valued images
21-Oct-2026 16:59:01 PASSED
21-Oct-2026 16:59:01
21-Oct-2026 16:59:01 2026-10-21 20:59:02        SEVERE        image::open (file /private/var/folders/60/83wxljbx2vlfbx_hy0yfv8rc0000gn/T/build-via-sdist-sp0okgic/casatools-6.8.0.0+dirty/src/tools/image/image_cmpt.cc, line 4208)        Exception Reported: Exception: File mybogus.im does not exist..
21-Oct-2026 16:59:01 2026-10-21 20:59:02        SEVERE        image::open (file /private/var/folders/60/83wxljbx2vlfbx_hy0yfv8rc0000gn/T/build-via-sdist-sp0okgic/casatools-6.8.0.0+dirty/src/tools/image/image_cmpt.cc, line 4208)+        ... thrown by static void casa::ImageFactory::_checkInfile(const String &) at File: /Users/casaci/bamboohome/xml-data/build-dir/CASASPECS-PR239-BPMACOS15PY312/casa6/casatools/src/code/imageanalysis/ImageAnalysis/ImageFactory2.cc, line: 378
21-Oct-2026 16:59:01 2026-10-21 20:59:02        INFO        FITSCoordinateUtil::fromFITSHeader        Neither SPECSYS nor VELREF keyword given, spectral reference frame not defined ...
21-Oct-2026 16:59:01 2026-10-21 20:59:02        SEVERE        image::collapse (file /private/var/folders/60/83wxljbx2vlfbx_hy0yfv8rc0000gn/T/build-via-sdist-sp0okgic/casatools-6.8.0.0+dirty/src/tools/image/image_cmpt.cc, line 712)        Exception Reported: Exception: Aggregate function name is not specified and it must be..
21-Oct-2026 16:59:01 2026-10-21 20:59:02        SEVERE        image::collapse (file /private/var/folders/60/83wxljbx2vlfbx_hy0yfv8rc0000gn/T/build-via-sdist-sp0okgic/casatools-6.8.0.0+dirty/src/tools/image/image_cmpt.cc, line 712)+        ... thrown by static ImageCollapserData::AggregateType casa::ImageCollapserData::aggregateType(const String &) at File: /Users/casaci/bamboohome/xml-data/build-dir/CASASPECS-PR239-BPMACOS15PY312/casa6/casatools/src/code/imageanalysis/ImageAnalysis/ImageCollapserData.cc, line: 68
21-Oct-2026 16:59:01 2026-10-21 20:59:02        INFO        FITSCoordinateUtil::fromFITSHeader        Neither SPECSYS nor VELREF keyword given, spectral reference frame not defined ...
21-Oct-2026 16:59:01 2026-10-21 20:59:02        SEVERE        image::collapse (file /private/var/folders/60/83wxljbx2vlfbx_hy0yfv8rc0000gn/T/build-via-sdist-sp0okgic/casatools-6.8.0.0+dirty/src/tools/image/image_cmpt.cc, line 712)        Exception Reported: Unknown aggregate function specified by bogus function at File: /Users/casaci/bamboohome/xml-data/build-dir/CASASPECS-PR239-BPMACOS15PY312/casa6/casatools/src/code/imageanalysis/ImageAnalysis/ImageCollapserData.cc, line: 84
21-Oct-2026 16:59:01 2026-10-21 20:59:02        INFO        FITSCoordinateUtil::fromFITSHeader        Neither SPECSYS nor VELREF keyword given, spectral reference frame not defined ...
21-Oct-2026 16:59:01 2026-10-21 20:59:02        WARN                /Users/casaci/bamboohome/xml-data/build-dir/CASASPECS-PR239-TTO14/casa6/casatestutils/nosedir/test_tool_image_collapse/collapse_in.fits is not a valid or readable table
21-Oct-2026 16:59:01 2026-10-21 20:59:02        SEVERE                Cannot read image /Users/casaci/bamboohome/xml-data/build-dir/CASASPECS-PR239-TTO14/casa6/casatestutils/nosedir/test_tool_image_collapse/collapse_in.fits to get region bogus_region
21-Oct-2026 16:59:01 2026-10-21 20:59:02        SEVERE        image::collapse (file /private/var/folders/60/83wxljbx2vlfbx_hy0yfv8rc0000gn/T/build-via-sdist-sp0okgic/casatools-6.8.0.0+dirty/src/tools/image/image_cmpt.cc, line 712)        Exception Reported: Unable to open region file or region table description bogus_region in image /Users/casaci/bamboohome/xml-data/build-dir/CASASPECS-PR239-TTO14/casa6/casatestutils/nosedir/test_tool_image_collapse/collapse_in.fits at File: /Users/casaci/bamboohome/xml-data/build-dir/CASASPECS-PR239-BPMACOS15PY312/casa6/casatools/src/code/imageanalysis/Regions/CasacRegionManager.cc, line: 489
21-Oct-2026 16:59:01 2026-10-21 20:59:02        INFO        FITSCoordinateUtil::fromFITSHeader        Neither SPECSYS nor VELREF keyword given, spectral reference frame not defined ...
21-Oct-2026 16:59:01 2026-10-21 20:59:02        SEVERE        image::collapse (file /private/var/folders/60/83wxljbx2vlfbx_hy0yfv8rc0000gn/T/build-via-sdist-sp0okgic/casatools-6.8.0.0+dirty/src/tools/image/image_cmpt.cc, line 712)        Exception Reported: Exception: box not specified correctly.
21-Oct-2026 16:59:01 2026-10-21 20:59:02        SEVERE        image::collapse (file /private/var/folders/60/83wxljbx2vlfbx_hy0yfv8rc0000gn/T/build-via-sdist-sp0okgic/casatools-6.8.0.0+dirty/src/tools/image/image_cmpt.cc, line 712)+        ... thrown by Record casa::CasacRegionManager::fromBCS(String &, uInt &, String &, const Record *const &, const String &, const String &, const StokesControl, const String &, const IPosition &, const String &, Bool) at File: /Users/casaci/bamboohome/xml-data/build-dir/CASASPECS-PR239-BPMACOS15PY312/casa6/casatools/src/code/imageanalysis/Regions/CasacRegionManager.cc, line: 235
21-Oct-2026 16:59:01 2026-10-21 20:59:02        INFO        FITSCoordinateUtil::fromFITSHeader        Neither SPECSYS nor VELREF keyword given, spectral reference frame not defined ...
21-Oct-2026 16:59:01 2026-10-21 20:59:02        INFO        CasacRegionManager::_fromBCS        dAxisNum0=0 dAxisNum1=1x=1000 imShape[0]=3 y=1000 imShape[1]=3
21-Oct-2026 16:59:01 2026-10-21 20:59:02        SEVERE        CasacRegionManager::_fromBCS        trc in box spec is greater than or equal to number of direction coordinate pixels in the image
21-Oct-2026 16:59:01 2026-10-21 20:59:02        SEVERE        image::collapse (file /private/var/folders/60/83wxljbx2vlfbx_hy0yfv8rc0000gn/T/build-via-sdist-sp0okgic/casatools-6.8.0.0+dirty/src/tools/image/image_cmpt.cc, line 712)        Exception Reported: 2026-10-21 20:59:02        SEVERE        CasacRegionManager::_fromBCS        trc in box spec is greater than or equal to number of direction coordinate pixels in the image
21-Oct-2026 16:59:01 2026-10-21 20:59:02        INFO        FITSCoordinateUtil::fromFITSHeader        Neither SPECSYS nor VELREF keyword given, spectral reference frame not defined ...
21-Oct-2026 16:59:01 2026-10-21 20:59:02        SEVERE        CoordinateSystem::getWorldAxesOrder (file ../../coordinates/Coordinates/CoordinateSystem.cc, line 4663)        Multiple axes [right ascension,declination,frequency,stokes] match requested axis
21-Oct-2026 16:59:01 2026-10-21 20:59:02        SEVERE        image::collapse (file /private/var/folders/60/83wxljbx2vlfbx_hy0yfv8rc0000gn/T/build-via-sdist-sp0okgic/casatools-6.8.0.0+dirty/src/tools/image/image_cmpt.cc, line 712)        Exception Reported: 2026-10-21 20:59:02        SEVERE        CoordinateSystem::getWorldAxesOrder (file ../../coordinates/Coordinates/CoordinateSystem.cc, line 4663)        Multiple axes [right ascension,declination,frequency,stokes] match requested axis
21-Oct-2026 16:59:01 2026-10-21 20:59:02        INFO        FITSCoordinateUtil::fromFITSHeader        Neither SPECSYS nor VELREF keyword given, spectral reference frame not defined ...
21-Oct-2026 16:59:01 2026-10-21 20:59:02        SEVERE        image::collapse (file /private/var/folders/60/83wxljbx2vlfbx_hy0yfv8rc0000gn/T/build-via-sdist-sp0okgic/casatools-6.8.0.0+dirty/src/tools/image/image_cmpt.cc, line 712)        Exception Reported: Exception: Specified zero-based axis (10) must be less than the number of axes in /Users/casaci/bamboohome/xml-data/build-dir/CASASPECS-PR239-TTO14/casa6/casatestutils/nosedir/test_tool_image_collapse/collapse_in.fits(4).
21-Oct-2026 16:59:01 2026-10-21 20:59:02        SEVERE        image::collapse (file /private/var/folders/60/83wxljbx2vlfbx_hy0yfv8rc0000gn/T/build-via-sdist-sp0okgic/casatools-6.8.0.0+dirty/src/tools/image/image_cmpt.cc, line 712)+        ... thrown by void casa::ImageCollapser<float>::_finishConstruction() [T = float] at File: /Users/casaci/bamboohome/xml-data/build-dir/CASASPECS-PR239-BPMACOS15PY312/casainstall/include/casacpp/imageanalysis/ImageAnalysis/ImageCollapser.tcc, line: 564
21-Oct-2026 16:59:01 2026-10-21 20:59:02        INFO        name::        No table opened.
21-Oct-2026 16:59:01 2026-10-21 20:59:02        INFO        showcache::        The Table Cache is empty.
21-Oct-2026 16:59:01 2026-10-21 20:59:02        INFO        name::        No table opened.
21-Oct-2026 16:59:01 2026-10-21 20:59:02        INFO        name::        No table opened.
21-Oct-2026 16:59:01 test_tool_image_collapse.py::ia_collapse_test::test_exceptions
21-Oct-2026 16:59:01 ia.collapse: Test various exception cases
21-Oct-2026 16:59:01 PASSED
21-Oct-2026 16:59:01
21-Oct-2026 16:59:01 2026-10-21 20:59:02        INFO        ImageFactory::createImage        Created Paged image 'flux_test.im' of shape [10, 10, 10] with float valued pixels.
21-Oct-2026 16:59:01 2026-10-21 20:59:02        INFO        ImageRegion::fromRecord        Selected bounding box :
21-Oct-2026 16:59:01 2026-10-21 20:59:02        INFO        ImageRegion::fromRecord+            [0, 0, 0] to [9, 9, 9]  (00:00:20.000, -00.05.00.000, 1.415e+09Hz to 23:59:44.000, +00.04.00.000, 1.415e+09Hz)
21-Oct-2026 16:59:01 2026-10-21 20:59:02        SEVERE        image::collapse (file /private/var/folders/60/83wxljbx2vlfbx_hy0yfv8rc0000gn/T/build-via-sdist-sp0okgic/casatools-6.8.0.0+dirty/src/tools/image/image_cmpt.cc, line 712)        Exception Reported: Unable to calculate flux density: [] at File: /Users/casaci/bamboohome/xml-data/build-dir/CASASPECS-PR239-BPMACOS15PY312/casainstall/include/casacpp/imageanalysis/ImageAnalysis/ImageCollapser.tcc, line: 433
21-Oct-2026 16:59:01 2026-10-21 20:59:02        INFO        image::_casaQuantityFromVar         Will use values specified in major, minor, pa to set beam
21-Oct-2026 16:59:01 2026-10-21 20:59:02        INFO        BeamManipulator::set        Setting (global) restoring beam.
21-Oct-2026 16:59:01 2026-10-21 20:59:02        INFO        BeamManipulator::set        Beam parameters:  Major          : 3 arcmin
21-Oct-2026 16:59:01 2026-10-21 20:59:02        INFO        BeamManipulator::set+          Minor          : 3 arcmin
21-Oct-2026 16:59:01 2026-10-21 20:59:02        INFO        BeamManipulator::set+          Position Angle : 0 deg
21-Oct-2026 16:59:01 2026-10-21 20:59:02        INFO        ImageRegion::fromRecord        Selected bounding box :
21-Oct-2026 16:59:01 2026-10-21 20:59:02        INFO        ImageRegion::fromRecord+            [0, 0, 0] to [9, 9, 9]  (00:00:20.000, -00.05.00.000, 1.415e+09Hz to 23:59:44.000, +00.04.00.000, 1.415e+09Hz)
21-Oct-2026 16:59:01 2026-10-21 20:59:02        INFO        name::        No table opened.
21-Oct-2026 16:59:01 2026-10-21 20:59:02        INFO        showcache::        The Table Cache is empty.
21-Oct-2026 16:59:01 2026-10-21 20:59:02        INFO        name::        No table opened.
21-Oct-2026 16:59:01 2026-10-21 20:59:02        INFO        name::        No table opened.
21-Oct-2026 16:59:01 test_tool_image_collapse.py::ia_collapse_test::test_flux
21-Oct-2026 16:59:01 Test flux function
21-Oct-2026 16:59:01 PASSED
21-Oct-2026 16:59:01
21-Oct-2026 16:59:01 2026-10-21 20:59:02        INFO        ImageFactory::createImage        Created Temp image  of shape [20, 20, 20] with float valued pixels.
21-Oct-2026 16:59:01 2026-10-21 20:59:02        INFO        ImageRegion::fromRecord        Selected bounding box :
21-Oct-2026 16:59:01 2026-10-21 20:59:02        INFO        ImageRegion::fromRecord+            [0, 0, 0] to [19, 19, 19]  (00:00:40.000, -00.10.00.001, 1.41499e+09Hz to 23:59:24.000, +00.09.00.001, 1.41501e+09Hz)
21-Oct-2026 16:59:01 2026-10-21 20:59:02        INFO        ::::ImageFactory::createImage        Created Temp image  of shape [20, 20, 20] with float valued pixels.
21-Oct-2026 16:59:01 2026-10-21 20:59:02        INFO        ::::image::fromshape        Ran ia.fromshape
21-Oct-2026 16:59:01 2026-10-21 20:59:02        INFO        ::::image::fromshape        ia.fromshape(outfile="", shape=[20,20,20], csys={...}, linear=false, overwrite=false, log=true, type="f")
21-Oct-2026 16:59:01 2026-10-21 20:59:02        INFO        ::::image::collapse        Ran ia.collapse on Temporary_Image
21-Oct-2026 16:59:01 2026-10-21 20:59:02        INFO        ::::image::collapse        ia.collapse(function='mean', axes=2, outfile='', region='', box='', chans='', stokes='', mask='', overwrite=false, stretch=false)
21-Oct-2026 16:59:01 2026-10-21 20:59:02        INFO        name::        No table opened.
21-Oct-2026 16:59:01 2026-10-21 20:59:02        INFO        showcache::        The Table Cache is empty.
21-Oct-2026 16:59:01 2026-10-21 20:59:02        INFO        name::        No table opened.
21-Oct-2026 16:59:01 2026-10-21 20:59:02        INFO        name::        No table opened.
21-Oct-2026 16:59:01 test_tool_image_collapse.py::ia_collapse_test::test_history
21-Oct-2026 16:59:01 Test history record is written
21-Oct-2026 16:59:01 PASSED
21-Oct-2026 16:59:01
21-Oct-2026 16:59:01 2026-10-21 20:59:02        INFO        ImageFactory::createImage        Created Paged image 'median.im' of shape [3, 3, 3] with float valued pixels.
21-Oct-2026 16:59:01 2026-10-21 20:59:02        INFO        ImageRegion::fromRecord        Selected bounding box :
21-Oct-2026 16:59:01 2026-10-21 20:59:02        INFO        ImageRegion::fromRecord+            [0, 0, 0] to [2, 2, 2]  (00:00:04.000, -00.01.00.000, I to 23:59:56.000, +00.01.00.000, U)
21-Oct-2026 16:59:01 2026-10-21 20:59:02        INFO        ImageRegion::fromRecord        Selected bounding box :
21-Oct-2026 16:59:01 2026-10-21 20:59:02        INFO        ImageRegion::fromRecord+            [0, 0, 0] to [2, 2, 2]  (00:00:04.000, -00.01.00.000, I to 23:59:56.000, +00.01.00.000, U)
21-Oct-2026 16:59:01 2026-10-21 20:59:02        INFO        ImageFactory::createImage        Created Temp image  of shape [20, 20, 5] with float valued pixels.
21-Oct-2026 16:59:01 2026-10-21 20:59:02        INFO        AsciiRegionFileParser::_parse        Combined 1 image regions (which excludes any annotation regions)
21-Oct-2026 16:59:01 2026-10-21 20:59:02        INFO        AsciiRegionFileParser::_parse        The specified region will select all pixels that are included in the region. Full pixels will be included even when they are only partially covered by the region(s).
21-Oct-2026 16:59:01 2026-10-21 20:59:02        INFO        ImageRegion::fromRecord        Selected bounding box :
21-Oct-2026 16:59:01 2026-10-21 20:59:02        INFO        ImageRegion::fromRecord+            [5, 5, 0] to [15, 15, 4]  (00:00:20.000, -00.05.00.000, 1.415e+09Hz to 23:59:40.000, +00.05.00.000, 1.415e+09Hz)
21-Oct-2026 16:59:01 2026-10-21 20:59:02        INFO        name::        No table opened.
21-Oct-2026 16:59:01 2026-10-21 20:59:02        INFO        showcache::        The Table Cache is empty.
21-Oct-2026 16:59:01 2026-10-21 20:59:02        INFO        name::        No table opened.
21-Oct-2026 16:59:01 2026-10-21 20:59:02        INFO        name::        No table opened.
21-Oct-2026 16:59:01 test_tool_image_collapse.py::ia_collapse_test::test_median
21-Oct-2026 16:59:01 Test median when collapsing along multiple axes
21-Oct-2026 16:59:01 PASSED
21-Oct-2026 16:59:01
21-Oct-2026 16:59:01 2026-10-21 20:59:02        INFO        ImageFactory::createImage        Created Temp image  of shape [10, 10, 10] with float valued pixels.
21-Oct-2026 16:59:01 2026-10-21 20:59:02        INFO        ImageRegion::fromRecord        Selected bounding box :
21-Oct-2026 16:59:01 2026-10-21 20:59:02        INFO        ImageRegion::fromRecord+            [0, 4, 0] to [9, 6, 9]  (00:00:20.000, -00.01.00.000, 1.415e+09Hz to 23:59:44.000, +00.01.00.000, 1.415e+09Hz)
21-Oct-2026 16:59:01 2026-10-21 20:59:02        INFO        name::        No table opened.
21-Oct-2026 16:59:01 2026-10-21 20:59:02        INFO        showcache::        The Table Cache is empty.
21-Oct-2026 16:59:01 2026-10-21 20:59:02        INFO        name::        No table opened.
21-Oct-2026 16:59:01 2026-10-21 20:59:02        INFO        name::        No table opened.
21-Oct-2026 16:59:01 test_tool_image_collapse.py::ia_collapse_test::test_region
21-Oct-2026 16:59:01 ia.collapse(): Test region
21-Oct-2026 16:59:01 PASSED
21-Oct-2026 16:59:01
21-Oct-2026 16:59:01 2026-10-21 20:59:02        INFO        ImageFactory::createImage        Created Temp image  of shape [2, 2, 2] with float valued pixels.
21-Oct-2026 16:59:01 2026-10-21 20:59:02        INFO        ImageRegion::fromRecord        Selected bounding box :
21-Oct-2026 16:59:01 2026-10-21 20:59:02        INFO        ImageRegion::fromRecord+            [0, 0, 0] to [1, 1, 1]  (00:00:04.000, -00.01.00.000, I to 00:00:00.000, +00.00.00.000, Q)
21-Oct-2026 16:59:01 2026-10-21 20:59:02        INFO        ImageRegion::fromRecord        Selected bounding box :
21-Oct-2026 16:59:01 2026-10-21 20:59:02        INFO        ImageRegion::fromRecord+            [0, 0, 0] to [1, 1, 1]  (00:00:04.000, -00.01.00.000, I to 00:00:00.000, +00.00.00.000, Q)
21-Oct-2026 16:59:01 2026-10-21 20:59:02        INFO        name::        No table opened.
21-Oct-2026 16:59:01 2026-10-21 20:59:02        INFO        showcache::        The Table Cache is empty.
21-Oct-2026 16:59:01 2026-10-21 20:59:02        INFO        name::        No table opened.
21-Oct-2026 16:59:01 2026-10-21 20:59:02        INFO        name::        No table opened.
21-Oct-2026 16:59:01 test_tool_image_collapse.py::ia_collapse_test::test_sqrtsum
21-Oct-2026 16:59:01 Test sqrtsum function
21-Oct-2026 16:59:01 PASSED
21-Oct-2026 16:59:01
21-Oct-2026 16:59:01 2026-10-21 20:59:02        INFO        ImageFactory::createImage        Created Temp image  of shape [2, 2, 2] with float valued pixels.
21-Oct-2026 16:59:01 2026-10-21 20:59:02        INFO        ImageRegion::fromRecord        Selected bounding box :
21-Oct-2026 16:59:01 2026-10-21 20:59:02        INFO        ImageRegion::fromRecord+            [0, 0, 0] to [1, 1, 1]  (00:00:04.000, -00.01.00.000, I to 00:00:00.000, +00.00.00.000, Q)
21-Oct-2026 16:59:01 2026-10-21 20:59:02        INFO        ImageRegion::fromRecord        Selected bounding box :
21-Oct-2026 16:59:01 2026-10-21 20:59:02        INFO        ImageRegion::fromRecord+            [0, 0, 0] to [1, 1, 1]  (00:00:04.000, -00.01.00.000, I to 00:00:00.000, +00.00.00.000, Q)
21-Oct-2026 16:59:01 2026-10-21 20:59:02        INFO        name::        No table opened.
21-Oct-2026 16:59:01 2026-10-21 20:59:02        INFO        showcache::        The Table Cache is empty.
21-Oct-2026 16:59:01 2026-10-21 20:59:02        INFO        name::        No table opened.
21-Oct-2026 16:59:01 2026-10-21 20:59:02        INFO        name::        No table opened.
21-Oct-2026 16:59:01 test_tool_image_collapse.py::ia_collapse_test::test_sqrtsum_npix
21-Oct-2026 16:59:01 Test sqrtsum function
21-Oct-2026 16:59:01 PASSED
21-Oct-2026 16:59:01
21-Oct-2026 16:59:01 2026-10-21 20:59:02        INFO        ImageFactory::createImage        Created Temp image  of shape [2, 2, 2] with float valued pixels.
21-Oct-2026 16:59:01 2026-10-21 20:59:02        INFO        image::_casaQuantityFromVar         Will use values specified in major, minor, pa to set beam
21-Oct-2026 16:59:01 2026-10-21 20:59:02        INFO        BeamManipulator::set        Setting (global) restoring beam.
21-Oct-2026 16:59:01 2026-10-21 20:59:02        INFO        BeamManipulator::set        Beam parameters:  Major          : 3 arcmin
21-Oct-2026 16:59:01 2026-10-21 20:59:02        INFO        BeamManipulator::set+          Minor          : 3 arcmin
21-Oct-2026 16:59:01 2026-10-21 20:59:02        INFO        BeamManipulator::set+          Position Angle : 0 deg
21-Oct-2026 16:59:01 2026-10-21 20:59:02        INFO        ImageRegion::fromRecord        Selected bounding box :
21-Oct-2026 16:59:01 2026-10-21 20:59:02        INFO        ImageRegion::fromRecord+            [0, 0, 0] to [1, 1, 1]  (00:00:04.000, -00.01.00.000, I to 00:00:00.000, +00.00.00.000, Q)
21-Oct-2026 16:59:01 2026-10-21 20:59:02        INFO        ImageRegion::fromRecord        Selected bounding box :
21-Oct-2026 16:59:01 2026-10-21 20:59:02        INFO        ImageRegion::fromRecord+            [0, 0, 0] to [1, 1, 1]  (00:00:04.000, -00.01.00.000, I to 00:00:00.000, +00.00.00.000, Q)
21-Oct-2026 16:59:01 2026-10-21 20:59:02        INFO        name::        No table opened.
21-Oct-2026 16:59:01 2026-10-21 20:59:02        INFO        showcache::        The Table Cache is empty.
21-Oct-2026 16:59:01 2026-10-21 20:59:02        INFO        name::        No table opened.
21-Oct-2026 16:59:01 2026-10-21 20:59:02        INFO        name::        No table opened.
21-Oct-2026 16:59:01 test_tool_image_collapse.py::ia_collapse_test::test_sqrtsum_npix_beam
21-Oct-2026 16:59:01 Test sqrtsum function
21-Oct-2026 16:59:01 PASSED
21-Oct-2026 16:59:01
21-Oct-2026 16:59:01 2026-10-21 20:59:02        INFO        FITSCoordinateUtil::fromFITSHeader        Neither SPECSYS nor VELREF keyword given, spectral reference frame not defined ...
21-Oct-2026 16:59:01 2026-10-21 20:59:02        INFO        ImageFactory::createImage        Created Paged image 'ymask' of shape [3, 3, 1, 1] with float valued pixels.
21-Oct-2026 16:59:01 2026-10-21 20:59:02        INFO        FITSCoordinateUtil::fromFITSHeader        Neither SPECSYS nor VELREF keyword given, spectral reference frame not defined ...
21-Oct-2026 16:59:01 2026-10-21 20:59:02        INFO        ImageRegion::fromRecord        Selected bounding box :
21-Oct-2026 16:59:01 2026-10-21 20:59:02        INFO        ImageRegion::fromRecord+            [0, 0, 0, 0] to [2, 2, 2, 2]  (04:46:00.576, +44.50.12.522, 4.7351e+09Hz, I to 04:46:00.520, +44.50.13.123, 5.5351e+09Hz, U)
21-Oct-2026 16:59:01 2026-10-21 20:59:02        INFO        name::        No table opened.
21-Oct-2026 16:59:01 2026-10-21 20:59:02        INFO        showcache::        The Table Cache is empty.
21-Oct-2026 16:59:01 2026-10-21 20:59:02        INFO        name::        No table opened.
21-Oct-2026 16:59:01 2026-10-21 20:59:02        INFO        name::        No table opened.
21-Oct-2026 16:59:01 test_tool_image_collapse.py::ia_collapse_test::test_stretch
21-Oct-2026 16:59:01 ia.collapse(): Test stretch parameter
21-Oct-2026 16:59:01 PASSED
21-Oct-2026 16:59:01
21-Oct-2026 16:59:01 - generated xml file: /Users/casaci/bamboohome/xml-data/build-dir/CASASPECS-PR239-TTO14/casa6/casatestutils/nosedir/xml/test_tool_image_collapse/nose.xml -
21-Oct-2026 16:59:01 ======================== 20 passed, 1 warning in 1.68s =========================
21-Oct-2026 16:59:01 ============================= test session starts ==============================
21-Oct-2026 16:59:01 platform darwin -- Python 3.12.8, pytest-9.1.1, pluggy-1.7.0 -- /Users/casaci/bamboohome/xml-data/build-dir/CASASPECS-PR239-TTO14/casa6testenv/bin/python3.12
21-Oct-2026 16:59:01 cachedir: .pytest_cache
21-Oct-2026 16:59:01 rootdir: /Users/casaci/bamboohome/xml-data/build-dir/CASASPECS-PR239-TTO14/casa6/casatestutils/nosedir/test_tool_table
21-Oct-2026 16:59:01 configfile: pytest.ini
21-Oct-2026 16:59:03 collecting ... table tool tests will use /opt/casa/data/casatestdata/unittest/table/n08c1_swap1.ms
21-Oct-2026 16:59:03 collected 13 items
21-Oct-2026 16:59:03
21-Oct-2026 16:59:03
21-Oct-2026 16:59:03 2026-10-21 20:59:03        INFO        name::        No table opened.
21-Oct-2026 16:59:03 2026-10-21 20:59:03        INFO        name::        No table opened.
21-Oct-2026 16:59:03 test_tool_table.py::TableGetcoliterTest::test_consistency
21-Oct-2026 16:59:03 PASSED
21-Oct-2026 16:59:03
21-Oct-2026 16:59:03 2026-10-21 20:59:03        INFO        name::        No table opened.
21-Oct-2026 16:59:03 2026-10-21 20:59:03        INFO        name::        No table opened.
21-Oct-2026 16:59:03 test_tool_table.py::TableGetcoliterTest::test_element_match
21-Oct-2026 16:59:03 Test element match using direct comparison and StopIteration assertion. 
21-Oct-2026 16:59:03 [4.71188568e+09 4.71188569e+09 4.71188570e+09 4.71188571e+09
21-Oct-2026 16:59:03 4.71188571e+09 4.71188572e+09 4.71188573e+09 4.71188574e+09]
21-Oct-2026 16:59:03 [4.71188568e+09 4.71188569e+09 4.71188570e+09 4.71188571e+09
21-Oct-2026 16:59:03 4.71188571e+09 4.71188572e+09 4.71188573e+09 4.71188574e+09]
21-Oct-2026 16:59:03 PASSED
21-Oct-2026 16:59:03
21-Oct-2026 16:59:03 2026-10-21 20:59:03        INFO        name::        No table opened.
21-Oct-2026 16:59:03 2026-10-21 20:59:03        INFO        name::        No table opened.
21-Oct-2026 16:59:03 test_tool_table.py::TableGetcoliterTest::test_errors
21-Oct-2026 16:59:03 PASSED
21-Oct-2026 16:59:03
21-Oct-2026 16:59:03 2026-10-21 20:59:03        INFO        name::        No table opened.
21-Oct-2026 16:59:03 2026-10-21 20:59:03        INFO        name::        No table opened.
21-Oct-2026 16:59:03 test_tool_table.py::TableGetcoliterTest::test_values
21-Oct-2026 16:59:03 PASSED
21-Oct-2026 16:59:03
21-Oct-2026 16:59:03 2026-10-21 20:59:03        INFO        name::        No table opened.
21-Oct-2026 16:59:03 2026-10-21 20:59:03        INFO        name::        No table opened.
21-Oct-2026 16:59:03 test_tool_table.py::TableRowTest::test_all_rows
21-Oct-2026 16:59:03 PASSED
21-Oct-2026 16:59:03
21-Oct-2026 16:59:03 2026-10-21 20:59:03        INFO        name::        No table opened.
21-Oct-2026 16:59:03 2026-10-21 20:59:03        INFO        name::        No table opened.
21-Oct-2026 16:59:03 test_tool_table.py::TableRowTest::test_columnnames_exclude
21-Oct-2026 16:59:03 PASSED
21-Oct-2026 16:59:03
21-Oct-2026 16:59:03 2026-10-21 20:59:03        INFO        name::        No table opened.
21-Oct-2026 16:59:03 2026-10-21 20:59:03        INFO        name::        No table opened.
21-Oct-2026 16:59:03 test_tool_table.py::TableRowTest::test_columnnames_include
21-Oct-2026 16:59:03 PASSED
21-Oct-2026 16:59:03
21-Oct-2026 16:59:03 2026-10-21 20:59:03        INFO        name::        No table opened.
21-Oct-2026 16:59:03 2026-10-21 20:59:03        INFO        name::        No table opened.
21-Oct-2026 16:59:03 test_tool_table.py::TableRowTest::test_get
21-Oct-2026 16:59:03 Test get function
21-Oct-2026 16:59:03 PASSED
21-Oct-2026 16:59:03
21-Oct-2026 16:59:03 2026-10-21 20:59:03        INFO        name::        No table opened.
21-Oct-2026 16:59:03 2026-10-21 20:59:03        INFO        name::        No table opened.
21-Oct-2026 16:59:03 2026-10-21 20:59:03        INFO        name::        No table opened.
21-Oct-2026 16:59:03 2026-10-21 20:59:03        INFO        name::        No table opened.
21-Oct-2026 16:59:03 test_tool_table.py::TableRowTest::test_put
21-Oct-2026 16:59:03 Test put function
21-Oct-2026 16:59:03 PASSED
21-Oct-2026 16:59:03
21-Oct-2026 16:59:03 2026-10-21 20:59:03        INFO        name::        No table opened.
21-Oct-2026 16:59:03 2026-10-21 20:59:03        INFO        name::        No table opened.
21-Oct-2026 16:59:03 test_tool_table.py::TableRowTest::test_shape
21-Oct-2026 16:59:03 Test for valid data shape
21-Oct-2026 16:59:03 PASSED
21-Oct-2026 16:59:03
21-Oct-2026 16:59:03 2026-10-21 20:59:03        INFO        name::        No table opened.
21-Oct-2026 16:59:03 2026-10-21 20:59:03        INFO        name::        No table opened.
21-Oct-2026 16:59:03 test_tool_table.py::TableRowTest::test_some_rows
21-Oct-2026 16:59:03 PASSED
21-Oct-2026 16:59:03
21-Oct-2026 16:59:03 2026-10-21 20:59:03        INFO        ImageFactory::createImage        Created Paged image 'tmp.im' of shape [3, 4] with float valued pixels.
21-Oct-2026 16:59:03 2026-10-21 20:59:03        SEVERE        getcellslice::bogus        Exception Reported: Table column bogus is unknown
21-Oct-2026 16:59:03 2026-10-21 20:59:03        SEVERE        getcellslice::map        Exception Reported: TableColumn: row number 1 exceeds #rows 1 in table /Users/casaci/bamboohome/xml-data/build-dir/CASASPECS-PR239-TTO14/casa6/casatestutils/nosedir/test_tool_table/tmp.im
21-Oct-2026 16:59:03 2026-10-21 20:59:03        SEVERE        getcellslice::map        Exception Reported: Exception: blc must have length of 2.
21-Oct-2026 16:59:03 2026-10-21 20:59:03        SEVERE        getcellslice::map+        ... thrown by void casac::table::_checkCorner(const vector<long> &, const String &, const IPosition &, const pair<vector<long>, vector<long>> *const &) at File: /private/var/folders/60/83wxljbx2vlfbx_hy0yfv8rc0000gn/T/build-via-sdist-sp0okgic/casatools-6.8.0.0+dirty/src/tools/table/table_cmpt.cc, line: 1389
21-Oct-2026 16:59:03 2026-10-21 20:59:03        SEVERE        getcellslice::map        Exception Reported: Exception: All elements of blc must be greater than or equal to 0.
21-Oct-2026 16:59:03 2026-10-21 20:59:03        SEVERE        getcellslice::map+        ... thrown by void casac::table::_checkCorner(const vector<long> &, const String &, const IPosition &, const pair<vector<long>, vector<long>> *const &) at File: /private/var/folders/60/83wxljbx2vlfbx_hy0yfv8rc0000gn/T/build-via-sdist-sp0okgic/casatools-6.8.0.0+dirty/src/tools/table/table_cmpt.cc, line: 1393
21-Oct-2026 16:59:03 2026-10-21 20:59:03        SEVERE        getcellslice::map        Exception Reported: Exception: Element 1 of blc must be less than 4.
21-Oct-2026 16:59:03 2026-10-21 20:59:03        SEVERE        getcellslice::map+        ... thrown by void casac::table::_checkCorner(const vector<long> &, const String &, const IPosition &, const pair<vector<long>, vector<long>> *const &) at File: /private/var/folders/60/83wxljbx2vlfbx_hy0yfv8rc0000gn/T/build-via-sdist-sp0okgic/casatools-6.8.0.0+dirty/src/tools/table/table_cmpt.cc, line: 1399
21-Oct-2026 16:59:03 2026-10-21 20:59:03        SEVERE        getcellslice::map        Exception Reported: Exception: trc must have length of 2.
21-Oct-2026 16:59:03 2026-10-21 20:59:03        SEVERE        getcellslice::map+        ... thrown by void casac::table::_checkCorner(const vector<long> &, const String &, const IPosition &, const pair<vector<long>, vector<long>> *const &) at File: /private/var/folders/60/83wxljbx2vlfbx_hy0yfv8rc0000gn/T/build-via-sdist-sp0okgic/casatools-6.8.0.0+dirty/src/tools/table/table_cmpt.cc, line: 1389
21-Oct-2026 16:59:03 2026-10-21 20:59:03        SEVERE        getcellslice::map        Exception Reported: Exception: All elements of trc must be greater than or equal to 0.
21-Oct-2026 16:59:03 2026-10-21 20:59:03        SEVERE        getcellslice::map+        ... thrown by void casac::table::_checkCorner(const vector<long> &, const String &, const IPosition &, const pair<vector<long>, vector<long>> *const &) at File: /private/var/folders/60/83wxljbx2vlfbx_hy0yfv8rc0000gn/T/build-via-sdist-sp0okgic/casatools-6.8.0.0+dirty/src/tools/table/table_cmpt.cc, line: 1393
21-Oct-2026 16:59:03 2026-10-21 20:59:03        SEVERE        getcellslice::map        Exception Reported: Exception: Element 0 of trc must be less than 3.
21-Oct-2026 16:59:03 2026-10-21 20:59:03        SEVERE        getcellslice::map+        ... thrown by void casac::table::_checkCorner(const vector<long> &, const String &, const IPosition &, const pair<vector<long>, vector<long>> *const &) at File: /private/var/folders/60/83wxljbx2vlfbx_hy0yfv8rc0000gn/T/build-via-sdist-sp0okgic/casatools-6.8.0.0+dirty/src/tools/table/table_cmpt.cc, line: 1399
21-Oct-2026 16:59:03 2026-10-21 20:59:03        SEVERE        getcellslice::map        Exception Reported: Exception: All elements of trc must be greater than or equal to their corresponding blc elements.
21-Oct-2026 16:59:03 2026-10-21 20:59:03        SEVERE        getcellslice::map+        ... thrown by void casac::table::_checkCorner(const vector<long> &, const String &, const IPosition &, const pair<vector<long>, vector<long>> *const &) at File: /private/var/folders/60/83wxljbx2vlfbx_hy0yfv8rc0000gn/T/build-via-sdist-sp0okgic/casatools-6.8.0.0+dirty/src/tools/table/table_cmpt.cc, line: 1409
21-Oct-2026 16:59:03 2026-10-21 20:59:03        SEVERE        getcellslice::map        Exception Reported: Exception: incr must have length of 2.
21-Oct-2026 16:59:03 2026-10-21 20:59:03        SEVERE        getcellslice::map+        ... thrown by casac::variant *casac::table::getcellslice(const std::string &, const long, const std::vector<long> &, const std::vector<long> &, const std::vector<long> &) at File: /private/var/folders/60/83wxljbx2vlfbx_hy0yfv8rc0000gn/T/build-via-sdist-sp0okgic/casatools-6.8.0.0+dirty/src/tools/table/table_cmpt.cc, line: 1469
21-Oct-2026 16:59:03 2026-10-21 20:59:03        SEVERE        getcellslice::map        Exception Reported: Exception: All elements of incr must be greater than 0.
21-Oct-2026 16:59:03 2026-10-21 20:59:03        SEVERE        getcellslice::map+        ... thrown by casac::variant *casac::table::getcellslice(const std::string &, const long, const std::vector<long> &, const std::vector<long> &, const std::vector<long> &) at File: /private/var/folders/60/83wxljbx2vlfbx_hy0yfv8rc0000gn/T/build-via-sdist-sp0okgic/casatools-6.8.0.0+dirty/src/tools/table/table_cmpt.cc, line: 1476
21-Oct-2026 16:59:03 2026-10-21 20:59:03        INFO        name::        No table opened.
21-Oct-2026 16:59:03 2026-10-21 20:59:03        INFO        name::        No table opened.
21-Oct-2026 16:59:03 test_tool_table.py::table_getcellslice_test::test_exceptions
21-Oct-2026 16:59:03 Test various exception cases
21-Oct-2026 16:59:03 PASSED
21-Oct-2026 16:59:03
21-Oct-2026 16:59:03 2026-10-21 20:59:03        INFO        ImageFactory::createImage        Created Paged image 'tmp.im' of shape [3, 4] with float valued pixels.
21-Oct-2026 16:59:03 2026-10-21 20:59:03        INFO        name::        No table opened.
21-Oct-2026 16:59:03 2026-10-21 20:59:03        INFO        name::        No table opened.
21-Oct-2026 16:59:03 2026-10-21 20:59:03        INFO        name::        No table opened.
21-Oct-2026 16:59:03 test_tool_table.py::table_getcellslice_test::test_getcellslice
21-Oct-2026 16:59:03 tests for valid inputs
21-Oct-2026 16:59:03 PASSED
21-Oct-2026 16:59:03
21-Oct-2026 16:59:03 - generated xml file: /Users/casaci/bamboohome/xml-data/build-dir/CASASPECS-PR239-TTO14/casa6/casatestutils/nosedir/xml/test_tool_table/nose.xml -
21-Oct-2026 16:59:03 ======================== 13 passed, 1 warning in 1.76s =========================
21-Oct-2026 16:59:03 ============================= test session starts ==============================
21-Oct-2026 16:59:03 platform darwin -- Python 3.12.8, pytest-9.1.1, pluggy-1.7.0 -- /Users/casaci/bamboohome/xml-data/build-dir/CASASPECS-PR239-TTO14/casa6testenv/bin/python3.12
21-Oct-2026 16:59:03 cachedir: .pytest_cache
21-Oct-2026 16:59:03 rootdir: /Users/casaci/bamboohome/xml-data/build-dir/CASASPECS-PR239-TTO14/casa6/casatestutils/nosedir/test_tool_msuvbinner
21-Oct-2026 16:59:03 configfile: pytest.ini
21-Oct-2026 16:59:04 collecting ... collected 1 item
21-Oct-2026 16:59:04
21-Oct-2026 16:59:04
21-Oct-2026 16:59:05 2026-10-21 20:59:05        SEVERE        MeasTable::dUTC(Double) (file ../../measures/Measures/MeasTable.cc, line 4290)        Leap second table TAI_UTC seems out-of-date.
21-Oct-2026 16:59:05 2026-10-21 20:59:05        SEVERE        MeasTable::dUTC(Double) (file ../../measures/Measures/MeasTable.cc, line 4290)+        Until the table is updated (see the CASA documentation or your system admin),
21-Oct-2026 16:59:05 2026-10-21 20:59:05        SEVERE        MeasTable::dUTC(Double) (file ../../measures/Measures/MeasTable.cc, line 4290)+        times and coordinates derived from UTC could be wrong by 1s or more.
21-Oct-2026 16:59:05 test_tool_msuvbinner.py::msuvbinnerTest::test_fill_1ms
21-Oct-2026 16:59:05 test uvgridding 1 ms onto an output grid 
21-Oct-2026 16:59:05 PASSED
21-Oct-2026 16:59:05
21-Oct-2026 16:59:05 - generated xml file: /Users/casaci/bamboohome/xml-data/build-dir/CASASPECS-PR239-TTO14/casa6/casatestutils/nosedir/xml/test_tool_msuvbinner/nose.xml -
21-Oct-2026 16:59:05 ========================= 1 passed, 1 warning in 1.91s =========================
21-Oct-2026 16:59:05 ============================= test session starts ==============================
21-Oct-2026 16:59:05 platform darwin -- Python 3.12.8, pytest-9.1.1, pluggy-1.7.0 -- /Users/casaci/bamboohome/xml-data/build-dir/CASASPECS-PR239-TTO14/casa6testenv/bin/python3.12
21-Oct-2026 16:59:05 cachedir: .pytest_cache
21-Oct-2026 16:59:05 rootdir: /Users/casaci/bamboohome/xml-data/build-dir/CASASPECS-PR239-TTO14/casa6/casatestutils/nosedir/test_tool_logsink
21-Oct-2026 16:59:05 configfile: pytest.ini
21-Oct-2026 16:59:06 collecting ... collected 4 items
21-Oct-2026 16:59:06
21-Oct-2026 16:59:06
21-Oct-2026 16:59:06 test_tool_logsink.py::LogsinkTest::test_getorigin_initial_origin
21-Oct-2026 16:59:06 Check the initial value of logsink.origin by getorigin.
21-Oct-2026 16:59:06 PASSED
21-Oct-2026 16:59:06
21-Oct-2026 16:59:06 test_tool_logsink.py::LogsinkTest::test_getorigin_set_nullvalues
21-Oct-2026 16:59:06 Check that the null values set logsink.origin can get correctly by getorigin.
21-Oct-2026 16:59:06 SUBPASSED(origin='\x00')
21-Oct-2026 16:59:06 test_tool_logsink.py::LogsinkTest::test_getorigin_set_nullvalues SUBPASSED(origin='')
21-Oct-2026 16:59:06 test_tool_logsink.py::LogsinkTest::test_getorigin_set_nullvalues SUBPASSED(origin=None)
21-Oct-2026 16:59:06 test_tool_logsink.py::LogsinkTest::test_getorigin_set_nullvalues PASSED
21-Oct-2026 16:59:06
21-Oct-2026 16:59:06 test_tool_logsink.py::LogsinkTest::test_getorigin_set_num
21-Oct-2026 16:59:06 Check that the numeric values set logsink.origin can get correctly by getorigin.
21-Oct-2026 16:59:06 SUBPASSED(origin=1)
21-Oct-2026 16:59:06 test_tool_logsink.py::LogsinkTest::test_getorigin_set_num SUBPASSED(origin=3.141592653589793)
21-Oct-2026 16:59:06 test_tool_logsink.py::LogsinkTest::test_getorigin_set_num SUBPASSED(origin=(1+1j))
21-Oct-2026 16:59:06 test_tool_logsink.py::LogsinkTest::test_getorigin_set_num PASSED
21-Oct-2026 16:59:06
21-Oct-2026 16:59:06 test_tool_logsink.py::LogsinkTest::test_getorigin_set_strings
21-Oct-2026 16:59:06 Check that the string values set logsink.origin can get correctly by getorigin.
21-Oct-2026 16:59:06 SUBPASSED(origin='test')
21-Oct-2026 16:59:06 test_tool_logsink.py::LogsinkTest::test_getorigin_set_strings SUBPASSED(origin='test\n')
21-Oct-2026 16:59:06 test_tool_logsink.py::LogsinkTest::test_getorigin_set_strings PASSED
21-Oct-2026 16:59:06
21-Oct-2026 16:59:06 - generated xml file: /Users/casaci/bamboohome/xml-data/build-dir/CASASPECS-PR239-TTO14/casa6/casatestutils/nosedir/xml/test_tool_logsink/nose.xml -
21-Oct-2026 16:59:06 =============== 4 passed, 1 warning, 8 subtests passed in 1.32s ================
21-Oct-2026 16:59:06 ============================= test session starts ==============================
21-Oct-2026 16:59:06 platform darwin -- Python 3.12.8, pytest-9.1.1, pluggy-1.7.0 -- /Users/casaci/bamboohome/xml-data/build-dir/CASASPECS-PR239-TTO14/casa6testenv/bin/python3.12
21-Oct-2026 16:59:06 cachedir: .pytest_cache
21-Oct-2026 16:59:06 rootdir: /Users/casaci/bamboohome/xml-data/build-dir/CASASPECS-PR239-TTO14/casa6/casatestutils/nosedir/test_tool_image_deviation
21-Oct-2026 16:59:06 configfile: pytest.ini
21-Oct-2026 16:59:08 collecting ... collected 8 items
21-Oct-2026 16:59:08
21-Oct-2026 16:59:08
21-Oct-2026 16:59:08 2026-10-21 20:59:08        INFO        StatImageCreator::_computeStat        Using rectangular region of specified dimensions 4 pix x 4 pix (because of centering and rounding to use whole pixels, actual dimensions of bounding box are 5 pix x 5 pix) to choose pixels for computing NPTS using the classical algorithm around each of 10000 grid points in 2 planes.
21-Oct-2026 16:59:08 2026-10-21 20:59:08        WARN        image::open (file /private/var/folders/60/83wxljbx2vlfbx_hy0yfv8rc0000gn/T/build-via-sdist-sp0okgic/casatools-6.8.0.0+dirty/src/tools/image/image_cmpt.cc, line 4208)        Another image is already open, closing first
21-Oct-2026 16:59:08 2026-10-21 20:59:08        INFO        StatImageCreator::_computeStat        Using rectangular region of specified dimensions 4 pix x 4 pix (because of centering and rounding to use whole pixels, actual dimensions of bounding box are 5 pix x 5 pix) to choose pixels for computing STDDEV using the classical algorithm around each of 10000 grid points in 2 planes.
21-Oct-2026 16:59:08 2026-10-21 20:59:08        WARN        image::open (file /private/var/folders/60/83wxljbx2vlfbx_hy0yfv8rc0000gn/T/build-via-sdist-sp0okgic/casatools-6.8.0.0+dirty/src/tools/image/image_cmpt.cc, line 4208)        Another image is already open, closing first
21-Oct-2026 16:59:08 2026-10-21 20:59:08        INFO        name::        No table opened.
21-Oct-2026 16:59:08 2026-10-21 20:59:08        INFO        showcache::        The Table Cache is empty.
21-Oct-2026 16:59:08 2026-10-21 20:59:08        INFO        name::        No table opened.
21-Oct-2026 16:59:08 2026-10-21 20:59:08        INFO        name::        No table opened.
21-Oct-2026 16:59:08 test_tool_image_deviation.py::ia_deviation_test::test001
21-Oct-2026 16:59:08 Every pixel is a grid point
21-Oct-2026 16:59:08 PASSED
21-Oct-2026 16:59:08
21-Oct-2026 16:59:08 2026-10-21 20:59:08        INFO        StatImageCreator::_computeStat        Using rectangular region of specified dimensions 4 pix x 4 pix (because of centering and rounding to use whole pixels, actual dimensions of bounding box are 5 pix x 5 pix) to choose pixels for computing NPTS using the classical algorithm around each of 10000 grid points in 2 planes.
21-Oct-2026 16:59:08 2026-10-21 20:59:09        WARN        image::open (file /private/var/folders/60/83wxljbx2vlfbx_hy0yfv8rc0000gn/T/build-via-sdist-sp0okgic/casatools-6.8.0.0+dirty/src/tools/image/image_cmpt.cc, line 4208)        Another image is already open, closing first
21-Oct-2026 16:59:08 2026-10-21 20:59:09        INFO        StatImageCreator::_computeStat        Using rectangular region of specified dimensions 4 pix x 4 pix (because of centering and rounding to use whole pixels, actual dimensions of bounding box are 5 pix x 5 pix) to choose pixels for computing STDDEV using the classical algorithm around each of 10000 grid points in 2 planes.
21-Oct-2026 16:59:08 2026-10-21 20:59:09        WARN        image::open (file /private/var/folders/60/83wxljbx2vlfbx_hy0yfv8rc0000gn/T/build-via-sdist-sp0okgic/casatools-6.8.0.0+dirty/src/tools/image/image_cmpt.cc, line 4208)        Another image is already open, closing first
21-Oct-2026 16:59:08 2026-10-21 20:59:09        INFO        name::        No table opened.
21-Oct-2026 16:59:08 2026-10-21 20:59:09        INFO        showcache::        The Table Cache is empty.
21-Oct-2026 16:59:08 2026-10-21 20:59:09        INFO        name::        No table opened.
21-Oct-2026 16:59:08 2026-10-21 20:59:09        INFO        name::        No table opened.
21-Oct-2026 16:59:08 test_tool_image_deviation.py::ia_deviation_test::test002
21-Oct-2026 16:59:08 Every pixel is a grid point with an offset, so should be the same result
21-Oct-2026 16:59:08 as test001
21-Oct-2026 16:59:08 PASSED
21-Oct-2026 16:59:08
21-Oct-2026 16:59:08 2026-10-21 20:59:09        INFO        StatImageCreator::_computeStat        Using rectangular region of specified dimensions 4 pix x 4 pix (because of centering and rounding to use whole pixels, actual dimensions of bounding box are 5 pix x 5 pix) to choose pixels for computing NPTS using the classical algorithm around each of 1156 grid points in 2 planes.
21-Oct-2026 16:59:08 2026-10-21 20:59:09        INFO        StatImageCreator::_doInterpolation        Interpolate using LINEAR algorithm.
21-Oct-2026 16:59:08 2026-10-21 20:59:09        WARN        image::open (file /private/var/folders/60/83wxljbx2vlfbx_hy0yfv8rc0000gn/T/build-via-sdist-sp0okgic/casatools-6.8.0.0+dirty/src/tools/image/image_cmpt.cc, line 4208)        Another image is already open, closing first
21-Oct-2026 16:59:08 2026-10-21 20:59:09        INFO        StatImageCreator::_computeStat        Using rectangular region of specified dimensions 4 pix x 4 pix (because of centering and rounding to use whole pixels, actual dimensions of bounding box are 5 pix x 5 pix) to choose pixels for computing STDDEV using the classical algorithm around each of 1156 grid points in 2 planes.
21-Oct-2026 16:59:08 2026-10-21 20:59:09        INFO        StatImageCreator::_doInterpolation        Interpolate using LINEAR algorithm.
21-Oct-2026 16:59:08 2026-10-21 20:59:09        WARN        image::open (file /private/var/folders/60/83wxljbx2vlfbx_hy0yfv8rc0000gn/T/build-via-sdist-sp0okgic/casatools-6.8.0.0+dirty/src/tools/image/image_cmpt.cc, line 4208)        Another image is already open, closing first
21-Oct-2026 16:59:08 2026-10-21 20:59:09        WARN        image::open (file /private/var/folders/60/83wxljbx2vlfbx_hy0yfv8rc0000gn/T/build-via-sdist-sp0okgic/casatools-6.8.0.0+dirty/src/tools/image/image_cmpt.cc, line 4208)        Another image is already open, closing first
21-Oct-2026 16:59:08 2026-10-21 20:59:09        INFO        StatImageCreator::_computeStat        Using rectangular region of specified dimensions 4 pix x 4 pix (because of centering and rounding to use whole pixels, actual dimensions of bounding box are 5 pix x 5 pix) to choose pixels for computing NPTS using the classical algorithm around each of 1156 grid points in 2 planes.
21-Oct-2026 16:59:08 2026-10-21 20:59:09        INFO        StatImageCreator::_doInterpolation        Interpolate using LINEAR algorithm.
21-Oct-2026 16:59:08 2026-10-21 20:59:09        WARN        image::open (file /private/var/folders/60/83wxljbx2vlfbx_hy0yfv8rc0000gn/T/build-via-sdist-sp0okgic/casatools-6.8.0.0+dirty/src/tools/image/image_cmpt.cc, line 4208)        Another image is already open, closing first
21-Oct-2026 16:59:08 2026-10-21 20:59:09        INFO        StatImageCreator::_computeStat        Using rectangular region of specified dimensions 4 pix x 4 pix (because of centering and rounding to use whole pixels, actual dimensions of bounding box are 5 pix x 5 pix) to choose pixels for computing STDDEV using the classical algorithm around each of 1156 grid points in 2 planes.
21-Oct-2026 16:59:08 2026-10-21 20:59:09        INFO        StatImageCreator::_doInterpolation        Interpolate using LINEAR algorithm.
21-Oct-2026 16:59:08 2026-10-21 20:59:09        WARN        image::open (file /private/var/folders/60/83wxljbx2vlfbx_hy0yfv8rc0000gn/T/build-via-sdist-sp0okgic/casatools-6.8.0.0+dirty/src/tools/image/image_cmpt.cc, line 4208)        Another image is already open, closing first
21-Oct-2026 16:59:08 2026-10-21 20:59:09        INFO        name::        No table opened.
21-Oct-2026 16:59:08 2026-10-21 20:59:09        INFO        showcache::        The Table Cache is empty.
21-Oct-2026 16:59:08 2026-10-21 20:59:09        INFO        name::        No table opened.
21-Oct-2026 16:59:08 2026-10-21 20:59:09        INFO        name::        No table opened.
21-Oct-2026 16:59:08 test_tool_image_deviation.py::ia_deviation_test::test003
21-Oct-2026 16:59:08 Every third pixel is a grid point
21-Oct-2026 16:59:08 PASSED
21-Oct-2026 16:59:08
21-Oct-2026 16:59:08 2026-10-21 20:59:09        INFO        StatImageCreator::_computeStat        Using rectangular region of specified dimensions 4 pix x 4 pix (because of centering and rounding to use whole pixels, actual dimensions of bounding box are 5 pix x 5 pix) to choose pixels for computing NPTS using the classical algorithm around each of 1089 grid points in 2 planes.
21-Oct-2026 16:59:08 2026-10-21 20:59:09        INFO        StatImageCreator::_doInterpolation        Interpolate using LINEAR algorithm.
21-Oct-2026 16:59:08 2026-10-21 20:59:09        WARN        image::open (file /private/var/folders/60/83wxljbx2vlfbx_hy0yfv8rc0000gn/T/build-via-sdist-sp0okgic/casatools-6.8.0.0+dirty/src/tools/image/image_cmpt.cc, line 4208)        Another image is already open, closing first
21-Oct-2026 16:59:08 2026-10-21 20:59:09        INFO        StatImageCreator::_computeStat        Using rectangular region of specified dimensions 4 pix x 4 pix (because of centering and rounding to use whole pixels, actual dimensions of bounding box are 5 pix x 5 pix) to choose pixels for computing STDDEV using the classical algorithm around each of 1089 grid points in 2 planes.
21-Oct-2026 16:59:08 2026-10-21 20:59:09        INFO        StatImageCreator::_doInterpolation        Interpolate using LINEAR algorithm.
21-Oct-2026 16:59:08 2026-10-21 20:59:09        WARN        image::open (file /private/var/folders/60/83wxljbx2vlfbx_hy0yfv8rc0000gn/T/build-via-sdist-sp0okgic/casatools-6.8.0.0+dirty/src/tools/image/image_cmpt.cc, line 4208)        Another image is already open, closing first
21-Oct-2026 16:59:08 2026-10-21 20:59:09        INFO        StatImageCreator::_computeStat        Using rectangular region of specified dimensions 4 pix x 4 pix (because of centering and rounding to use whole pixels, actual dimensions of bounding box are 5 pix x 5 pix) to choose pixels for computing NPTS using the classical algorithm around each of 1089 grid points in 2 planes.
21-Oct-2026 16:59:08 2026-10-21 20:59:09        INFO        StatImageCreator::_doInterpolation        Interpolate using LINEAR algorithm.
21-Oct-2026 16:59:08 2026-10-21 20:59:09        WARN        image::open (file /private/var/folders/60/83wxljbx2vlfbx_hy0yfv8rc0000gn/T/build-via-sdist-sp0okgic/casatools-6.8.0.0+dirty/src/tools/image/image_cmpt.cc, line 4208)        Another image is already open, closing first
21-Oct-2026 16:59:08 2026-10-21 20:59:09        INFO        StatImageCreator::_computeStat        Using rectangular region of specified dimensions 4 pix x 4 pix (because of centering and rounding to use whole pixels, actual dimensions of bounding box are 5 pix x 5 pix) to choose pixels for computing STDDEV using the classical algorithm around each of 1089 grid points in 2 planes.
21-Oct-2026 16:59:08 2026-10-21 20:59:09        INFO        StatImageCreator::_doInterpolation        Interpolate using LINEAR algorithm.
21-Oct-2026 16:59:08 2026-10-21 20:59:09        WARN        image::open (file /private/var/folders/60/83wxljbx2vlfbx_hy0yfv8rc0000gn/T/build-via-sdist-sp0okgic/casatools-6.8.0.0+dirty/src/tools/image/image_cmpt.cc, line 4208)        Another image is already open, closing first
21-Oct-2026 16:59:08 2026-10-21 20:59:09        INFO        name::        No table opened.
21-Oct-2026 16:59:08 2026-10-21 20:59:09        INFO        showcache::        The Table Cache is empty.
21-Oct-2026 16:59:08 2026-10-21 20:59:09        INFO        name::        No table opened.
21-Oct-2026 16:59:08 2026-10-21 20:59:09        INFO        name::        No table opened.
21-Oct-2026 16:59:08 test_tool_image_deviation.py::ia_deviation_test::test005
21-Oct-2026 16:59:08 Every third pixel is a grid point, using anchor [2,2]
21-Oct-2026 16:59:08 PASSED
21-Oct-2026 16:59:08
21-Oct-2026 16:59:08 2026-10-21 20:59:09        INFO        StatImageCreator::_computeStat        Using rectangular region of specified dimensions 10.001 pix x 10.001 pix (because of centering and rounding to use whole pixels, actual dimensions of bounding box are 11 pix x 11 pix) to choose pixels for computing STDDEV using the classical algorithm around each of 64 grid points in 2 planes.
21-Oct-2026 16:59:08 2026-10-21 20:59:09        INFO        StatImageCreator::_doInterpolation        Interpolate using LINEAR algorithm.
21-Oct-2026 16:59:08 2026-10-21 20:59:09        INFO        ImageRegion::fromRecord        Selected bounding box :
21-Oct-2026 16:59:08 2026-10-21 20:59:09        INFO        ImageRegion::fromRecord+            [5, 5, 0] to [85, 85, 1]  (00:03:00.021, -00.45.00.077, I to 23:57:39.990, +00.35.00.036, Q)
21-Oct-2026 16:59:08 2026-10-21 20:59:09        INFO        StatImageCreator::_computeStat        Using rectangular region of specified dimensions 10.001 pix x 10.001 pix (because of centering and rounding to use whole pixels, actual dimensions of bounding box are 11 pix x 11 pix) to choose pixels for computing STDDEV using the classical algorithm around each of 36 grid points in 2 planes.
21-Oct-2026 16:59:08 2026-10-21 20:59:09        INFO        StatImageCreator::_doInterpolation        Interpolate using LINEAR algorithm.
21-Oct-2026 16:59:08 2026-10-21 20:59:09        INFO        ImageRegion::fromRecord        Selected bounding box :
21-Oct-2026 16:59:08 2026-10-21 20:59:09        INFO        ImageRegion::fromRecord+            [27, 27, 0] to [66, 66, 0]  (00:01:32.003, -00.23.00.010, I to 23:58:55.999, +00.16.00.003, I)
21-Oct-2026 16:59:08 2026-10-21 20:59:09        INFO        ImageRegion::fromRecord        Selected bounding box :
21-Oct-2026 16:59:08 2026-10-21 20:59:09        INFO        ImageRegion::fromRecord+            [22, 22, 0] to [61, 61, 0]  (00:01:32.003, -00.23.00.010, I to 23:58:55.999, +00.16.00.003, I)
21-Oct-2026 16:59:08 2026-10-21 20:59:09        INFO        name::        No table opened.
21-Oct-2026 16:59:08 2026-10-21 20:59:09        INFO        showcache::        The Table Cache is empty.
21-Oct-2026 16:59:08 2026-10-21 20:59:09        INFO        name::        No table opened.
21-Oct-2026 16:59:08 2026-10-21 20:59:09        INFO        name::        No table opened.
21-Oct-2026 16:59:08 test_tool_image_deviation.py::ia_deviation_test::test006
21-Oct-2026 16:59:08 Test that regions work as expected
21-Oct-2026 16:59:08 PASSED
21-Oct-2026 16:59:08
21-Oct-2026 16:59:08 2026-10-21 20:59:09        INFO        ImageFactory::createImage        Created Paged image 'mycirc.im' of shape [100, 100] with float valued pixels.
21-Oct-2026 16:59:08 2026-10-21 20:59:09        INFO        StatImageCreator::useReferencePixelAsAnchor        Anchor being set at pixel [50,50], at/near image reference pixel.
21-Oct-2026 16:59:08 2026-10-21 20:59:09        INFO        StatImageCreator::_computeStat        Using circular region of radius 20 pix (because of centering and rounding to use whole pixels, actual dimensions of bounding box are 41 pix x 41 pix and there are 1257 good pixels in the circle that are being used) to choose pixels for computing SUM using the classical algorithm around each of 25 grid points in 1 planes.
21-Oct-2026 16:59:08 2026-10-21 20:59:09        INFO        StatImageCreator::_doInterpolation        Interpolate using CUBIC algorithm.
21-Oct-2026 16:59:08 2026-10-21 20:59:09        INFO        name::        No table opened.
21-Oct-2026 16:59:08 2026-10-21 20:59:09        INFO        showcache::        The Table Cache is empty.
21-Oct-2026 16:59:08 2026-10-21 20:59:09        INFO        name::        No table opened.
21-Oct-2026 16:59:08 2026-10-21 20:59:09        INFO        name::        No table opened.
21-Oct-2026 16:59:08 test_tool_image_deviation.py::ia_deviation_test::test_circle
21-Oct-2026 16:59:08 test circles work correctly CAS-10296
21-Oct-2026 16:59:08 PASSED
21-Oct-2026 16:59:08
21-Oct-2026 16:59:08 2026-10-21 20:59:09        INFO        ImageFactory::createImage        Created Temp image  of shape [10, 10] with float valued pixels.
21-Oct-2026 16:59:08 2026-10-21 20:59:09        INFO        StatImageCreator::_computeStat        Using rectangular region of specified dimensions 4 pix x 4 pix (because of centering and rounding to use whole pixels, actual dimensions of bounding box are 5 pix x 5 pix) to choose pixels for computing STDDEV using the classical algorithm around each of 9 grid points in 1 planes.
21-Oct-2026 16:59:08 2026-10-21 20:59:09        INFO        StatImageCreator::_doInterpolation        Interpolate using LINEAR algorithm.
21-Oct-2026 16:59:08 2026-10-21 20:59:09        INFO        ImageMaskAttacher::makeMask        Created mask `mask0'
21-Oct-2026 16:59:08 2026-10-21 20:59:09        INFO        ImageFactory::createImage        Created Temp image  of shape [10, 10, 2] with float valued pixels.
21-Oct-2026 16:59:08 2026-10-21 20:59:09        INFO        StatImageCreator::_computeStat        Using rectangular region of specified dimensions 4 pix x 4 pix (because of centering and rounding to use whole pixels, actual dimensions of bounding box are 5 pix x 5 pix) to choose pixels for computing STDDEV using the classical algorithm around each of 9 grid points in 2 planes.
21-Oct-2026 16:59:08 2026-10-21 20:59:09        INFO        StatImageCreator::_doInterpolation        Interpolate using LINEAR algorithm.
21-Oct-2026 16:59:08 2026-10-21 20:59:09        INFO        ImageMaskAttacher::makeMask        Created mask `mask0'
21-Oct-2026 16:59:08 2026-10-21 20:59:09        INFO        name::        No table opened.
21-Oct-2026 16:59:08 2026-10-21 20:59:09        INFO        showcache::        The Table Cache is empty.
21-Oct-2026 16:59:08 2026-10-21 20:59:09        INFO        name::        No table opened.
21-Oct-2026 16:59:08 2026-10-21 20:59:09        INFO        name::        No table opened.
21-Oct-2026 16:59:08 test_tool_image_deviation.py::ia_deviation_test::test_mask
21-Oct-2026 16:59:08 PASSED
21-Oct-2026 16:59:08
21-Oct-2026 16:59:08 2026-10-21 20:59:09        INFO        ImageFactory::createImage        Created Temp image  of shape [20, 20] with float valued pixels.
21-Oct-2026 16:59:08 2026-10-21 20:59:09        INFO        StatImageCreator::_computeStat        Using rectangular region of specified dimensions 4 pix x 4 pix (because of centering and rounding to use whole pixels, actual dimensions of bounding box are 5 pix x 5 pix) to choose pixels for computing STDDEV using the classical algorithm around each of 25 grid points in 1 planes.
21-Oct-2026 16:59:08 2026-10-21 20:59:09        INFO        StatImageCreator::_doInterpolation        Interpolate using CUBIC algorithm.
21-Oct-2026 16:59:08 2026-10-21 20:59:09        INFO        StatImageCreator::useReferencePixelAsAnchor        Anchor being set at pixel [10,10], at/near image reference pixel.
21-Oct-2026 16:59:08 2026-10-21 20:59:09        INFO        StatImageCreator::_computeStat        Using rectangular region of specified dimensions 4 pix x 4 pix (because of centering and rounding to use whole pixels, actual dimensions of bounding box are 5 pix x 5 pix) to choose pixels for computing STDDEV using the classical algorithm around each of 25 grid points in 1 planes.
21-Oct-2026 16:59:08 2026-10-21 20:59:09        INFO        StatImageCreator::_doInterpolation        Interpolate using CUBIC algorithm.
21-Oct-2026 16:59:08 2026-10-21 20:59:09        INFO        name::        No table opened.
21-Oct-2026 16:59:08 2026-10-21 20:59:09        INFO        showcache::        The Table Cache is empty.
21-Oct-2026 16:59:08 2026-10-21 20:59:09        INFO        name::        No table opened.
21-Oct-2026 16:59:08 2026-10-21 20:59:09        INFO        name::        No table opened.
21-Oct-2026 16:59:08 test_tool_image_deviation.py::ia_deviation_test::test_refpix
21-Oct-2026 16:59:08 Test using reference pixel
21-Oct-2026 16:59:08 PASSED
21-Oct-2026 16:59:08
21-Oct-2026 16:59:08 - generated xml file: /Users/casaci/bamboohome/xml-data/build-dir/CASASPECS-PR239-TTO14/casa6/casatestutils/nosedir/xml/test_tool_image_deviation/nose.xml -
21-Oct-2026 16:59:08 ========================= 8 passed, 1 warning in 1.79s =========================
21-Oct-2026 16:59:08 ============================= test session starts ==============================
21-Oct-2026 16:59:08 platform darwin -- Python 3.12.8, pytest-9.1.1, pluggy-1.7.0 -- /Users/casaci/bamboohome/xml-data/build-dir/CASASPECS-PR239-TTO14/casa6testenv/bin/python3.12
21-Oct-2026 16:59:08 cachedir: .pytest_cache
21-Oct-2026 16:59:08 rootdir: /Users/casaci/bamboohome/xml-data/build-dir/CASASPECS-PR239-TTO14/casa6/casatestutils/nosedir/test_tool_vpmanager
21-Oct-2026 16:59:08 configfile: pytest.ini
21-Oct-2026 16:59:10 collecting ... collected 17 items
21-Oct-2026 16:59:10
21-Oct-2026 16:59:10
21-Oct-2026 16:59:10 test_tool_vpmanager.py::vpmanager_test::test0
21-Oct-2026 16:59:10 Test 0: reset
21-Oct-2026 16:59:10 PASSED
21-Oct-2026 16:59:10
21-Oct-2026 16:59:10 2026-10-21 20:59:10        INFO        vpmanager::summarizevps        Voltage patterns internally defined in CASA (* = global default for this telescope):
21-Oct-2026 16:59:10 2026-10-21 20:59:10        INFO        vpmanager::summarizevps+          Telescope: Class
21-Oct-2026 16:59:10 2026-10-21 20:59:10        INFO        vpmanager::summarizevps         * ATCA_L1: INVERSE POLYNOMIAL
21-Oct-2026 16:59:10 2026-10-21 20:59:10        INFO        vpmanager::summarizevps         * ATCA_L2: POLYNOMIAL
21-Oct-2026 16:59:10 2026-10-21 20:59:10        WARN        PBMath::pbMathInterfaceForCommonPB        ATCA_L3 not yet implemented defaulting to L2 version
21-Oct-2026 16:59:10 2026-10-21 20:59:10        INFO        vpmanager::summarizevps         * ATCA_L3: POLYNOMIAL
21-Oct-2026 16:59:10 2026-10-21 20:59:10        INFO        vpmanager::summarizevps         * ATCA_S: INVERSE POLYNOMIAL
21-Oct-2026 16:59:10 2026-10-21 20:59:10        INFO        PBMath1DIPoly::fillPBArray        Using wideband interpolated beam pattern
21-Oct-2026 16:59:10 2026-10-21 20:59:10        INFO        vpmanager::summarizevps         * ATCA_C: INVERSE POLYNOMIAL
21-Oct-2026 16:59:10 2026-10-21 20:59:10        INFO        PBMath1DIPoly::fillPBArray        Using wideband interpolated beam pattern
21-Oct-2026 16:59:10 2026-10-21 20:59:10        INFO        vpmanager::summarizevps         * ATCA_X: INVERSE POLYNOMIAL
21-Oct-2026 16:59:10 2026-10-21 20:59:10        INFO        vpmanager::summarizevps         * GBT: POLYNOMIAL
21-Oct-2026 16:59:10 2026-10-21 20:59:10        INFO        vpmanager::summarizevps         * GMRT: NUMERIC
21-Oct-2026 16:59:10 2026-10-21 20:59:10        INFO        vpmanager::summarizevps         * HATCREEK: GAUSSIAN
21-Oct-2026 16:59:10 2026-10-21 20:59:10        INFO        vpmanager::summarizevps         * NRAO12M: NUMERIC
21-Oct-2026 16:59:10 2026-10-21 20:59:10        INFO        vpmanager::summarizevps         * UNKNOWN: NUMERIC
21-Oct-2026 16:59:10 2026-10-21 20:59:10        INFO        vpmanager::summarizevps         * OVRO: NUMERIC
21-Oct-2026 16:59:10 2026-10-21 20:59:10        INFO        vpmanager::summarizevps         * VLA: POLYNOMIAL
21-Oct-2026 16:59:10 2026-10-21 20:59:10        INFO        vpmanager::summarizevps         * VLA_INVERSE: INVERSE POLYNOMIAL
21-Oct-2026 16:59:10 2026-10-21 20:59:10        INFO        vpmanager::summarizevps         * VLA_NVSS: AIRY
21-Oct-2026 16:59:10 2026-10-21 20:59:10        INFO        vpmanager::summarizevps         * VLA_2NULL: AIRY
21-Oct-2026 16:59:10 2026-10-21 20:59:10        INFO        vpmanager::summarizevps         * VLA_4: AIRY
21-Oct-2026 16:59:10 2026-10-21 20:59:10        INFO        vpmanager::summarizevps         * VLA_P: AIRY
21-Oct-2026 16:59:10 2026-10-21 20:59:10        INFO        vpmanager::summarizevps         * VLA_L: AIRY
21-Oct-2026 16:59:10 2026-10-21 20:59:10        INFO        vpmanager::summarizevps         * VLA_C: AIRY
21-Oct-2026 16:59:10 2026-10-21 20:59:10        INFO        vpmanager::summarizevps         * VLA_X: AIRY
21-Oct-2026 16:59:10 2026-10-21 20:59:10        INFO        vpmanager::summarizevps         * VLA_U: AIRY
21-Oct-2026 16:59:10 2026-10-21 20:59:10        INFO        vpmanager::summarizevps         * VLA_K: AIRY
21-Oct-2026 16:59:10 2026-10-21 20:59:10        INFO        vpmanager::summarizevps         * VLA_Q: AIRY
21-Oct-2026 16:59:10 2026-10-21 20:59:10        INFO        vpmanager::summarizevps         * WSRT: COSINE POLYNOMIAL
21-Oct-2026 16:59:10 2026-10-21 20:59:10        INFO        vpmanager::summarizevps         * WSRT_LOW: COSINE POLYNOMIAL
21-Oct-2026 16:59:10 2026-10-21 20:59:10        INFO        vpmanager::summarizevps         * ALMA: AIRY
21-Oct-2026 16:59:10 2026-10-21 20:59:10        INFO        vpmanager::summarizevps         * ALMASD: AIRY
21-Oct-2026 16:59:10 2026-10-21 20:59:10        INFO        vpmanager::summarizevps         * ACA: AIRY
21-Oct-2026 16:59:10 2026-10-21 20:59:10        INFO        vpmanager::summarizevps         * IRAMPDB: AIRY
21-Oct-2026 16:59:10 2026-10-21 20:59:10        INFO        vpmanager::summarizevps         * IRAM30M: AIRY
21-Oct-2026 16:59:10 2026-10-21 20:59:10        INFO        vpmanager::summarizevps         * SMA: NUMERIC
21-Oct-2026 16:59:10 2026-10-21 20:59:10        INFO        vpmanager::summarizevps         * ATA: AIRY
21-Oct-2026 16:59:10 2026-10-21 20:59:10        INFO        PBMath::pbMathInterfaceForCommonPB        PBMath using 2011/10/22 5.5GHz PB
21-Oct-2026 16:59:10 2026-10-21 20:59:10        INFO        vpmanager::summarizevps         * ATCA_C_RI: NUMERIC
21-Oct-2026 16:59:10 2026-10-21 20:59:10        INFO        vpmanager::summarizevps         * ATCA: INVERSE POLYNOMIAL
21-Oct-2026 16:59:10 2026-10-21 20:59:10        INFO        PBMath1DIPoly::fillPBArray        Using wideband interpolated beam pattern
21-Oct-2026 16:59:10 2026-10-21 20:59:10        INFO        vpmanager::summarizevps         * ATCA_16: INVERSE POLYNOMIAL
21-Oct-2026 16:59:10 2026-10-21 20:59:10        INFO        vpmanager::summarizevps         * ATCA_K: INVERSE POLYNOMIAL
21-Oct-2026 16:59:10 2026-10-21 20:59:10        INFO        vpmanager::summarizevps         * ATCA_Q: INVERSE POLYNOMIAL
21-Oct-2026 16:59:10 2026-10-21 20:59:10        INFO        vpmanager::summarizevps         * ATCA_W: INVERSE POLYNOMIAL
21-Oct-2026 16:59:10 2026-10-21 20:59:10        INFO        vpmanager::summarizevps         * EVLA: POLYNOMIAL
21-Oct-2026 16:59:10 2026-10-21 20:59:10        INFO        vpmanager::summarizevps         * NGVLA: AIRY
21-Oct-2026 16:59:10 2026-10-21 20:59:10        INFO        vpmanager::summarizevps        
21-Oct-2026 16:59:10 2026-10-21 20:59:10        INFO        vpmanager::summarizevps+        Externally defined voltage patterns (* = global default for this telescope):
21-Oct-2026 16:59:10 2026-10-21 20:59:10        INFO        vpmanager::summarizevps                None
21-Oct-2026 16:59:10 test_tool_vpmanager.py::vpmanager_test::test1
21-Oct-2026 16:59:10 Test 1: summarizevps
21-Oct-2026 16:59:10 PASSED
21-Oct-2026 16:59:10
21-Oct-2026 16:59:10 test_tool_vpmanager.py::vpmanager_test::test10
21-Oct-2026 16:59:10 Test 10: define Airy beams for ALMA antenna types, then use them
21-Oct-2026 16:59:10 PASSED
21-Oct-2026 16:59:10
21-Oct-2026 16:59:10 test_tool_vpmanager.py::vpmanager_test::test11
21-Oct-2026 16:59:10 Test 11: getvp without observation parameters
21-Oct-2026 16:59:10 PASSED
21-Oct-2026 16:59:10
21-Oct-2026 16:59:10 2026-10-21 20:59:10        INFO        vp::createantresp        Found 0 response images in directory /Users/casaci/bamboohome/xml-data/build-dir/CASASPECS-PR239-TTO14/casa6/casatestutils/nosedir/test_tool_vpmanager/mydir3
21-Oct-2026 16:59:10 2026-10-21 20:59:10        SEVERE        vp::createantresp        No images found in directory mydir3
21-Oct-2026 16:59:10 test_tool_vpmanager.py::vpmanager_test::test12
21-Oct-2026 16:59:10 Test 12: EXPECTED ERROR createantresp - no images
21-Oct-2026 16:59:10 PASSED
21-Oct-2026 16:59:10
21-Oct-2026 16:59:10 2026-10-21 20:59:10        INFO        vp::createantresp        Found 6 response images in directory /Users/casaci/bamboohome/xml-data/build-dir/CASASPECS-PR239-TTO14/casa6/casatestutils/nosedir/test_tool_vpmanager/mydir3
21-Oct-2026 16:59:10 2026-10-21 20:59:10        SEVERE        vp::createantresp        Image ALMA_0_DV__0._0._360._0._45._90._80._100._110._GHz_ticra2007_EFP.im has band definition inconsistent with the available bands.
21-Oct-2026 16:59:10 test_tool_vpmanager.py::vpmanager_test::test13
21-Oct-2026 16:59:10 Test 13: EXPECTED ERROR createantresp - two images have faulty band def
21-Oct-2026 16:59:10 PASSED
21-Oct-2026 16:59:10
21-Oct-2026 16:59:10 2026-10-21 20:59:10        INFO        vp::createantresp        Found 6 response images in directory /Users/casaci/bamboohome/xml-data/build-dir/CASASPECS-PR239-TTO14/casa6/casatestutils/nosedir/test_tool_vpmanager/mydir3
21-Oct-2026 16:59:10 2026-10-21 20:59:10        INFO        vp::createantresp        Created antenna responses table /Users/casaci/bamboohome/xml-data/build-dir/CASASPECS-PR239-TTO14/casa6/casatestutils/nosedir/test_tool_vpmanager/mydir3/AntennaResponses
21-Oct-2026 16:59:10 2026-10-21 20:59:10        INFO        vp::createantresp+         with 2 rows.
21-Oct-2026 16:59:10 test_tool_vpmanager.py::vpmanager_test::test14
21-Oct-2026 16:59:10 Test 14: createantresp - good input: six images, two antenna types
21-Oct-2026 16:59:10 PASSED
21-Oct-2026 16:59:10
21-Oct-2026 16:59:10 2026-10-21 20:59:10        SEVERE        vp::getrespimagename        No antenna responses path set for observatory: "ALMA2" in the AntennaResponses column of the Observatories table.
21-Oct-2026 16:59:10 test_tool_vpmanager.py::vpmanager_test::test15
21-Oct-2026 16:59:10 Test 15: EXPECTED ERROR get image name from non-existant observatory
21-Oct-2026 16:59:10 PASSED
21-Oct-2026 16:59:10
21-Oct-2026 16:59:10 2026-10-21 20:59:10        INFO        vpmanager::loadfromtable        Loaded 1 VP definitions and 41 VP default settings from table mydefs.tab
21-Oct-2026 16:59:10 test_tool_vpmanager.py::vpmanager_test::test16
21-Oct-2026 16:59:10 Test 16: define Airy beam for ALMA, save it, load it, then use it
21-Oct-2026 16:59:10 PASSED
21-Oct-2026 16:59:10
21-Oct-2026 16:59:10 test_tool_vpmanager.py::vpmanager_test::test2
21-Oct-2026 16:59:10 Test 2: getvp for VLA
21-Oct-2026 16:59:10 PASSED
21-Oct-2026 16:59:10
21-Oct-2026 16:59:10 test_tool_vpmanager.py::vpmanager_test::test3
21-Oct-2026 16:59:10 Test 3: getvp and getvps for ALMA
21-Oct-2026 16:59:10 PASSED
21-Oct-2026 16:59:10
21-Oct-2026 16:59:10 test_tool_vpmanager.py::vpmanager_test::test4
21-Oct-2026 16:59:10 Test 4: numvps for VLA
21-Oct-2026 16:59:10 PASSED
21-Oct-2026 16:59:10
21-Oct-2026 16:59:10 test_tool_vpmanager.py::vpmanager_test::test5
21-Oct-2026 16:59:10 Test 5: numvps for ALMA
21-Oct-2026 16:59:10 PASSED
21-Oct-2026 16:59:10
21-Oct-2026 16:59:10 test_tool_vpmanager.py::vpmanager_test::test6
21-Oct-2026 16:59:10 Test 6: numvps for ALMA with too high freq
21-Oct-2026 16:59:10 PASSED
21-Oct-2026 16:59:10
21-Oct-2026 16:59:10 test_tool_vpmanager.py::vpmanager_test::test7
21-Oct-2026 16:59:10 Test 7: setuserdefault for ALMA
21-Oct-2026 16:59:10 PASSED
21-Oct-2026 16:59:10
21-Oct-2026 16:59:10 test_tool_vpmanager.py::vpmanager_test::test8
21-Oct-2026 16:59:10 Test 8: define Airy beam for ALMA, then use it
21-Oct-2026 16:59:10 PASSED
21-Oct-2026 16:59:10
21-Oct-2026 16:59:10 test_tool_vpmanager.py::vpmanager_test::test9 Processing request for geometries from observatory ALMA, antenna type DV
21-Oct-2026 16:59:10 2026-10-21 20:59:10        INFO        BeamCalc::setBeamCalcGeometries()        Initialisation of geometries for observatory ALMA, antenna type DV
21-Oct-2026 16:59:10 2026-10-21 20:59:10        INFO        BeamCalc::setBeamCalcGeometries()        from file /opt/casa/data/casa-data/alma/responses/ALMA_0_DV__0_0_360_0_45_90_31_506_950_GHz_beamcalc_INTERNAL.txt
21-Oct-2026 16:59:10 2026-10-21 20:59:10        INFO        BeamCalc::setBeamCalcGeometries()+        ... successful.
21-Oct-2026 16:59:10 **Writing ALMA Apertures for Pol 9 to disk
21-Oct-2026 16:59:10 Done writing apertures to disk
21-Oct-2026 16:59:10 Processing request for geometries from observatory ALMA, antenna type DA
21-Oct-2026 16:59:10 2026-10-21 20:59:11        INFO        BeamCalc::setBeamCalcGeometries()        Initialisation of geometries for observatory ALMA, antenna type DA
21-Oct-2026 16:59:10 2026-10-21 20:59:11        INFO        BeamCalc::setBeamCalcGeometries()        from file /opt/casa/data/casa-data/alma/responses/ALMA_0_DA__0_0_360_0_45_90_31_506_950_GHz_beamcalc_INTERNAL.txt
21-Oct-2026 16:59:10 2026-10-21 20:59:11        INFO        BeamCalc::setBeamCalcGeometries()+        ... successful.
21-Oct-2026 16:59:10 **Writing ALMA Apertures for Pol 9 to disk
21-Oct-2026 16:59:10 Done writing apertures to disk
21-Oct-2026 16:59:10 Processing request for geometries from observatory ALMA, antenna type PM
21-Oct-2026 16:59:10 2026-10-21 20:59:11        INFO        BeamCalc::setBeamCalcGeometries()        Initialisation of geometries for observatory ALMA, antenna type PM
21-Oct-2026 16:59:10 2026-10-21 20:59:11        INFO        BeamCalc::setBeamCalcGeometries()        from file /opt/casa/data/casa-data/alma/responses/ALMA_0_PM__0_0_360_0_45_90_31_506_950_GHz_beamcalc_INTERNAL.txt
21-Oct-2026 16:59:10 2026-10-21 20:59:11        INFO        BeamCalc::setBeamCalcGeometries()+        ... successful.
21-Oct-2026 16:59:10 **Writing ALMA Apertures for Pol 9 to disk
21-Oct-2026 16:59:10 Done writing apertures to disk
21-Oct-2026 16:59:10 Processing request for geometries from observatory ALMA, antenna type CM
21-Oct-2026 16:59:10 2026-10-21 20:59:11        INFO        BeamCalc::setBeamCalcGeometries()        Initialisation of geometries for observatory ALMA, antenna type CM
21-Oct-2026 16:59:10 2026-10-21 20:59:11        INFO        BeamCalc::setBeamCalcGeometries()        from file /opt/casa/data/casa-data/alma/responses/ALMA_0_CM__0_0_360_0_45_90_31_506_950_GHz_beamcalc_INTERNAL.txt
21-Oct-2026 16:59:10 2026-10-21 20:59:11        INFO        BeamCalc::setBeamCalcGeometries()+        ... successful.
21-Oct-2026 16:59:10 **Writing ALMA Apertures for Pol 9 to disk
21-Oct-2026 16:59:10 Done writing apertures to disk
21-Oct-2026 16:59:11
21-Oct-2026 16:59:11 Test 9: define reference to antresp table for ALMA, then use it
21-Oct-2026 16:59:11 PASSED
21-Oct-2026 16:59:11
21-Oct-2026 16:59:11 - generated xml file: /Users/casaci/bamboohome/xml-data/build-dir/CASASPECS-PR239-TTO14/casa6/casatestutils/nosedir/xml/test_tool_vpmanager/nose.xml -
21-Oct-2026 16:59:11 ======================== 17 passed, 1 warning in 2.28s =========================
21-Oct-2026 16:59:11
21-Oct-2026 16:59:11
21-Oct-2026 16:59:11 Setting Working Directory: /Users/casaci/bamboohome/xml-data/build-dir/CASASPECS-PR239-TTO14/casa6/casatestutils/nosedir/test_tool_linearmosaic/
21-Oct-2026 16:59:11 Test Directory: /Users/casaci/bamboohome/xml-data/build-dir/CASASPECS-PR239-TTO14/casa6/casatestutils/nosedir/test_tool_linearmosaic
21-Oct-2026 16:59:11
21-Oct-2026 16:59:11 Running Command: pytest --junitxml=/Users/casaci/bamboohome/xml-data/build-dir/CASASPECS-PR239-TTO14/casa6/casatestutils/nosedir/xml/test_tool_linearmosaic/nose.xml -s --disable-pytest-warnings --verbose -ra --tb=short /Users/casaci/bamboohome/xml-data/build-dir/CASASPECS-PR239-TTO14/casa6/casatestutils/nosedir/test_tool_linearmosaic/
21-Oct-2026 16:59:11
21-Oct-2026 16:59:11 Setting Working Directory: /Users/casaci/bamboohome/xml-data/build-dir/CASASPECS-PR239-TTO14/casa6/casatestutils/nosedir/test_tool_image_statistics/
21-Oct-2026 16:59:11 Test Directory: /Users/casaci/bamboohome/xml-data/build-dir/CASASPECS-PR239-TTO14/casa6/casatestutils/nosedir/test_tool_image_statistics
21-Oct-2026 16:59:11
21-Oct-2026 16:59:11 Running Command: pytest --junitxml=/Users/casaci/bamboohome/xml-data/build-dir/CASASPECS-PR239-TTO14/casa6/casatestutils/nosedir/xml/test_tool_image_statistics/nose.xml -s --disable-pytest-warnings --verbose -ra --tb=short /Users/casaci/bamboohome/xml-data/build-dir/CASASPECS-PR239-TTO14/casa6/casatestutils/nosedir/test_tool_image_statistics/
21-Oct-2026 16:59:11
21-Oct-2026 16:59:11 Setting Working Directory: /Users/casaci/bamboohome/xml-data/build-dir/CASASPECS-PR239-TTO14/casa6/casatestutils/nosedir/test_tool_image_pv/
21-Oct-2026 16:59:11 Test Directory: /Users/casaci/bamboohome/xml-data/build-dir/CASASPECS-PR239-TTO14/casa6/casatestutils/nosedir/test_tool_image_pv
21-Oct-2026 16:59:11
21-Oct-2026 16:59:11 Running Command: pytest --junitxml=/Users/casaci/bamboohome/xml-data/build-dir/CASASPECS-PR239-TTO14/casa6/casatestutils/nosedir/xml/test_tool_image_pv/nose.xml -s --disable-pytest-warnings --verbose -ra --tb=short /Users/casaci/bamboohome/xml-data/build-dir/CASASPECS-PR239-TTO14/casa6/casatestutils/nosedir/test_tool_image_pv/
21-Oct-2026 16:59:11
21-Oct-2026 16:59:11 Setting Working Directory: /Users/casaci/bamboohome/xml-data/build-dir/CASASPECS-PR239-TTO14/casa6/casatestutils/nosedir/test_tool_image_fitprofile/
21-Oct-2026 16:59:11 Test Directory: /Users/casaci/bamboohome/xml-data/build-dir/CASASPECS-PR239-TTO14/casa6/casatestutils/nosedir/test_tool_image_fitprofile
21-Oct-2026 16:59:11
21-Oct-2026 16:59:11 Running Command: pytest --junitxml=/Users/casaci/bamboohome/xml-data/build-dir/CASASPECS-PR239-TTO14/casa6/casatestutils/nosedir/xml/test_tool_image_fitprofile/nose.xml -s --disable-pytest-warnings --verbose -ra --tb=short /Users/casaci/bamboohome/xml-data/build-dir/CASASPECS-PR239-TTO14/casa6/casatestutils/nosedir/test_tool_image_fitprofile/
21-Oct-2026 16:59:11
21-Oct-2026 16:59:11 Setting Working Directory: /Users/casaci/bamboohome/xml-data/build-dir/CASASPECS-PR239-TTO14/casa6/casatestutils/nosedir/test_tool_synthesisutils/
21-Oct-2026 16:59:11 Test Directory: /Users/casaci/bamboohome/xml-data/build-dir/CASASPECS-PR239-TTO14/casa6/casatestutils/nosedir/test_tool_synthesisutils
21-Oct-2026 16:59:11
21-Oct-2026 16:59:11 Running Command: pytest --junitxml=/Users/casaci/bamboohome/xml-data/build-dir/CASASPECS-PR239-TTO14/casa6/casatestutils/nosedir/xml/test_tool_synthesisutils/nose.xml -s --disable-pytest-warnings --verbose -ra --tb=short /Users/casaci/bamboohome/xml-data/build-dir/CASASPECS-PR239-TTO14/casa6/casatestutils/nosedir/test_tool_synthesisutils/
21-Oct-2026 16:59:11
21-Oct-2026 16:59:11 Setting Working Directory: /Users/casaci/bamboohome/xml-data/build-dir/CASASPECS-PR239-TTO14/casa6/casatestutils/nosedir/test_tool_simulator/
21-Oct-2026 16:59:11 Test Directory: /Users/casaci/bamboohome/xml-data/build-dir/CASASPECS-PR239-TTO14/casa6/casatestutils/nosedir/test_tool_simulator
21-Oct-2026 16:59:11
21-Oct-2026 16:59:11 Running Command: pytest --junitxml=/Users/casaci/bamboohome/xml-data/build-dir/CASASPECS-PR239-TTO14/casa6/casatestutils/nosedir/xml/test_tool_simulator/nose.xml -s --disable-pytest-warnings --verbose -ra --tb=short /Users/casaci/bamboohome/xml-data/build-dir/CASASPECS-PR239-TTO14/casa6/casatestutils/nosedir/test_tool_simulator/
21-Oct-2026 16:59:11
21-Oct-2026 16:59:11 Setting Working Directory: /Users/casaci/bamboohome/xml-data/build-dir/CASASPECS-PR239-TTO14/casa6/casatestutils/nosedir/test_tool_image/
21-Oct-2026 16:59:11 Test Directory: /Users/casaci/bamboohome/xml-data/build-dir/CASASPECS-PR239-TTO14/casa6/casatestutils/nosedir/test_tool_image
21-Oct-2026 16:59:11
21-Oct-2026 16:59:11 Running Command: pytest --junitxml=/Users/casaci/bamboohome/xml-data/build-dir/CASASPECS-PR239-TTO14/casa6/casatestutils/nosedir/xml/test_tool_image/nose.xml -s --disable-pytest-warnings --verbose -ra --tb=short /Users/casaci/bamboohome/xml-data/build-dir/CASASPECS-PR239-TTO14/casa6/casatestutils/nosedir/test_tool_image/
21-Oct-2026 16:59:11
21-Oct-2026 16:59:11 Setting Working Directory: /Users/casaci/bamboohome/xml-data/build-dir/CASASPECS-PR239-TTO14/casa6/casatestutils/nosedir/test_tool_componentlist/
21-Oct-2026 16:59:11 Test Directory: /Users/casaci/bamboohome/xml-data/build-dir/CASASPECS-PR239-TTO14/casa6/casatestutils/nosedir/test_tool_componentlist
21-Oct-2026 16:59:11
21-Oct-2026 16:59:11 Running Command: pytest --junitxml=/Users/casaci/bamboohome/xml-data/build-dir/CASASPECS-PR239-TTO14/casa6/casatestutils/nosedir/xml/test_tool_componentlist/nose.xml -s --disable-pytest-warnings --verbose -ra --tb=short /Users/casaci/bamboohome/xml-data/build-dir/CASASPECS-PR239-TTO14/casa6/casatestutils/nosedir/test_tool_componentlist/
21-Oct-2026 16:59:11
21-Oct-2026 16:59:11 Setting Working Directory: /Users/casaci/bamboohome/xml-data/build-dir/CASASPECS-PR239-TTO14/casa6/casatestutils/nosedir/test_tool_sdm/
21-Oct-2026 16:59:11 Test Directory: /Users/casaci/bamboohome/xml-data/build-dir/CASASPECS-PR239-TTO14/casa6/casatestutils/nosedir/test_tool_sdm
21-Oct-2026 16:59:11
21-Oct-2026 16:59:11 Running Command: pytest --junitxml=/Users/casaci/bamboohome/xml-data/build-dir/CASASPECS-PR239-TTO14/casa6/casatestutils/nosedir/xml/test_tool_sdm/nose.xml -s --disable-pytest-warnings --verbose -ra --tb=short /Users/casaci/bamboohome/xml-data/build-dir/CASASPECS-PR239-TTO14/casa6/casatestutils/nosedir/test_tool_sdm/
21-Oct-2026 16:59:11
21-Oct-2026 16:59:11 Setting Working Directory: /Users/casaci/bamboohome/xml-data/build-dir/CASASPECS-PR239-TTO14/casa6/casatestutils/nosedir/test_tool_measures/
21-Oct-2026 16:59:11 Test Directory: /Users/casaci/bamboohome/xml-data/build-dir/CASASPECS-PR239-TTO14/casa6/casatestutils/nosedir/test_tool_measures
21-Oct-2026 16:59:11
21-Oct-2026 16:59:11 Running Command: pytest --junitxml=/Users/casaci/bamboohome/xml-data/build-dir/CASASPECS-PR239-TTO14/casa6/casatestutils/nosedir/xml/test_tool_measures/nose.xml -s --disable-pytest-warnings --verbose -ra --tb=short /Users/casaci/bamboohome/xml-data/build-dir/CASASPECS-PR239-TTO14/casa6/casatestutils/nosedir/test_tool_measures/
21-Oct-2026 16:59:11
21-Oct-2026 16:59:11 Setting Working Directory: /Users/casaci/bamboohome/xml-data/build-dir/CASASPECS-PR239-TTO14/casa6/casatestutils/nosedir/test_tool_agentflagger/
21-Oct-2026 16:59:11 Test Directory: /Users/casaci/bamboohome/xml-data/build-dir/CASASPECS-PR239-TTO14/casa6/casatestutils/nosedir/test_tool_agentflagger
21-Oct-2026 16:59:11
21-Oct-2026 16:59:11 Running Command: pytest --junitxml=/Users/casaci/bamboohome/xml-data/build-dir/CASASPECS-PR239-TTO14/casa6/casatestutils/nosedir/xml/test_tool_agentflagger/nose.xml -s --disable-pytest-warnings --verbose -ra --tb=short /Users/casaci/bamboohome/xml-data/build-dir/CASASPECS-PR239-TTO14/casa6/casatestutils/nosedir/test_tool_agentflagger/
21-Oct-2026 16:59:11
21-Oct-2026 16:59:11 Setting Working Directory: /Users/casaci/bamboohome/xml-data/build-dir/CASASPECS-PR239-TTO14/casa6/casatestutils/nosedir/test_tool_image_regrid/
21-Oct-2026 16:59:11 Test Directory: /Users/casaci/bamboohome/xml-data/build-dir/CASASPECS-PR239-TTO14/casa6/casatestutils/nosedir/test_tool_image_regrid
21-Oct-2026 16:59:11
21-Oct-2026 16:59:11 Running Command: pytest --junitxml=/Users/casaci/bamboohome/xml-data/build-dir/CASASPECS-PR239-TTO14/casa6/casatestutils/nosedir/xml/test_tool_image_regrid/nose.xml -s --disable-pytest-warnings --verbose -ra --tb=short /Users/casaci/bamboohome/xml-data/build-dir/CASASPECS-PR239-TTO14/casa6/casatestutils/nosedir/test_tool_image_regrid/
21-Oct-2026 16:59:11
21-Oct-2026 16:59:11 Setting Working Directory: /Users/casaci/bamboohome/xml-data/build-dir/CASASPECS-PR239-TTO14/casa6/casatestutils/nosedir/test_tool_ms_statwt/
21-Oct-2026 16:59:11 Test Directory: /Users/casaci/bamboohome/xml-data/build-dir/CASASPECS-PR239-TTO14/casa6/casatestutils/nosedir/test_tool_ms_statwt
21-Oct-2026 16:59:11
21-Oct-2026 16:59:11 Running Command: pytest --junitxml=/Users/casaci/bamboohome/xml-data/build-dir/CASASPECS-PR239-TTO14/casa6/casatestutils/nosedir/xml/test_tool_ms_statwt/nose.xml -s --disable-pytest-warnings --verbose -ra --tb=short /Users/casaci/bamboohome/xml-data/build-dir/CASASPECS-PR239-TTO14/casa6/casatestutils/nosedir/test_tool_ms_statwt/
21-Oct-2026 16:59:11
21-Oct-2026 16:59:11 Setting Working Directory: /Users/casaci/bamboohome/xml-data/build-dir/CASASPECS-PR239-TTO14/casa6/casatestutils/nosedir/test_tool_image_transpose/
21-Oct-2026 16:59:11 Test Directory: /Users/casaci/bamboohome/xml-data/build-dir/CASASPECS-PR239-TTO14/casa6/casatestutils/nosedir/test_tool_image_transpose
21-Oct-2026 16:59:11
21-Oct-2026 16:59:11 Running Command: pytest --junitxml=/Users/casaci/bamboohome/xml-data/build-dir/CASASPECS-PR239-TTO14/casa6/casatestutils/nosedir/xml/test_tool_image_transpose/nose.xml -s --disable-pytest-warnings --verbose -ra --tb=short /Users/casaci/bamboohome/xml-data/build-dir/CASASPECS-PR239-TTO14/casa6/casatestutils/nosedir/test_tool_image_transpose/
21-Oct-2026 16:59:11
21-Oct-2026 16:59:11 Setting Working Directory: /Users/casaci/bamboohome/xml-data/build-dir/CASASPECS-PR239-TTO14/casa6/casatestutils/nosedir/test_tool_quanta/
21-Oct-2026 16:59:11 Test Directory: /Users/casaci/bamboohome/xml-data/build-dir/CASASPECS-PR239-TTO14/casa6/casatestutils/nosedir/test_tool_quanta
21-Oct-2026 16:59:11
21-Oct-2026 16:59:11 Running Command: pytest --junitxml=/Users/casaci/bamboohome/xml-data/build-dir/CASASPECS-PR239-TTO14/casa6/casatestutils/nosedir/xml/test_tool_quanta/nose.xml -s --disable-pytest-warnings --verbose -ra --tb=short /Users/casaci/bamboohome/xml-data/build-dir/CASASPECS-PR239-TTO14/casa6/casatestutils/nosedir/test_tool_quanta/
21-Oct-2026 16:59:11
21-Oct-2026 16:59:11 Setting Working Directory: /Users/casaci/bamboohome/xml-data/build-dir/CASASPECS-PR239-TTO14/casa6/casatestutils/nosedir/test_tool_coordsys/
21-Oct-2026 16:59:11 Test Directory: /Users/casaci/bamboohome/xml-data/build-dir/CASASPECS-PR239-TTO14/casa6/casatestutils/nosedir/test_tool_coordsys
21-Oct-2026 16:59:11
21-Oct-2026 16:59:11 Running Command: pytest --junitxml=/Users/casaci/bamboohome/xml-data/build-dir/CASASPECS-PR239-TTO14/casa6/casatestutils/nosedir/xml/test_tool_coordsys/nose.xml -s --disable-pytest-warnings --verbose -ra --tb=short /Users/casaci/bamboohome/xml-data/build-dir/CASASPECS-PR239-TTO14/casa6/casatestutils/nosedir/test_tool_coordsys/
21-Oct-2026 16:59:11
21-Oct-2026 16:59:11 Setting Working Directory: /Users/casaci/bamboohome/xml-data/build-dir/CASASPECS-PR239-TTO14/casa6/casatestutils/nosedir/test_tool_calanalysis/
21-Oct-2026 16:59:11 Test Directory: /Users/casaci/bamboohome/xml-data/build-dir/CASASPECS-PR239-TTO14/casa6/casatestutils/nosedir/test_tool_calanalysis
21-Oct-2026 16:59:11
21-Oct-2026 16:59:11 Running Command: pytest --junitxml=/Users/casaci/bamboohome/xml-data/build-dir/CASASPECS-PR239-TTO14/casa6/casatestutils/nosedir/xml/test_tool_calanalysis/nose.xml -s --disable-pytest-warnings --verbose -ra --tb=short /Users/casaci/bamboohome/xml-data/build-dir/CASASPECS-PR239-TTO14/casa6/casatestutils/nosedir/test_tool_calanalysis/
21-Oct-2026 16:59:11
21-Oct-2026 16:59:11 Setting Working Directory: /Users/casaci/bamboohome/xml-data/build-dir/CASASPECS-PR239-TTO14/casa6/casatestutils/nosedir/test_tool_image_subimage/
21-Oct-2026 16:59:11 Test Directory: /Users/casaci/bamboohome/xml-data/build-dir/CASASPECS-PR239-TTO14/casa6/casatestutils/nosedir/test_tool_image_subimage
21-Oct-2026 16:59:11
21-Oct-2026 16:59:11 Running Command: pytest --junitxml=/Users/casaci/bamboohome/xml-data/build-dir/CASASPECS-PR239-TTO14/casa6/casatestutils/nosedir/xml/test_tool_image_subimage/nose.xml -s --disable-pytest-warnings --verbose -ra --tb=short /Users/casaci/bamboohome/xml-data/build-dir/CASASPECS-PR239-TTO14/casa6/casatestutils/nosedir/test_tool_image_subimage/
21-Oct-2026 16:59:11
21-Oct-2026 16:59:11 Setting Working Directory: /Users/casaci/bamboohome/xml-data/build-dir/CASASPECS-PR239-TTO14/casa6/casatestutils/nosedir/test_tool_image_collapse/
21-Oct-2026 16:59:11 Test Directory: /Users/casaci/bamboohome/xml-data/build-dir/CASASPECS-PR239-TTO14/casa6/casatestutils/nosedir/test_tool_image_collapse
21-Oct-2026 16:59:11
21-Oct-2026 16:59:11 Running Command: pytest --junitxml=/Users/casaci/bamboohome/xml-data/build-dir/CASASPECS-PR239-TTO14/casa6/casatestutils/nosedir/xml/test_tool_image_collapse/nose.xml -s --disable-pytest-warnings --verbose -ra --tb=short /Users/casaci/bamboohome/xml-data/build-dir/CASASPECS-PR239-TTO14/casa6/casatestutils/nosedir/test_tool_image_collapse/
21-Oct-2026 16:59:11
21-Oct-2026 16:59:11 Setting Working Directory: /Users/casaci/bamboohome/xml-data/build-dir/CASASPECS-PR239-TTO14/casa6/casatestutils/nosedir/test_tool_table/
21-Oct-2026 16:59:11 Test Directory: /Users/casaci/bamboohome/xml-data/build-dir/CASASPECS-PR239-TTO14/casa6/casatestutils/nosedir/test_tool_table
21-Oct-2026 16:59:11
21-Oct-2026 16:59:11 Running Command: pytest --junitxml=/Users/casaci/bamboohome/xml-data/build-dir/CASASPECS-PR239-TTO14/casa6/casatestutils/nosedir/xml/test_tool_table/nose.xml -s --disable-pytest-warnings --verbose -ra --tb=short /Users/casaci/bamboohome/xml-data/build-dir/CASASPECS-PR239-TTO14/casa6/casatestutils/nosedir/test_tool_table/
21-Oct-2026 16:59:11
21-Oct-2026 16:59:11 Setting Working Directory: /Users/casaci/bamboohome/xml-data/build-dir/CASASPECS-PR239-TTO14/casa6/casatestutils/nosedir/test_tool_msuvbinner/
21-Oct-2026 16:59:11 Test Directory: /Users/casaci/bamboohome/xml-data/build-dir/CASASPECS-PR239-TTO14/casa6/casatestutils/nosedir/test_tool_msuvbinner
21-Oct-2026 16:59:11
21-Oct-2026 16:59:11 Running Command: pytest --junitxml=/Users/casaci/bamboohome/xml-data/build-dir/CASASPECS-PR239-TTO14/casa6/casatestutils/nosedir/xml/test_tool_msuvbinner/nose.xml -s --disable-pytest-warnings --verbose -ra --tb=short /Users/casaci/bamboohome/xml-data/build-dir/CASASPECS-PR239-TTO14/casa6/casatestutils/nosedir/test_tool_msuvbinner/
21-Oct-2026 16:59:11
21-Oct-2026 16:59:11 Setting Working Directory: /Users/casaci/bamboohome/xml-data/build-dir/CASASPECS-PR239-TTO14/casa6/casatestutils/nosedir/test_tool_logsink/
21-Oct-2026 16:59:11 Test Directory: /Users/casaci/bamboohome/xml-data/build-dir/CASASPECS-PR239-TTO14/casa6/casatestutils/nosedir/test_tool_logsink
21-Oct-2026 16:59:11
21-Oct-2026 16:59:11 Running Command: pytest --junitxml=/Users/casaci/bamboohome/xml-data/build-dir/CASASPECS-PR239-TTO14/casa6/casatestutils/nosedir/xml/test_tool_logsink/nose.xml -s --disable-pytest-warnings --verbose -ra --tb=short /Users/casaci/bamboohome/xml-data/build-dir/CASASPECS-PR239-TTO14/casa6/casatestutils/nosedir/test_tool_logsink/
21-Oct-2026 16:59:11
21-Oct-2026 16:59:11 Setting Working Directory: /Users/casaci/bamboohome/xml-data/build-dir/CASASPECS-PR239-TTO14/casa6/casatestutils/nosedir/test_tool_image_deviation/
21-Oct-2026 16:59:11 Test Directory: /Users/casaci/bamboohome/xml-data/build-dir/CASASPECS-PR239-TTO14/casa6/casatestutils/nosedir/test_tool_image_deviation
21-Oct-2026 16:59:11
21-Oct-2026 16:59:11 Running Command: pytest --junitxml=/Users/casaci/bamboohome/xml-data/build-dir/CASASPECS-PR239-TTO14/casa6/casatestutils/nosedir/xml/test_tool_image_deviation/nose.xml -s --disable-pytest-warnings --verbose -ra --tb=short /Users/casaci/bamboohome/xml-data/build-dir/CASASPECS-PR239-TTO14/casa6/casatestutils/nosedir/test_tool_image_deviation/
21-Oct-2026 16:59:11
21-Oct-2026 16:59:11 Setting Working Directory: /Users/casaci/bamboohome/xml-data/build-dir/CASASPECS-PR239-TTO14/casa6/casatestutils/nosedir/test_tool_vpmanager/
21-Oct-2026 16:59:11 Test Directory: /Users/casaci/bamboohome/xml-data/build-dir/CASASPECS-PR239-TTO14/casa6/casatestutils/nosedir/test_tool_vpmanager
21-Oct-2026 16:59:11
21-Oct-2026 16:59:11 Running Command: pytest --junitxml=/Users/casaci/bamboohome/xml-data/build-dir/CASASPECS-PR239-TTO14/casa6/casatestutils/nosedir/xml/test_tool_vpmanager/nose.xml -s --disable-pytest-warnings --verbose -ra --tb=short /Users/casaci/bamboohome/xml-data/build-dir/CASASPECS-PR239-TTO14/casa6/casatestutils/nosedir/test_tool_vpmanager/
21-Oct-2026 16:59:11 Finished task 'Test wheel' with result: Success
21-Oct-2026 16:59:11 Starting task 'Parse tests' of type 'com.atlassian.bamboo.plugins.testresultparser:task.testresultparser.junit'
21-Oct-2026 16:59:11 Parsing test results under /Users/casaci/bamboohome/xml-data/build-dir/CASASPECS-PR239-TTO14...
21-Oct-2026 16:59:11 Finished task 'Parse tests' with result: Success
21-Oct-2026 16:59:11 Running post build plugin 'Docker Container Cleanup'
21-Oct-2026 16:59:11 Running post build plugin 'NCover Results Collector'
21-Oct-2026 16:59:11 Running post build plugin 'Build Results Label Collector'
21-Oct-2026 16:59:11 Running post build plugin 'Clover Results Collector'
21-Oct-2026 16:59:11 Running post build plugin 'npm Cache Cleanup'
21-Oct-2026 16:59:11 Running post build plugin 'Artifact Copier'
21-Oct-2026 16:59:11 Publishing an artifact: macOS15 casatools wheel
21-Oct-2026 16:59:14 Finished publishing of artifact Non required job artifact Http Compression On : [macOS15 casatools wheel], patterns: [casatools*.whl] anchored at: [wheeldirectory/] in 3.057 s
21-Oct-2026 16:59:14 Finalising the build...
21-Oct-2026 16:59:14 Stopping timer.
21-Oct-2026 16:59:14 Build CASASPECS-PR239-TTO14-1 completed.
21-Oct-2026 16:59:14 Running on server: post build plugin 'Build Hanging Detection Configuration'
21-Oct-2026 16:59:14 Running on server: post build plugin 'NCover Results Collector'
21-Oct-2026 16:59:14 Running on server: post build plugin 'Build Labeller'
21-Oct-2026 16:59:14 Running on server: post build plugin 'Clover Delta Calculator'
21-Oct-2026 16:59:14 Running on server: post build plugin 'Maven Dependencies Postprocessor'
21-Oct-2026 16:59:14 All post build plugins have finished
21-Oct-2026 16:59:14 Generating build results summary...
21-Oct-2026 16:59:15 Saving build results to disk...
21-Oct-2026 16:59:15 Store variable context...
21-Oct-2026 16:59:15 Finished building CASASPECS-PR239-TTO14-1.