Build: #2 was successful
Job: Test Tasks macOS15 was successful
Job result summary
- Completed
- Duration
- 106 minutes
- Agent
- cbt-macos15-test-m4-1
- Revision
-
5ee2bae61611ff32759385db05d2686835b7dd18
- Total tests
- 3611
Tests
- 3,611 tests in total
- 144 tests were quarantined / skipped
- 89 minutes taken in total.
Error summary
The build generated some errors. See the full build log for more details.
Already on 'master'
Already on 'master'
error: Your local changes to the following files would be overwritten by merge:
nrao/VLA/CalModels/3C138_K.im/table.dat
nrao/VLA/CalModels/3C138_K.im/table.lock
Please commit your changes or stash them before you merge.
Aborting
2026-10-05 16:59:42 SEVERE MeasTable::dUTC(Double) (file ../../measures/Measures/MeasTable.cc, line 4290) Leap second table TAI_UTC seems out-of-date.
2026-10-05 16:59:42 SEVERE MeasTable::dUTC(Double) (file ../../measures/Measures/MeasTable.cc, line 4290)+ Until the table is updated (see the CASA documentation or your system admin),
2026-10-05 16:59:42 SEVERE MeasTable::dUTC(Double) (file ../../measures/Measures/MeasTable.cc, line 4290)+ times and coordinates derived from UTC could be wrong by 1s or more.
2026-10-05 17:03:29 SEVERE sdgaincal::::casa Traceback (most recent call last):
2026-10-05 17:03:29 SEVERE sdgaincal::::casa+ ^^^^^^^^^^^^^^^^^^^^^
2026-10-05 17:03:29 SEVERE sdgaincal::::casa+ File "/Users/casaci/bamboohome/xml-data/build-dir/CASASPECS-PR228-TTA14/casa6testenv/lib/python3.12/site-packages/casatasks/private/task_sdgaincal.py", line 74, in sdgaincal
2026-10-05 17:03:29 SEVERE sdgaincal::::casa+ raise RuntimeError(outfile + ' exists.')
2026-10-05 17:03:29 SEVERE sdgaincal::::casa+ RuntimeError: sdgaincal_fail_test.sdgain.caltable exists.
2026-10-05 17:03:29 SEVERE sdgaincal::::casa sdgaincal_fail_test.sdgain.caltable exists.
2026-10-05 17:03:29 SEVERE sdgaincal::::casa Task sdgaincal raised an exception of class RuntimeError with the following message: sdgaincal_fail_test.sdgain.caltable exists.
2026-10-05 17:03:29 SEVERE Negative central disk size is given
2026-10-05 17:03:29 SEVERE Calibrater::setsolve Caught exception: 2026-10-05 17:03:29 SEVERE Negative central disk size is given
2026-10-05 17:03:29 SEVERE Exception Reported: Error in Calibrater::setsolve.
2026-10-05 17:03:29 SEVERE sdgaincal::::casa Traceback (most recent call last):
2026-10-05 17:03:29 SEVERE sdgaincal::::casa+ ^^^^^^^^^^^^^^^^^^^^^
2026-10-05 17:03:29 SEVERE sdgaincal::::casa+ File "/Users/casaci/bamboohome/xml-data/build-dir/CASASPECS-PR228-TTA14/casa6testenv/lib/python3.12/site-packages/casatasks/private/task_sdgaincal.py", line 127, in sdgaincal
2026-10-05 17:03:29 SEVERE sdgaincal::::casa+ mycb.setsolve(type='SDGAIN_OTFD', table=outfile, radius=rcenter, smooth=smooth)
2026-10-05 17:03:29 SEVERE sdgaincal::::casa+ File "/Users/casaci/bamboohome/xml-data/build-dir/CASASPECS-PR228-TTA14/casa6testenv/lib/python3.12/site-packages/casatools/calibrater.py", line 300, in setsolve
2026-10-05 17:03:29 SEVERE sdgaincal::::casa+ return self._swigobj.setsolve(type, t, table, append, preavg, phaseonly, apmode, refant, refantmode, minblperant, solnorm, normtype, minsnr, combine, fillgaps, cfcache, painc, fitorder, fraction, numedge, radius, smooth, zerorates, globalsolve, niter, corrcomb, delaywindow, ratewindow, paramactive, concatspws, solmode, rmsthresh)
2026-10-05 17:03:29 SEVERE sdgaincal::::casa+ ^^^^^^^^^^^^^^^^^^^^^^^^^^^^^^^^^^^^^^^^^^^^^^^^^^^^^^^^^^^^^^^^^^^^^^^^^^^^^^^^^^^^^^^^^^^^^^^^^^^^^^^^^^^^^^^^^^^^^^^^^^^^^^^^^^^^^^^^^^^^^^^^^^^^^^^^^^^^^^^^^^^^^^^^^^^^^^^^^^^^^^^^^^^^^^^^^^^^^^^^^^^^^^^^^^^^^^^^^^^^^^^^^^^^^^^^^^^^^^^^^^^^^^^^^^^^^^^^^^^^^^^^^^^^^^^^^^^^^^^^^^^^^^^^^^^^^^^^^^^^^^^^^^^^^^^^^^^^^^^^^^^^
2026-10-05 17:03:29 SEVERE sdgaincal::::casa+ File "/Users/casaci/bamboohome/xml-data/build-dir/CASASPECS-PR228-TTA14/casa6testenv/lib/python3.12/site-packages/casatools/__casac__/calibrater.py", line 632, in setsolve
2026-10-05 17:03:29 SEVERE sdgaincal::::casa+ return _calibrater.calibrater_setsolve(self, *args, **kwargs)
2026-10-05 17:03:29 SEVERE sdgaincal::::casa+ ^^^^^^^^^^^^^^^^^^^^^^^^^^^^^^^^^^^^^^^^^^^^^^^^^^^^^^
2026-10-05 17:03:29 SEVERE sdgaincal::::casa+ RuntimeError: Error in Calibrater::setsolve.
2026-10-05 17:03:29 SEVERE sdgaincal::::casa Error in Calibrater::setsolve.
2026-10-05 17:03:29 SEVERE sdgaincal::::casa Task sdgaincal raised an exception of class RuntimeError with the following message: Error in Calibrater::setsolve.
2026-10-05 17:03:29 SEVERE MeasTable::dUTC(Double) (file ../../measures/Measures/MeasTable.cc, line 4290) Leap second table TAI_UTC seems out-of-date.
2026-10-05 17:03:29 SEVERE MeasTable::dUTC(Double) (file ../../measures/Measures/MeasTable.cc, line 4290)+ Until the table is updated (see the CASA documentation or your system admin),
2026-10-05 17:03:29 SEVERE MeasTable::dUTC(Double) (file ../../measures/Measures/MeasTable.cc, line 4290)+ times and coordinates derived from UTC could be wrong by 1s or more.
2026-10-05 17:03:40 WARN SDDoubleCircleGainCal::doCalibrate (file /Users/casaci/bamboohome/xml-data/build-dir/CASASPECS-PR228-BPMACOS15PY312/casa6/casatools/src/code/synthesis/MeasurementComponents/SDDoubleCircleGainCalImpl.cc, line 328) Probably not enough points for gain calibration: 13
2026-10-05 17:03:40 WARN SDDoubleCircleGainCal::doCalibrate (file /Users/casaci/bamboohome/xml-data/build-dir/CASASPECS-PR228-BPMACOS15PY312/casa6/casatools/src/code/synthesis/MeasurementComponents/SDDoubleCircleGainCalImpl.cc, line 328)+ Skipping...
2026-10-05 17:03:40 WARN SDDoubleCircleGainCal::doCalibrate (file /Users/casaci/bamboohome/xml-data/build-dir/CASASPECS-PR228-BPMACOS15PY312/casa6/casatools/src/code/synthesis/MeasurementComponents/SDDoubleCircleGainCalImpl.cc, line 328) Probably not enough points for gain calibration: 13
2026-10-05 17:03:40 WARN SDDoubleCircleGainCal::doCalibrate (file /Users/casaci/bamboohome/xml-data/build-dir/CASASPECS-PR228-BPMACOS15PY312/casa6/casatools/src/code/synthesis/MeasurementComponents/SDDoubleCircleGainCalImpl.cc, line 328)+ Skipping...
2026-10-05 17:04:14 WARN sdcal::calibrater::setvi(bool,bool) Forcing use of OLD VisibilityIterator.
2026-10-05 17:04:19 WARN CTPatchedInterp::interpolate In caltable doublecircletest_const.ms.sky (SDSKY_PS):
2026-10-05 17:04:19 WARN CTPatchedInterp::interpolate+ Insufficient solution channel sampling (nchan=1) for frequency-dependent LINEAR interpolation
2026-10-05 17:04:19 WARN CTPatchedInterp::interpolate+ of calibration for MS spw=0; using NEAREST instead.
2026-10-05 17:04:22 WARN CTPatchedInterp::interpolate In caltable doublecircletest_const.ms.sky (SDSKY_PS):
2026-10-05 17:04:22 WARN CTPatchedInterp::interpolate+ Insufficient solution channel sampling (nchan=1) for frequency-dependent LINEAR interpolation
2026-10-05 17:04:22 WARN CTPatchedInterp::interpolate+ of calibration for MS spw=1; using NEAREST instead.
2026-10-05 17:04:25 WARN sdcal::calibrater::setvi(bool,bool) Already using OLD VisibilityIterator.
2026-10-05 17:04:30 WARN CTPatchedInterp::interpolate In caltable doublecircletest_const.ms.tsys (B TSYS):
2026-10-05 17:04:30 WARN CTPatchedInterp::interpolate+ Insufficient solution channel sampling (nchan=1) for frequency-dependent LINEAR interpolation
2026-10-05 17:04:30 WARN CTPatchedInterp::interpolate+ of calibration for MS spw=0; using NEAREST instead.
2026-10-05 17:04:33 WARN CTPatchedInterp::interpolate In caltable doublecircletest_const.ms.tsys (B TSYS):
2026-10-05 17:04:33 WARN CTPatchedInterp::interpolate+ Insufficient solution channel sampling (nchan=1) for frequency-dependent LINEAR interpolation
2026-10-05 17:04:33 WARN CTPatchedInterp::interpolate+ of calibration for MS spw=1; using NEAREST instead.
2026-10-05 17:04:36 WARN sdcal::calibrater::setvi(bool,bool) Already using OLD VisibilityIterator.
2026-10-05 17:04:42 WARN CTPatchedInterp::interpolate In caltable doublecircletest_const.ms.sky (SDSKY_PS):
2026-10-05 17:04:42 WARN CTPatchedInterp::interpolate+ Insufficient solution channel sampling (nchan=1) for frequency-dependent LINEAR interpolation
2026-10-05 17:04:42 WARN CTPatchedInterp::interpolate+ of calibration for MS spw=0; using NEAREST instead.
2026-10-05 17:04:42 WARN CTPatchedInterp::interpolate In caltable doublecircletest_const.ms.tsys (B TSYS):
2026-10-05 17:04:42 WARN CTPatchedInterp::interpolate+ Insufficient solution channel sampling (nchan=1) for frequency-dependent LINEAR interpolation
2026-10-05 17:04:42 WARN CTPatchedInterp::interpolate+ of calibration for MS spw=0; using NEAREST instead.
2026-10-05 17:04:44 WARN CTPatchedInterp::interpolate In caltable doublecircletest_const.ms.sky (SDSKY_PS):
2026-10-05 17:04:44 WARN CTPatchedInterp::interpolate+ Insufficient solution channel sampling (nchan=1) for frequency-dependent LINEAR interpolation
2026-10-05 17:04:44 WARN CTPatchedInterp::interpolate+ of calibration for MS spw=1; using NEAREST instead.
2026-10-05 17:04:44 WARN CTPatchedInterp::interpolate In caltable doublecircletest_const.ms.tsys (B TSYS):
2026-10-05 17:04:44 WARN CTPatchedInterp::interpolate+ Insufficient solution channel sampling (nchan=1) for frequency-dependent LINEAR interpolation
2026-10-05 17:04:44 WARN CTPatchedInterp::interpolate+ of calibration for MS spw=1; using NEAREST instead.
2026-10-05 17:04:47 WARN sdcal::calibrater::setvi(bool,bool) Already using OLD VisibilityIterator.
2026-10-05 17:04:53 WARN CTPatchedInterp::interpolate In caltable doublecircletest_const.ms.sky (SDSKY_PS):
2026-10-05 17:04:53 WARN CTPatchedInterp::interpolate+ Insufficient solution channel sampling (nchan=1) for frequency-dependent LINEAR interpolation
2026-10-05 17:04:53 WARN CTPatchedInterp::interpolate+ of calibration for MS spw=0; using NEAREST instead.
2026-10-05 17:04:53 WARN CTPatchedInterp::interpolate In caltable doublecircletest_const.ms.tsys (B TSYS):
2026-10-05 17:04:53 WARN CTPatchedInterp::interpolate+ Insufficient solution channel sampling (nchan=1) for frequency-dependent LINEAR interpolation
2026-10-05 17:04:53 WARN CTPatchedInterp::interpolate+ of calibration for MS spw=0 (mapped to CT spw=2); using NEAREST instead.
2026-10-05 17:04:55 WARN CTPatchedInterp::interpolate In caltable doublecircletest_const.ms.sky (SDSKY_PS):
2026-10-05 17:04:55 WARN CTPatchedInterp::interpolate+ Insufficient solution channel sampling (nchan=1) for frequency-dependent LINEAR interpolation
2026-10-05 17:04:55 WARN CTPatchedInterp::interpolate+ of calibration for MS spw=1; using NEAREST instead.
2026-10-05 17:04:55 WARN CTPatchedInterp::interpolate In caltable doublecircletest_const.ms.tsys (B TSYS):
2026-10-05 17:04:55 WARN CTPatchedInterp::interpolate+ Insufficient solution channel sampling (nchan=1) for frequency-dependent LINEAR interpolation
2026-10-05 17:04:55 WARN CTPatchedInterp::interpolate+ of calibration for MS spw=1 (mapped to CT spw=3); using NEAREST instead.
2026-10-05 17:05:12 SEVERE MeasTable::dUTC(Double) (file ../../measures/Measures/MeasTable.cc, line 4290) Leap second table TAI_UTC seems out-of-date.
2026-10-05 17:05:12 SEVERE MeasTable::dUTC(Double) (file ../../measures/Measures/MeasTable.cc, line 4290)+ Until the table is updated (see the CASA documentation or your system admin),
2026-10-05 17:05:12 SEVERE MeasTable::dUTC(Double) (file ../../measures/Measures/MeasTable.cc, line 4290)+ times and coordinates derived from UTC could be wrong by 1s or more.
2026-10-05 17:05:14 WARN Calibrater::solve Spectral window(s) 0,
2026-10-05 17:05:14 WARN Calibrater::solve+ could not be solved due to missing (pre-)calibration
2026-10-05 17:05:14 WARN Calibrater::solve+ in one or more of the specified tables.
2026-10-05 17:05:14 WARN Calibrater::solve+ Please check your results carefully!
2026-10-05 17:05:20 SEVERE getephemtable::::casa Task getephemtable raised an exception of class ValueError with the following message: objectname must be specified
2026-10-05 17:05:20 SEVERE getephemtable::::casa Task getephemtable raised an exception of class ValueError with the following message: timerange must be specified
2026-10-05 17:05:20 SEVERE getephemtable::::casa Task getephemtable raised an exception of class ValueError with the following message: outfile must be specified
2026-10-05 17:05:20 SEVERE getephemtable::::casa Task getephemtable raised an exception of class RuntimeError with the following message: objectname is given as an ID number, need to set asis=True
2026-10-05 17:05:20 SEVERE getephemtable::::casa Task getephemtable raised an exception of class ValueError with the following message: timerange needs to be specified with starttime and stoptime delimited by ~ .
2026-10-05 17:05:20 SEVERE getephemtable::::casa Task getephemtable raised an exception of class ValueError with the following message: Error translating stop time of timerange specified in JD.
2026-10-05 17:05:20 SEVERE getephemtable::::casa Task getephemtable raised an exception of class ValueError with the following message: Error translating stop time of timerange specified in MJD.
2026-10-05 17:05:20 SEVERE getephemtable::::casa Task getephemtable raised an exception of class ValueError with the following message: Error in timerange format. Use YYYY/MM/DD/hh:mm or Julian date with a prefix 'JD' Modified Julian date with a prefix 'MJD'
2026-10-05 17:05:20 SEVERE getephemtable::::casa Task getephemtable raised an exception of class ValueError with the following message: interval value must be integer
2026-10-05 17:05:20 WARN getephemtable::::casa Unexpected format for rotational period or the value is empty, the rotational period cannot be extracted.
2026-10-05 17:05:21 SEVERE getephemtable::::casa Task getephemtable raised an exception of class ValueError with the following message: testephem.tab exists and overwrite=False
2026-10-05 17:05:22 WARN getephemtable::::casa Unexpected format for rotational period or the value is empty, the rotational period cannot be extracted.
2026-10-05 17:05:24 WARN getephemtable::::casa Unexpected format for rotational period or the value is empty, the rotational period cannot be extracted.
2026-10-05 17:05:25 WARN getephemtable::::casa Unexpected format for rotational period or the value is empty, the rotational period cannot be extracted.
2026-10-05 17:05:25 WARN getephemtable::::casa Unexpected format for rotational period or the value is empty, the rotational period cannot be extracted.
2026-10-05 17:05:25 WARN getephemtable::::casa Unexpected format for rotational period or the value is empty, the rotational period cannot be extracted.
2026-10-05 17:05:25 WARN getephemtable::::casa Unexpected format for rotational period or the value is empty, the rotational period cannot be extracted.
2026-10-05 17:05:25 WARN getephemtable::::casa Unexpected format for rotational period or the value is empty, the rotational period cannot be extracted.
2026-10-05 17:05:25 SEVERE getephemtable::::casa Task getephemtable raised an exception of class HTTPError with the following message: HTTP Error 404: Not Found
2026-10-05 17:05:25 SEVERE getephemtable::::casa Task getephemtable raised an exception of class URLError with the following message: <urlopen error Unknown host>
Already on 'master'
error: Your local changes to the following files would be overwritten by merge:
nrao/VLA/CalModels/3C138_K.im/table.dat
nrao/VLA/CalModels/3C138_K.im/table.lock
Please commit your changes or stash them before you merge.
Aborting
2026-10-05 16:59:42 SEVERE MeasTable::dUTC(Double) (file ../../measures/Measures/MeasTable.cc, line 4290) Leap second table TAI_UTC seems out-of-date.
2026-10-05 16:59:42 SEVERE MeasTable::dUTC(Double) (file ../../measures/Measures/MeasTable.cc, line 4290)+ Until the table is updated (see the CASA documentation or your system admin),
2026-10-05 16:59:42 SEVERE MeasTable::dUTC(Double) (file ../../measures/Measures/MeasTable.cc, line 4290)+ times and coordinates derived from UTC could be wrong by 1s or more.
2026-10-05 17:03:29 SEVERE sdgaincal::::casa Traceback (most recent call last):
2026-10-05 17:03:29 SEVERE sdgaincal::::casa+ ^^^^^^^^^^^^^^^^^^^^^
2026-10-05 17:03:29 SEVERE sdgaincal::::casa+ File "/Users/casaci/bamboohome/xml-data/build-dir/CASASPECS-PR228-TTA14/casa6testenv/lib/python3.12/site-packages/casatasks/private/task_sdgaincal.py", line 74, in sdgaincal
2026-10-05 17:03:29 SEVERE sdgaincal::::casa+ raise RuntimeError(outfile + ' exists.')
2026-10-05 17:03:29 SEVERE sdgaincal::::casa+ RuntimeError: sdgaincal_fail_test.sdgain.caltable exists.
2026-10-05 17:03:29 SEVERE sdgaincal::::casa sdgaincal_fail_test.sdgain.caltable exists.
2026-10-05 17:03:29 SEVERE sdgaincal::::casa Task sdgaincal raised an exception of class RuntimeError with the following message: sdgaincal_fail_test.sdgain.caltable exists.
2026-10-05 17:03:29 SEVERE Negative central disk size is given
2026-10-05 17:03:29 SEVERE Calibrater::setsolve Caught exception: 2026-10-05 17:03:29 SEVERE Negative central disk size is given
2026-10-05 17:03:29 SEVERE Exception Reported: Error in Calibrater::setsolve.
2026-10-05 17:03:29 SEVERE sdgaincal::::casa Traceback (most recent call last):
2026-10-05 17:03:29 SEVERE sdgaincal::::casa+ ^^^^^^^^^^^^^^^^^^^^^
2026-10-05 17:03:29 SEVERE sdgaincal::::casa+ File "/Users/casaci/bamboohome/xml-data/build-dir/CASASPECS-PR228-TTA14/casa6testenv/lib/python3.12/site-packages/casatasks/private/task_sdgaincal.py", line 127, in sdgaincal
2026-10-05 17:03:29 SEVERE sdgaincal::::casa+ mycb.setsolve(type='SDGAIN_OTFD', table=outfile, radius=rcenter, smooth=smooth)
2026-10-05 17:03:29 SEVERE sdgaincal::::casa+ File "/Users/casaci/bamboohome/xml-data/build-dir/CASASPECS-PR228-TTA14/casa6testenv/lib/python3.12/site-packages/casatools/calibrater.py", line 300, in setsolve
2026-10-05 17:03:29 SEVERE sdgaincal::::casa+ return self._swigobj.setsolve(type, t, table, append, preavg, phaseonly, apmode, refant, refantmode, minblperant, solnorm, normtype, minsnr, combine, fillgaps, cfcache, painc, fitorder, fraction, numedge, radius, smooth, zerorates, globalsolve, niter, corrcomb, delaywindow, ratewindow, paramactive, concatspws, solmode, rmsthresh)
2026-10-05 17:03:29 SEVERE sdgaincal::::casa+ ^^^^^^^^^^^^^^^^^^^^^^^^^^^^^^^^^^^^^^^^^^^^^^^^^^^^^^^^^^^^^^^^^^^^^^^^^^^^^^^^^^^^^^^^^^^^^^^^^^^^^^^^^^^^^^^^^^^^^^^^^^^^^^^^^^^^^^^^^^^^^^^^^^^^^^^^^^^^^^^^^^^^^^^^^^^^^^^^^^^^^^^^^^^^^^^^^^^^^^^^^^^^^^^^^^^^^^^^^^^^^^^^^^^^^^^^^^^^^^^^^^^^^^^^^^^^^^^^^^^^^^^^^^^^^^^^^^^^^^^^^^^^^^^^^^^^^^^^^^^^^^^^^^^^^^^^^^^^^^^^^^^^
2026-10-05 17:03:29 SEVERE sdgaincal::::casa+ File "/Users/casaci/bamboohome/xml-data/build-dir/CASASPECS-PR228-TTA14/casa6testenv/lib/python3.12/site-packages/casatools/__casac__/calibrater.py", line 632, in setsolve
2026-10-05 17:03:29 SEVERE sdgaincal::::casa+ return _calibrater.calibrater_setsolve(self, *args, **kwargs)
2026-10-05 17:03:29 SEVERE sdgaincal::::casa+ ^^^^^^^^^^^^^^^^^^^^^^^^^^^^^^^^^^^^^^^^^^^^^^^^^^^^^^
2026-10-05 17:03:29 SEVERE sdgaincal::::casa+ RuntimeError: Error in Calibrater::setsolve.
2026-10-05 17:03:29 SEVERE sdgaincal::::casa Error in Calibrater::setsolve.
2026-10-05 17:03:29 SEVERE sdgaincal::::casa Task sdgaincal raised an exception of class RuntimeError with the following message: Error in Calibrater::setsolve.
2026-10-05 17:03:29 SEVERE MeasTable::dUTC(Double) (file ../../measures/Measures/MeasTable.cc, line 4290) Leap second table TAI_UTC seems out-of-date.
2026-10-05 17:03:29 SEVERE MeasTable::dUTC(Double) (file ../../measures/Measures/MeasTable.cc, line 4290)+ Until the table is updated (see the CASA documentation or your system admin),
2026-10-05 17:03:29 SEVERE MeasTable::dUTC(Double) (file ../../measures/Measures/MeasTable.cc, line 4290)+ times and coordinates derived from UTC could be wrong by 1s or more.
2026-10-05 17:03:40 WARN SDDoubleCircleGainCal::doCalibrate (file /Users/casaci/bamboohome/xml-data/build-dir/CASASPECS-PR228-BPMACOS15PY312/casa6/casatools/src/code/synthesis/MeasurementComponents/SDDoubleCircleGainCalImpl.cc, line 328) Probably not enough points for gain calibration: 13
2026-10-05 17:03:40 WARN SDDoubleCircleGainCal::doCalibrate (file /Users/casaci/bamboohome/xml-data/build-dir/CASASPECS-PR228-BPMACOS15PY312/casa6/casatools/src/code/synthesis/MeasurementComponents/SDDoubleCircleGainCalImpl.cc, line 328)+ Skipping...
2026-10-05 17:03:40 WARN SDDoubleCircleGainCal::doCalibrate (file /Users/casaci/bamboohome/xml-data/build-dir/CASASPECS-PR228-BPMACOS15PY312/casa6/casatools/src/code/synthesis/MeasurementComponents/SDDoubleCircleGainCalImpl.cc, line 328) Probably not enough points for gain calibration: 13
2026-10-05 17:03:40 WARN SDDoubleCircleGainCal::doCalibrate (file /Users/casaci/bamboohome/xml-data/build-dir/CASASPECS-PR228-BPMACOS15PY312/casa6/casatools/src/code/synthesis/MeasurementComponents/SDDoubleCircleGainCalImpl.cc, line 328)+ Skipping...
2026-10-05 17:04:14 WARN sdcal::calibrater::setvi(bool,bool) Forcing use of OLD VisibilityIterator.
2026-10-05 17:04:19 WARN CTPatchedInterp::interpolate In caltable doublecircletest_const.ms.sky (SDSKY_PS):
2026-10-05 17:04:19 WARN CTPatchedInterp::interpolate+ Insufficient solution channel sampling (nchan=1) for frequency-dependent LINEAR interpolation
2026-10-05 17:04:19 WARN CTPatchedInterp::interpolate+ of calibration for MS spw=0; using NEAREST instead.
2026-10-05 17:04:22 WARN CTPatchedInterp::interpolate In caltable doublecircletest_const.ms.sky (SDSKY_PS):
2026-10-05 17:04:22 WARN CTPatchedInterp::interpolate+ Insufficient solution channel sampling (nchan=1) for frequency-dependent LINEAR interpolation
2026-10-05 17:04:22 WARN CTPatchedInterp::interpolate+ of calibration for MS spw=1; using NEAREST instead.
2026-10-05 17:04:25 WARN sdcal::calibrater::setvi(bool,bool) Already using OLD VisibilityIterator.
2026-10-05 17:04:30 WARN CTPatchedInterp::interpolate In caltable doublecircletest_const.ms.tsys (B TSYS):
2026-10-05 17:04:30 WARN CTPatchedInterp::interpolate+ Insufficient solution channel sampling (nchan=1) for frequency-dependent LINEAR interpolation
2026-10-05 17:04:30 WARN CTPatchedInterp::interpolate+ of calibration for MS spw=0; using NEAREST instead.
2026-10-05 17:04:33 WARN CTPatchedInterp::interpolate In caltable doublecircletest_const.ms.tsys (B TSYS):
2026-10-05 17:04:33 WARN CTPatchedInterp::interpolate+ Insufficient solution channel sampling (nchan=1) for frequency-dependent LINEAR interpolation
2026-10-05 17:04:33 WARN CTPatchedInterp::interpolate+ of calibration for MS spw=1; using NEAREST instead.
2026-10-05 17:04:36 WARN sdcal::calibrater::setvi(bool,bool) Already using OLD VisibilityIterator.
2026-10-05 17:04:42 WARN CTPatchedInterp::interpolate In caltable doublecircletest_const.ms.sky (SDSKY_PS):
2026-10-05 17:04:42 WARN CTPatchedInterp::interpolate+ Insufficient solution channel sampling (nchan=1) for frequency-dependent LINEAR interpolation
2026-10-05 17:04:42 WARN CTPatchedInterp::interpolate+ of calibration for MS spw=0; using NEAREST instead.
2026-10-05 17:04:42 WARN CTPatchedInterp::interpolate In caltable doublecircletest_const.ms.tsys (B TSYS):
2026-10-05 17:04:42 WARN CTPatchedInterp::interpolate+ Insufficient solution channel sampling (nchan=1) for frequency-dependent LINEAR interpolation
2026-10-05 17:04:42 WARN CTPatchedInterp::interpolate+ of calibration for MS spw=0; using NEAREST instead.
2026-10-05 17:04:44 WARN CTPatchedInterp::interpolate In caltable doublecircletest_const.ms.sky (SDSKY_PS):
2026-10-05 17:04:44 WARN CTPatchedInterp::interpolate+ Insufficient solution channel sampling (nchan=1) for frequency-dependent LINEAR interpolation
2026-10-05 17:04:44 WARN CTPatchedInterp::interpolate+ of calibration for MS spw=1; using NEAREST instead.
2026-10-05 17:04:44 WARN CTPatchedInterp::interpolate In caltable doublecircletest_const.ms.tsys (B TSYS):
2026-10-05 17:04:44 WARN CTPatchedInterp::interpolate+ Insufficient solution channel sampling (nchan=1) for frequency-dependent LINEAR interpolation
2026-10-05 17:04:44 WARN CTPatchedInterp::interpolate+ of calibration for MS spw=1; using NEAREST instead.
2026-10-05 17:04:47 WARN sdcal::calibrater::setvi(bool,bool) Already using OLD VisibilityIterator.
2026-10-05 17:04:53 WARN CTPatchedInterp::interpolate In caltable doublecircletest_const.ms.sky (SDSKY_PS):
2026-10-05 17:04:53 WARN CTPatchedInterp::interpolate+ Insufficient solution channel sampling (nchan=1) for frequency-dependent LINEAR interpolation
2026-10-05 17:04:53 WARN CTPatchedInterp::interpolate+ of calibration for MS spw=0; using NEAREST instead.
2026-10-05 17:04:53 WARN CTPatchedInterp::interpolate In caltable doublecircletest_const.ms.tsys (B TSYS):
2026-10-05 17:04:53 WARN CTPatchedInterp::interpolate+ Insufficient solution channel sampling (nchan=1) for frequency-dependent LINEAR interpolation
2026-10-05 17:04:53 WARN CTPatchedInterp::interpolate+ of calibration for MS spw=0 (mapped to CT spw=2); using NEAREST instead.
2026-10-05 17:04:55 WARN CTPatchedInterp::interpolate In caltable doublecircletest_const.ms.sky (SDSKY_PS):
2026-10-05 17:04:55 WARN CTPatchedInterp::interpolate+ Insufficient solution channel sampling (nchan=1) for frequency-dependent LINEAR interpolation
2026-10-05 17:04:55 WARN CTPatchedInterp::interpolate+ of calibration for MS spw=1; using NEAREST instead.
2026-10-05 17:04:55 WARN CTPatchedInterp::interpolate In caltable doublecircletest_const.ms.tsys (B TSYS):
2026-10-05 17:04:55 WARN CTPatchedInterp::interpolate+ Insufficient solution channel sampling (nchan=1) for frequency-dependent LINEAR interpolation
2026-10-05 17:04:55 WARN CTPatchedInterp::interpolate+ of calibration for MS spw=1 (mapped to CT spw=3); using NEAREST instead.
2026-10-05 17:05:12 SEVERE MeasTable::dUTC(Double) (file ../../measures/Measures/MeasTable.cc, line 4290) Leap second table TAI_UTC seems out-of-date.
2026-10-05 17:05:12 SEVERE MeasTable::dUTC(Double) (file ../../measures/Measures/MeasTable.cc, line 4290)+ Until the table is updated (see the CASA documentation or your system admin),
2026-10-05 17:05:12 SEVERE MeasTable::dUTC(Double) (file ../../measures/Measures/MeasTable.cc, line 4290)+ times and coordinates derived from UTC could be wrong by 1s or more.
2026-10-05 17:05:14 WARN Calibrater::solve Spectral window(s) 0,
2026-10-05 17:05:14 WARN Calibrater::solve+ could not be solved due to missing (pre-)calibration
2026-10-05 17:05:14 WARN Calibrater::solve+ in one or more of the specified tables.
2026-10-05 17:05:14 WARN Calibrater::solve+ Please check your results carefully!
2026-10-05 17:05:20 SEVERE getephemtable::::casa Task getephemtable raised an exception of class ValueError with the following message: objectname must be specified
2026-10-05 17:05:20 SEVERE getephemtable::::casa Task getephemtable raised an exception of class ValueError with the following message: timerange must be specified
2026-10-05 17:05:20 SEVERE getephemtable::::casa Task getephemtable raised an exception of class ValueError with the following message: outfile must be specified
2026-10-05 17:05:20 SEVERE getephemtable::::casa Task getephemtable raised an exception of class RuntimeError with the following message: objectname is given as an ID number, need to set asis=True
2026-10-05 17:05:20 SEVERE getephemtable::::casa Task getephemtable raised an exception of class ValueError with the following message: timerange needs to be specified with starttime and stoptime delimited by ~ .
2026-10-05 17:05:20 SEVERE getephemtable::::casa Task getephemtable raised an exception of class ValueError with the following message: Error translating stop time of timerange specified in JD.
2026-10-05 17:05:20 SEVERE getephemtable::::casa Task getephemtable raised an exception of class ValueError with the following message: Error translating stop time of timerange specified in MJD.
2026-10-05 17:05:20 SEVERE getephemtable::::casa Task getephemtable raised an exception of class ValueError with the following message: Error in timerange format. Use YYYY/MM/DD/hh:mm or Julian date with a prefix 'JD' Modified Julian date with a prefix 'MJD'
2026-10-05 17:05:20 SEVERE getephemtable::::casa Task getephemtable raised an exception of class ValueError with the following message: interval value must be integer
2026-10-05 17:05:20 WARN getephemtable::::casa Unexpected format for rotational period or the value is empty, the rotational period cannot be extracted.
2026-10-05 17:05:21 SEVERE getephemtable::::casa Task getephemtable raised an exception of class ValueError with the following message: testephem.tab exists and overwrite=False
2026-10-05 17:05:22 WARN getephemtable::::casa Unexpected format for rotational period or the value is empty, the rotational period cannot be extracted.
2026-10-05 17:05:24 WARN getephemtable::::casa Unexpected format for rotational period or the value is empty, the rotational period cannot be extracted.
2026-10-05 17:05:25 WARN getephemtable::::casa Unexpected format for rotational period or the value is empty, the rotational period cannot be extracted.
2026-10-05 17:05:25 WARN getephemtable::::casa Unexpected format for rotational period or the value is empty, the rotational period cannot be extracted.
2026-10-05 17:05:25 WARN getephemtable::::casa Unexpected format for rotational period or the value is empty, the rotational period cannot be extracted.
2026-10-05 17:05:25 WARN getephemtable::::casa Unexpected format for rotational period or the value is empty, the rotational period cannot be extracted.
2026-10-05 17:05:25 WARN getephemtable::::casa Unexpected format for rotational period or the value is empty, the rotational period cannot be extracted.
2026-10-05 17:05:25 SEVERE getephemtable::::casa Task getephemtable raised an exception of class HTTPError with the following message: HTTP Error 404: Not Found
2026-10-05 17:05:25 SEVERE getephemtable::::casa Task getephemtable raised an exception of class URLError with the following message: <urlopen error Unknown host>