Build: #1 failed

Job: Test Tasks macOS15 failed

Build log

The build generated 64,824 lines of output.   The output is too long and has been truncated to the last 1,000 lines. Download or view full build log.

15-Sep-2026 17:11:53 _run_task::starts
15-Sep-2026 17:11:53 -- checking Output Record Count --
15-Sep-2026 17:11:53 tearDown::deleting MSs.
15-Sep-2026 17:11:53 PASSED
15-Sep-2026 17:11:53
15-Sep-2026 17:11:53 2026-09-15 21:11:54        SEVERE        sdtimeaverage::::casa        Traceback (most recent call last):
15-Sep-2026 17:11:53 2026-09-15 21:11:54        SEVERE        sdtimeaverage::::casa+                     ^^^^^^^^^^^^^^^^^^^^^
15-Sep-2026 17:11:53 2026-09-15 21:11:54        SEVERE        sdtimeaverage::::casa+          File "/Users/casaci/bamboohome/xml-data/build-dir/CASASPECS-PR223-TTA14/casa6testenv/lib/python3.12/site-packages/casatasks/private/task_sdtimeaverage.py", line 73, in sdtimeaverage
15-Sep-2026 17:11:53 2026-09-15 21:11:54        SEVERE        sdtimeaverage::::casa+            sdutil.do_mst(
15-Sep-2026 17:11:53 2026-09-15 21:11:54        SEVERE        sdtimeaverage::::casa+          File "/Users/casaci/bamboohome/xml-data/build-dir/CASASPECS-PR223-TTA14/casa6testenv/lib/python3.12/site-packages/casatasks/private/sdutil.py", line 702, in do_mst
15-Sep-2026 17:11:53 2026-09-15 21:11:54        SEVERE        sdtimeaverage::::casa+            mtlocal.open()
15-Sep-2026 17:11:53 2026-09-15 21:11:54        SEVERE        sdtimeaverage::::casa+          File "/Users/casaci/bamboohome/xml-data/build-dir/CASASPECS-PR223-TTA14/casa6testenv/lib/python3.12/site-packages/casatools/mstransformer.py", line 36, in open
15-Sep-2026 17:11:53 2026-09-15 21:11:54        SEVERE        sdtimeaverage::::casa+            return self._swigobj.open()
15-Sep-2026 17:11:53 2026-09-15 21:11:54        SEVERE        sdtimeaverage::::casa+                   ^^^^^^^^^^^^^^^^^^^^
15-Sep-2026 17:11:53 2026-09-15 21:11:54        SEVERE        sdtimeaverage::::casa+          File "/Users/casaci/bamboohome/xml-data/build-dir/CASASPECS-PR223-TTA14/casa6testenv/lib/python3.12/site-packages/casatools/__casac__/mstransformer.py", line 127, in open
15-Sep-2026 17:11:53 2026-09-15 21:11:54        SEVERE        sdtimeaverage::::casa+            return _mstransformer.mstransformer_open(self)
15-Sep-2026 17:11:53 2026-09-15 21:11:54        SEVERE        sdtimeaverage::::casa+                   ^^^^^^^^^^^^^^^^^^^^^^^^^^^^^^^^^^^^^^^
15-Sep-2026 17:11:53 2026-09-15 21:11:54        SEVERE        sdtimeaverage::::casa+        RuntimeError: Antenna Expression: No match found for token(s) "gBT" 
15-Sep-2026 17:11:53 2026-09-15 21:11:54        SEVERE        sdtimeaverage::::casa        Antenna Expression: No match found for token(s) "gBT" 
15-Sep-2026 17:11:53 2026-09-15 21:11:54        SEVERE        sdtimeaverage::::casa        Task sdtimeaverage raised an exception of class RuntimeError with the following message: Antenna Expression: No match found for token(s) "gBT" 
15-Sep-2026 17:11:53 test_task_sdtimeaverage.py::test_sdtimeaverage::test_param42E
15-Sep-2026 17:11:53 sdtimeaverage::42E antenna = 'gBT' (Error: Bad name).
15-Sep-2026 17:11:53 _run_task::starts
15-Sep-2026 17:11:53 Exception running sdtimeaverage: Antenna Expression: No match found for token(s) "gBT" 
15-Sep-2026 17:11:53 tearDown::deleting MSs.
15-Sep-2026 17:11:53 PASSED
15-Sep-2026 17:11:53
15-Sep-2026 17:11:54 2026-09-15 21:11:54        SEVERE        sdtimeaverage::::casa        Traceback (most recent call last):
15-Sep-2026 17:11:54 2026-09-15 21:11:54        SEVERE        sdtimeaverage::::casa+                     ^^^^^^^^^^^^^^^^^^^^^
15-Sep-2026 17:11:54 2026-09-15 21:11:54        SEVERE        sdtimeaverage::::casa+          File "/Users/casaci/bamboohome/xml-data/build-dir/CASASPECS-PR223-TTA14/casa6testenv/lib/python3.12/site-packages/casatasks/private/task_sdtimeaverage.py", line 73, in sdtimeaverage
15-Sep-2026 17:11:54 2026-09-15 21:11:54        SEVERE        sdtimeaverage::::casa+            sdutil.do_mst(
15-Sep-2026 17:11:54 2026-09-15 21:11:54        SEVERE        sdtimeaverage::::casa+          File "/Users/casaci/bamboohome/xml-data/build-dir/CASASPECS-PR223-TTA14/casa6testenv/lib/python3.12/site-packages/casatasks/private/sdutil.py", line 702, in do_mst
15-Sep-2026 17:11:54 2026-09-15 21:11:54        SEVERE        sdtimeaverage::::casa+            mtlocal.open()
15-Sep-2026 17:11:54 2026-09-15 21:11:54        SEVERE        sdtimeaverage::::casa+          File "/Users/casaci/bamboohome/xml-data/build-dir/CASASPECS-PR223-TTA14/casa6testenv/lib/python3.12/site-packages/casatools/mstransformer.py", line 36, in open
15-Sep-2026 17:11:54 2026-09-15 21:11:54        SEVERE        sdtimeaverage::::casa+            return self._swigobj.open()
15-Sep-2026 17:11:54 2026-09-15 21:11:54        SEVERE        sdtimeaverage::::casa+                   ^^^^^^^^^^^^^^^^^^^^
15-Sep-2026 17:11:54 2026-09-15 21:11:54        SEVERE        sdtimeaverage::::casa+          File "/Users/casaci/bamboohome/xml-data/build-dir/CASASPECS-PR223-TTA14/casa6testenv/lib/python3.12/site-packages/casatools/__casac__/mstransformer.py", line 127, in open
15-Sep-2026 17:11:54 2026-09-15 21:11:54        SEVERE        sdtimeaverage::::casa+            return _mstransformer.mstransformer_open(self)
15-Sep-2026 17:11:54 2026-09-15 21:11:54        SEVERE        sdtimeaverage::::casa+                   ^^^^^^^^^^^^^^^^^^^^^^^^^^^^^^^^^^^^^^^
15-Sep-2026 17:11:54 2026-09-15 21:11:54        SEVERE        sdtimeaverage::::casa+        RuntimeError: Antenna Expression: No match found for token(s) "gBT" 
15-Sep-2026 17:11:54 2026-09-15 21:11:54        SEVERE        sdtimeaverage::::casa        Antenna Expression: No match found for token(s) "gBT" 
15-Sep-2026 17:11:54 2026-09-15 21:11:54        SEVERE        sdtimeaverage::::casa        Task sdtimeaverage raised an exception of class RuntimeError with the following message: Antenna Expression: No match found for token(s) "gBT" 
15-Sep-2026 17:11:54 test_task_sdtimeaverage.py::test_sdtimeaverage::test_param43E
15-Sep-2026 17:11:54 sdtimeaverage::43E antenna = 'gBT&&&' (Error: Bad name with &&&).
15-Sep-2026 17:11:54 _run_task::starts
15-Sep-2026 17:11:54 Exception running sdtimeaverage: Antenna Expression: No match found for token(s) "gBT" 
15-Sep-2026 17:11:54 tearDown::deleting MSs.
15-Sep-2026 17:11:54 PASSED
15-Sep-2026 17:11:54
15-Sep-2026 17:11:54 test_task_sdtimeaverage.py::test_sdtimeaverage::test_param50
15-Sep-2026 17:11:54 sdtimeaverage::50:: MS= 'float_data'   arg = 'float_data' (NORMAL).
15-Sep-2026 17:11:54 _run_task::starts
15-Sep-2026 17:11:54 tearDown::deleting MSs.
15-Sep-2026 17:11:54 PASSED
15-Sep-2026 17:11:54
15-Sep-2026 17:11:54 test_task_sdtimeaverage.py::test_sdtimeaverage::test_param51
15-Sep-2026 17:11:54 sdtimeaverage::51:: MS= 'float_data'    arg = 'data' (Column Switch).
15-Sep-2026 17:11:54 _run_task::starts
15-Sep-2026 17:11:54 tearDown::deleting MSs.
15-Sep-2026 17:11:54 PASSED
15-Sep-2026 17:11:54
15-Sep-2026 17:11:54 2026-09-15 21:11:55        WARN        MSTransformManager::parseTimeAvgParams        Operating with ALMA data, automatically adding state to timespan
15-Sep-2026 17:11:54 2026-09-15 21:11:55        WARN        MSTransformManager::parseTimeAvgParams+        In order to remove sub-scan boundaries which limit time average to 30s
15-Sep-2026 17:11:55 test_task_sdtimeaverage.py::test_sdtimeaverage::test_param52
15-Sep-2026 17:11:55 sdtimeaverage::52:: MS= 'data'    arg = 'float_data' (Column Switch).
15-Sep-2026 17:11:55 _run_task::starts
15-Sep-2026 17:11:55 tearDown::deleting MSs.
15-Sep-2026 17:11:55 PASSED
15-Sep-2026 17:11:55
15-Sep-2026 17:11:55 2026-09-15 21:11:55        WARN        MSTransformManager::parseTimeAvgParams        Operating with ALMA data, automatically adding state to timespan
15-Sep-2026 17:11:55 2026-09-15 21:11:55        WARN        MSTransformManager::parseTimeAvgParams+        In order to remove sub-scan boundaries which limit time average to 30s
15-Sep-2026 17:11:55 test_task_sdtimeaverage.py::test_sdtimeaverage::test_param53
15-Sep-2026 17:11:55 sdtimeaverage::53:: MS= 'data'    arg = 'data'   (NORMAL).
15-Sep-2026 17:11:55 _run_task::starts
15-Sep-2026 17:11:55 tearDown::deleting MSs.
15-Sep-2026 17:11:55 PASSED
15-Sep-2026 17:11:55
15-Sep-2026 17:11:55 2026-09-15 21:11:56        WARN        MSTransformManager::parseTimeAvgParams        Operating with ALMA data, automatically adding state to timespan
15-Sep-2026 17:11:55 2026-09-15 21:11:56        WARN        MSTransformManager::parseTimeAvgParams+        In order to remove sub-scan boundaries which limit time average to 30s
15-Sep-2026 17:11:56 test_task_sdtimeaverage.py::test_sdtimeaverage::test_param60ALMA
15-Sep-2026 17:11:56 sdtimeaverage::61:: ALMA:: 'scan, state' will be applied in mstransform.
15-Sep-2026 17:11:56 _run_task::starts
15-Sep-2026 17:11:56 -- checking Output Record Count --
15-Sep-2026 17:11:56 tearDown::deleting MSs.
15-Sep-2026 17:11:56 PASSED
15-Sep-2026 17:11:56
15-Sep-2026 17:11:56 test_task_sdtimeaverage.py::test_sdtimeaverage::test_param60Nobeyama
15-Sep-2026 17:11:56 sdtimeaverage::60 Nobeyama:: 'scan' will be applied in mstransform.
15-Sep-2026 17:11:56 _run_task::starts
15-Sep-2026 17:11:56 -- checking Output Record Count --
15-Sep-2026 17:11:56 tearDown::deleting MSs.
15-Sep-2026 17:11:56 PASSED
15-Sep-2026 17:11:56
15-Sep-2026 17:11:56 test_task_sdtimeaverage.py::test_sdtimeaverage::test_param70
15-Sep-2026 17:11:56 sdtimeaverage::70:: timespan='scan'.
15-Sep-2026 17:11:56 _run_task::starts
15-Sep-2026 17:11:56 -- checking Zero --
15-Sep-2026 17:11:56 -- checking Weight and Sigma --
15-Sep-2026 17:11:56 Weight Ref :1281.0
15-Sep-2026 17:11:56 Weight     :[1281.00012207 1281.00012207]
15-Sep-2026 17:11:56 Sigma      :[0.02793994 0.02793994]
15-Sep-2026 17:11:56 -- checking Weight and Sigma --
15-Sep-2026 17:11:56 Weight Ref :1281.0
15-Sep-2026 17:11:56 Weight     :[1281.00012207 1281.00012207]
15-Sep-2026 17:11:56 Sigma      :[0.02793994 0.02793994]
15-Sep-2026 17:11:56 -- checking Weight and Sigma --
15-Sep-2026 17:11:56 Weight Ref :1281.0
15-Sep-2026 17:11:56 Weight     :[1281.00012207 1281.00012207]
15-Sep-2026 17:11:56 Sigma      :[0.02793994 0.02793994]
15-Sep-2026 17:11:56 -- checking Output Record Count --
15-Sep-2026 17:11:56 tearDown::deleting MSs.
15-Sep-2026 17:11:56 PASSED
15-Sep-2026 17:11:56
15-Sep-2026 17:11:57 test_task_sdtimeaverage.py::test_sdtimeaverage::test_param71
15-Sep-2026 17:11:57 sdtimeaverage::71:: timespan='state'.
15-Sep-2026 17:11:57 _run_task::starts
15-Sep-2026 17:11:57 outfile =sdave-71-3843.ms specified.
15-Sep-2026 17:11:57 -- checking ZeroSum of data1 and data2.
15-Sep-2026 17:11:57 -- checking ZeroSum of data1 and data2.
15-Sep-2026 17:11:57 -- checking ZeroSum of data1 and data2.
15-Sep-2026 17:11:57 -- checking ZeroSum of data1 and data2.
15-Sep-2026 17:11:57 -- checking ZeroSum of data1 and data2.
15-Sep-2026 17:11:57 -- checking ZeroSum of data1 and data2.
15-Sep-2026 17:11:57 -- checking ZeroSum of data1 and data2.
15-Sep-2026 17:11:57 -- checking ZeroSum of data1 and data2.
15-Sep-2026 17:11:57 -- checking ZeroSum of data1 and data2.
15-Sep-2026 17:11:57 -- checking ZeroSum of data1 and data2.
15-Sep-2026 17:11:57 -- checking ZeroSum of data1 and data2.
15-Sep-2026 17:11:57 -- checking ZeroSum of data1 and data2.
15-Sep-2026 17:11:57 -- checking ZeroSum of data1 and data2.
15-Sep-2026 17:11:57 -- checking ZeroSum of data1 and data2.
15-Sep-2026 17:11:57 -- checking ZeroSum of data1 and data2.
15-Sep-2026 17:11:57 -- checking ZeroSum of data1 and data2.
15-Sep-2026 17:11:57 -- checking ZeroSum of data1 and data2.
15-Sep-2026 17:11:57 -- checking ZeroSum of data1 and data2.
15-Sep-2026 17:11:57 -- checking ZeroSum of data1 and data2.
15-Sep-2026 17:11:57 -- checking ZeroSum of data1 and data2.
15-Sep-2026 17:11:57 -- checking ZeroSum of data1 and data2.
15-Sep-2026 17:11:57 -- checking ZeroSum of data1 and data2.
15-Sep-2026 17:11:57 -- checking ZeroSum of data1 and data2.
15-Sep-2026 17:11:57 -- checking ZeroSum of data1 and data2.
15-Sep-2026 17:11:57 -- checking ZeroSum of data1 and data2.
15-Sep-2026 17:11:57 -- checking ZeroSum of data1 and data2.
15-Sep-2026 17:11:57 -- checking ZeroSum of data1 and data2.
15-Sep-2026 17:11:57 -- checking ZeroSum of data1 and data2.
15-Sep-2026 17:11:57 -- checking ZeroSum of data1 and data2.
15-Sep-2026 17:11:57 -- checking ZeroSum of data1 and data2.
15-Sep-2026 17:11:57 -- checking ZeroSum of data1 and data2.
15-Sep-2026 17:11:57 -- checking ZeroSum of data1 and data2.
15-Sep-2026 17:11:57 -- checking ZeroSum of data1 and data2.
15-Sep-2026 17:11:57 -- checking ZeroSum of data1 and data2.
15-Sep-2026 17:11:57 -- checking ZeroSum of data1 and data2.
15-Sep-2026 17:11:57 -- checking ZeroSum of data1 and data2.
15-Sep-2026 17:11:57 -- checking ZeroSum of data1 and data2.
15-Sep-2026 17:11:57 -- checking ZeroSum of data1 and data2.
15-Sep-2026 17:11:57 -- checking ZeroSum of data1 and data2.
15-Sep-2026 17:11:57 -- checking ZeroSum of data1 and data2.
15-Sep-2026 17:11:57 -- checking ZeroSum of data1 and data2.
15-Sep-2026 17:11:57 -- checking ZeroSum of data1 and data2.
15-Sep-2026 17:11:57 -- checking ZeroSum of data1 and data2.
15-Sep-2026 17:11:57 -- checking ZeroSum of data1 and data2.
15-Sep-2026 17:11:57 -- checking ZeroSum of data1 and data2.
15-Sep-2026 17:11:57 -- checking ZeroSum of data1 and data2.
15-Sep-2026 17:11:57 -- checking ZeroSum of data1 and data2.
15-Sep-2026 17:11:57 -- checking ZeroSum of data1 and data2.
15-Sep-2026 17:11:57 -- checking ZeroSum of data1 and data2.
15-Sep-2026 17:11:57 -- checking ZeroSum of data1 and data2.
15-Sep-2026 17:11:57 -- checking ZeroSum of data1 and data2.
15-Sep-2026 17:11:57 -- checking ZeroSum of data1 and data2.
15-Sep-2026 17:11:57 -- checking ZeroSum of data1 and data2.
15-Sep-2026 17:11:57 -- checking ZeroSum of data1 and data2.
15-Sep-2026 17:11:57 -- checking ZeroSum of data1 and data2.
15-Sep-2026 17:11:57 -- checking ZeroSum of data1 and data2.
15-Sep-2026 17:11:57 -- checking ZeroSum of data1 and data2.
15-Sep-2026 17:11:57 -- checking ZeroSum of data1 and data2.
15-Sep-2026 17:11:57 -- checking ZeroSum of data1 and data2.
15-Sep-2026 17:11:57 -- checking ZeroSum of data1 and data2.
15-Sep-2026 17:11:57 -- checking ZeroSum of data1 and data2.
15-Sep-2026 17:11:57 -- checking Output Record Count --
15-Sep-2026 17:11:57 tearDown::deleting MSs.
15-Sep-2026 17:11:57 PASSED
15-Sep-2026 17:11:57
15-Sep-2026 17:11:57 2026-09-15 21:11:58        WARN        sdtimeaverage::::casa        Explicitly both 'scan' and 'state' were specified in 'timespan'.
15-Sep-2026 17:11:57 2026-09-15 21:11:58        WARN        sdtimeaverage::::casa+           If 'state' distinguishes OBSERVE_TARGET#ON_SOURCE / OBSERVE_TARGET#OFF_SOURCE,
15-Sep-2026 17:11:57 2026-09-15 21:11:58        WARN        sdtimeaverage::::casa+           these two states are mixed, and unexpectedly averaged results might be generated.
15-Sep-2026 17:11:57 2026-09-15 21:11:58        WARN        sdtimeaverage::::casa+        (Suggestion) Please specify timespan = 'scan'
15-Sep-2026 17:11:57 2026-09-15 21:11:58        WARN        sdtimeaverage::::casa+                     to separate OBSERVE_TARGET#ON_SOURCE and OBSERVE_TARGET#OFF_SOURCE.
15-Sep-2026 17:11:58 test_task_sdtimeaverage.py::test_sdtimeaverage::test_param72
15-Sep-2026 17:11:58 sdtimeaverage::72:: timespan="scan,state" (WARN) in NRO.
15-Sep-2026 17:11:58 _run_task::starts
15-Sep-2026 17:11:58 -- checking Zero --
15-Sep-2026 17:11:58 -- checking Time --
15-Sep-2026 17:11:58 -- checking Weight and Sigma --
15-Sep-2026 17:11:58 Weight Ref :3843
15-Sep-2026 17:11:58 Weight     :[3842.99975586 3842.99975586]
15-Sep-2026 17:11:58 Sigma      :[0.01613113 0.01613113]
15-Sep-2026 17:11:58 -- checking Output Record Count --
15-Sep-2026 17:11:58 tearDown::deleting MSs.
15-Sep-2026 17:11:58 PASSED
15-Sep-2026 17:11:58
15-Sep-2026 17:11:58 2026-09-15 21:11:58        WARN        sdtimeaverage::::casa        Explicitly both 'scan' and 'state' were specified in 'timespan'.
15-Sep-2026 17:11:58 2026-09-15 21:11:58        WARN        sdtimeaverage::::casa+           If 'state' distinguishes OBSERVE_TARGET#ON_SOURCE / OBSERVE_TARGET#OFF_SOURCE,
15-Sep-2026 17:11:58 2026-09-15 21:11:58        WARN        sdtimeaverage::::casa+           these two states are mixed, and unexpectedly averaged results might be generated.
15-Sep-2026 17:11:58 2026-09-15 21:11:58        WARN        sdtimeaverage::::casa+        (Suggestion) Please specify timespan = 'scan'
15-Sep-2026 17:11:58 2026-09-15 21:11:58        WARN        sdtimeaverage::::casa+                     to separate OBSERVE_TARGET#ON_SOURCE and OBSERVE_TARGET#OFF_SOURCE.
15-Sep-2026 17:11:58 test_task_sdtimeaverage.py::test_sdtimeaverage::test_param73
15-Sep-2026 17:11:58 sdtimeaverage::73:: timespan="state,scan" (WARN) in NRO.
15-Sep-2026 17:11:58 _run_task::starts
15-Sep-2026 17:11:58 -- checking Zero --
15-Sep-2026 17:11:58 -- checking Time --
15-Sep-2026 17:11:58 -- checking Weight and Sigma --
15-Sep-2026 17:11:58 Weight Ref :3843
15-Sep-2026 17:11:58 Weight     :[3842.99975586 3842.99975586]
15-Sep-2026 17:11:58 Sigma      :[0.01613113 0.01613113]
15-Sep-2026 17:11:58 -- checking Output Record Count --
15-Sep-2026 17:11:58 tearDown::deleting MSs.
15-Sep-2026 17:11:58 PASSED
15-Sep-2026 17:11:58
15-Sep-2026 17:11:59 test_task_sdtimeaverage.py::test_sdtimeaverage::test_param74E
15-Sep-2026 17:11:59 sdtimeaverage::74E:: timespan='hoge'.
15-Sep-2026 17:11:59 _run_task::starts
15-Sep-2026 17:11:59 tearDown::deleting MSs.
15-Sep-2026 17:11:59 PASSED
15-Sep-2026 17:11:59
15-Sep-2026 17:11:59 test_task_sdtimeaverage.py::test_sdtimeaverage::test_param75
15-Sep-2026 17:11:59 sdtimeaverage::75:: timespan=''.
15-Sep-2026 17:11:59 _run_task::starts
15-Sep-2026 17:11:59 numOfScan =61, numOfState=3
15-Sep-2026 17:11:59 -- checking Output Record Count --
15-Sep-2026 17:11:59 tearDown::deleting MSs.
15-Sep-2026 17:11:59 PASSEDtearDownClass::deleting work-MS.
15-Sep-2026 17:11:59
15-Sep-2026 17:11:59
15-Sep-2026 17:11:59 - generated xml file: /Users/casaci/bamboohome/xml-data/build-dir/CASASPECS-PR223-TTA14/casa6/casatestutils/nosedir/xml/test_task_sdtimeaverage/nose.xml -
15-Sep-2026 17:11:59 ======================== 41 passed, 1 warning in 18.28s ========================
15-Sep-2026 17:12:00 ============================= test session starts ==============================
15-Sep-2026 17:12:00 platform darwin -- Python 3.12.8, pytest-9.1.1, pluggy-1.6.0 -- /Users/casaci/bamboohome/xml-data/build-dir/CASASPECS-PR223-TTA14/casa6testenv/bin/python3.12
15-Sep-2026 17:12:00 cachedir: .pytest_cache
15-Sep-2026 17:12:00 rootdir: /Users/casaci/bamboohome/xml-data/build-dir/CASASPECS-PR223-TTA14/casa6/casatestutils/nosedir/test_task_importasap
15-Sep-2026 17:12:00 configfile: pytest.ini
15-Sep-2026 17:12:02 collecting ... collected 5 items
15-Sep-2026 17:12:02
15-Sep-2026 17:12:02
15-Sep-2026 17:12:02 test_task_importasap.py::importasap_test::test_flagversions
15-Sep-2026 17:12:02 test_flagversions -- Check if existing flagversions file is overwritten.
15-Sep-2026 17:12:02 PASSED
15-Sep-2026 17:12:02
15-Sep-2026 17:12:02 2026-09-15 21:12:03        SEVERE        importasap::::casa        Traceback (most recent call last):
15-Sep-2026 17:12:02 2026-09-15 21:12:03        SEVERE        importasap::::casa+                     ^^^^^^^^^^^^^^^^^^^^^
15-Sep-2026 17:12:02 2026-09-15 21:12:03        SEVERE        importasap::::casa+          File "/Users/casaci/bamboohome/xml-data/build-dir/CASASPECS-PR223-TTA14/casa6testenv/lib/python3.12/site-packages/casatasks/private/task_importasap.py", line 36, in importasap
15-Sep-2026 17:12:02 2026-09-15 21:12:03        SEVERE        importasap::::casa+            raise RuntimeError('%s is not a valid Scantable.' % (infile))
15-Sep-2026 17:12:02 2026-09-15 21:12:03        SEVERE        importasap::::casa+        RuntimeError: uid___A002_X85c183_X36f.test.asap is not a valid Scantable.
15-Sep-2026 17:12:02 2026-09-15 21:12:03        SEVERE        importasap::::casa        uid___A002_X85c183_X36f.test.asap is not a valid Scantable.
15-Sep-2026 17:12:02 2026-09-15 21:12:03        SEVERE        importasap::::casa        Task importasap raised an exception of class RuntimeError with the following message: uid___A002_X85c183_X36f.test.asap is not a valid Scantable.
15-Sep-2026 17:12:02 test_task_importasap.py::importasap_test::test_invaliddata
15-Sep-2026 17:12:02 test_invaliddata: Invalid data check.
15-Sep-2026 17:12:02 PASSED
15-Sep-2026 17:12:02
15-Sep-2026 17:12:02 test_task_importasap.py::importasap_test::test_noflagversions
15-Sep-2026 17:12:02 test_noflagversions -- Do not create flagversions file.
15-Sep-2026 17:12:02 PASSED
15-Sep-2026 17:12:02
15-Sep-2026 17:12:03 test_task_importasap.py::importasap_test::test_normal
15-Sep-2026 17:12:03 test_normal: Normal data import.
15-Sep-2026 17:12:03 Pressure unit is hPa
15-Sep-2026 17:12:03 PASSED
15-Sep-2026 17:12:03
15-Sep-2026 17:12:03 2026-09-15 21:12:03        SEVERE        importasap::::casa        Traceback (most recent call last):
15-Sep-2026 17:12:03 2026-09-15 21:12:03        SEVERE        importasap::::casa+                     ^^^^^^^^^^^^^^^^^^^^^
15-Sep-2026 17:12:03 2026-09-15 21:12:03        SEVERE        importasap::::casa+          File "/Users/casaci/bamboohome/xml-data/build-dir/CASASPECS-PR223-TTA14/casa6testenv/lib/python3.12/site-packages/casatasks/private/task_importasap.py", line 33, in importasap
15-Sep-2026 17:12:03 2026-09-15 21:12:03        SEVERE        importasap::::casa+            raise RuntimeError('%s exists.' % (outputvis))
15-Sep-2026 17:12:03 2026-09-15 21:12:03        SEVERE        importasap::::casa+        RuntimeError: importasap_test.ms exists.
15-Sep-2026 17:12:03 2026-09-15 21:12:03        SEVERE        importasap::::casa        importasap_test.ms exists.
15-Sep-2026 17:12:03 2026-09-15 21:12:03        SEVERE        importasap::::casa        Task importasap raised an exception of class RuntimeError with the following message: importasap_test.ms exists.
15-Sep-2026 17:12:03 test_task_importasap.py::importasap_test::test_overwrite
15-Sep-2026 17:12:03 test_overwrite: File existence check.
15-Sep-2026 17:12:03 PASSED
15-Sep-2026 17:12:03
15-Sep-2026 17:12:03 - generated xml file: /Users/casaci/bamboohome/xml-data/build-dir/CASASPECS-PR223-TTA14/casa6/casatestutils/nosedir/xml/test_task_importasap/nose.xml -
15-Sep-2026 17:12:03 ========================= 5 passed, 1 warning in 2.96s =========================
15-Sep-2026 17:12:03 ============================= test session starts ==============================
15-Sep-2026 17:12:03 platform darwin -- Python 3.12.8, pytest-9.1.1, pluggy-1.6.0 -- /Users/casaci/bamboohome/xml-data/build-dir/CASASPECS-PR223-TTA14/casa6testenv/bin/python3.12
15-Sep-2026 17:12:03 cachedir: .pytest_cache
15-Sep-2026 17:12:03 rootdir: /Users/casaci/bamboohome/xml-data/build-dir/CASASPECS-PR223-TTA14/casa6/casatestutils/nosedir/test_task_imval
15-Sep-2026 17:12:03 configfile: pytest.ini
15-Sep-2026 17:12:05 collecting ... collected 31 items
15-Sep-2026 17:12:05
15-Sep-2026 17:12:05
15-Sep-2026 17:12:05 2026-09-15 21:12:06        SEVERE        imval::CasacRegionManager::_setPolarizationRanges        (Sub)String 0 in stokes specification part 0 does not match a known polarization.
15-Sep-2026 17:12:05 2026-09-15 21:12:06        SEVERE        imval::regionmanager::frombcs        Exception Reported: 2026-09-15 21:12:06        SEVERE        imval::CasacRegionManager::_setPolarizationRanges        (Sub)String 0 in stokes specification part 0 does not match a known polarization.
15-Sep-2026 17:12:05 2026-09-15 21:12:06        SEVERE        imval::::casa        Task imval raised an exception of class RuntimeError with the following message: 2026-09-15 21:12:06        SEVERE        imval::CasacRegionManager::_setPolarizationRanges        (Sub)String 0 in stokes specification part 0 does not match a known polarization.
15-Sep-2026 17:12:05 test_task_imval.py::imval_test::test_array
15-Sep-2026 17:12:05 Imval: array values
15-Sep-2026 17:12:05 Starting ARRAY RESULTS tests.
15-Sep-2026 17:12:05 PASSED
15-Sep-2026 17:12:05
15-Sep-2026 17:12:05 test_task_imval.py::imval_test::test_coord_return
15-Sep-2026 17:12:05 Test returned coordinates CAS-2651
15-Sep-2026 17:12:05 PASSED
15-Sep-2026 17:12:05
15-Sep-2026 17:12:05 test_task_imval.py::imval_test::test_inputBox
15-Sep-2026 17:12:05 Test with valid box inputs
15-Sep-2026 17:12:05 Starting imval INPUT/OUTPUT tests.
15-Sep-2026 17:12:05 Performing input/output tests on imagename, errors WILL occur.
15-Sep-2026 17:12:05 Performing input/output tests on "chans", errors WILL occur.
15-Sep-2026 17:12:05 PASSED
15-Sep-2026 17:12:05
15-Sep-2026 17:12:05 2026-09-15 21:12:06        SEVERE        imval::CasacRegionManager::_fromBCS        trc in box spec is greater than or equal to number of direction coordinate pixels in the image
15-Sep-2026 17:12:05 2026-09-15 21:12:06        SEVERE        imval::regionmanager::frombcs        Exception Reported: 2026-09-15 21:12:06        SEVERE        imval::CasacRegionManager::_fromBCS        trc in box spec is greater than or equal to number of direction coordinate pixels in the image
15-Sep-2026 17:12:05 2026-09-15 21:12:06        SEVERE        imval::::casa        Task imval raised an exception of class RuntimeError with the following message: 2026-09-15 21:12:06        SEVERE        imval::CasacRegionManager::_fromBCS        trc in box spec is greater than or equal to number of direction coordinate pixels in the image
15-Sep-2026 17:12:05 test_task_imval.py::imval_test::test_inputBoxLargeRangeX
15-Sep-2026 17:12:05 Test with large values for x in the box
15-Sep-2026 17:12:05 Starting imval INPUT/OUTPUT tests.
15-Sep-2026 17:12:05 Performing input/output tests on imagename, errors WILL occur.
15-Sep-2026 17:12:05 PASSED
15-Sep-2026 17:12:05
15-Sep-2026 17:12:05 2026-09-15 21:12:06        SEVERE        imval::regionmanager::frombcs        Exception Reported: LCBox::LCBox - blc [0, 110, 0, 0] must be <= trc [0, 10, 0, 29]
15-Sep-2026 17:12:05 2026-09-15 21:12:06        SEVERE        imval::::casa        Task imval raised an exception of class RuntimeError with the following message: LCBox::LCBox - blc [0, 110, 0, 0] must be <= trc [0, 10, 0, 29]
15-Sep-2026 17:12:05 test_task_imval.py::imval_test::test_inputBoxLargeY0
15-Sep-2026 17:12:05 Test when the first y value in the box is larger
15-Sep-2026 17:12:05 Starting imval INPUT/OUTPUT tests.
15-Sep-2026 17:12:05 Performing input/output tests on imagename, errors WILL occur.
15-Sep-2026 17:12:05 PASSED
15-Sep-2026 17:12:05
15-Sep-2026 17:12:05 2026-09-15 21:12:06        SEVERE        imval::CasacRegionManager::_fromBCS        blc in box spec is less than 0
15-Sep-2026 17:12:05 2026-09-15 21:12:06        SEVERE        imval::regionmanager::frombcs        Exception Reported: 2026-09-15 21:12:06        SEVERE        imval::CasacRegionManager::_fromBCS        blc in box spec is less than 0
15-Sep-2026 17:12:05 2026-09-15 21:12:06        SEVERE        imval::::casa        Task imval raised an exception of class RuntimeError with the following message: 2026-09-15 21:12:06        SEVERE        imval::CasacRegionManager::_fromBCS        blc in box spec is less than 0
15-Sep-2026 17:12:05 test_task_imval.py::imval_test::test_inputBoxNegativeX
15-Sep-2026 17:12:05 Test when negative x value is given in the box parameter
15-Sep-2026 17:12:05 Starting imval INPUT/OUTPUT tests.
15-Sep-2026 17:12:05 Performing input/output tests on imagename, errors WILL occur.
15-Sep-2026 17:12:05 PASSED
15-Sep-2026 17:12:05
15-Sep-2026 17:12:05 2026-09-15 21:12:06        SEVERE        imval::CasacRegionManager::_fromBCS        blc in box spec is less than 0
15-Sep-2026 17:12:05 2026-09-15 21:12:06        SEVERE        imval::regionmanager::frombcs        Exception Reported: 2026-09-15 21:12:06        SEVERE        imval::CasacRegionManager::_fromBCS        blc in box spec is less than 0
15-Sep-2026 17:12:05 2026-09-15 21:12:06        SEVERE        imval::::casa        Task imval raised an exception of class RuntimeError with the following message: 2026-09-15 21:12:06        SEVERE        imval::CasacRegionManager::_fromBCS        blc in box spec is less than 0
15-Sep-2026 17:12:05 test_task_imval.py::imval_test::test_inputBoxNegativeY
15-Sep-2026 17:12:05 Test when negative y value is given in the box parameter
15-Sep-2026 17:12:05 Starting imval INPUT/OUTPUT tests.
15-Sep-2026 17:12:05 Performing input/output tests on imagename, errors WILL occur.
15-Sep-2026 17:12:05 PASSED
15-Sep-2026 17:12:05
15-Sep-2026 17:12:05 test_task_imval.py::imval_test::test_inputChans10
15-Sep-2026 17:12:05 Test valid channel input
15-Sep-2026 17:12:05 Starting imval INPUT/OUTPUT tests.
15-Sep-2026 17:12:05 Performing input/output tests on imagename, errors WILL occur.
15-Sep-2026 17:12:05 Performing input/output tests on "stokes", errors WILL occur.
15-Sep-2026 17:12:05 PASSED
15-Sep-2026 17:12:05
15-Sep-2026 17:12:05 2026-09-15 21:12:06        SEVERE        imval::regionmanager::frombcs        Exception Reported: Exception: Zero-based max channel 50 must be less than the total number of channels (30) in the channel specification 50.
15-Sep-2026 17:12:05 2026-09-15 21:12:06        SEVERE        imval::regionmanager::frombcs+        ... thrown by static std::vector<uInt> casa::ParameterParser::spectralRangesFromChans(uInt &, const String &, const uInt) at File: /Users/casaci/bamboohome/xml-data/build-dir/CASASPECS-PR223-BPMACOS15PY312/casa6/casatools/src/code/imageanalysis/IO/ParameterParser.cc, line: 188
15-Sep-2026 17:12:05 2026-09-15 21:12:06        SEVERE        imval::::casa        Task imval raised an exception of class RuntimeError with the following message: Exception: Zero-based max channel 50 must be less than the total number of channels (30) in the channel specification 50.
15-Sep-2026 17:12:05 2026-09-15 21:12:06        SEVERE        imval::::casa+        ... thrown by static std::vector<uInt> casa::ParameterParser::spectralRangesFromChans(uInt &, const String &, const uInt) at File: /Users/casaci/bamboohome/xml-data/build-dir/CASASPECS-PR223-BPMACOS15PY312/casa6/casatools/src/code/imageanalysis/IO/ParameterParser.cc, line: 188
15-Sep-2026 17:12:05 test_task_imval.py::imval_test::test_inputChans50
15-Sep-2026 17:12:05 Test out of range channel value
15-Sep-2026 17:12:05 Starting imval INPUT/OUTPUT tests.
15-Sep-2026 17:12:05 Performing input/output tests on imagename, errors WILL occur.
15-Sep-2026 17:12:05 PASSED
15-Sep-2026 17:12:05
15-Sep-2026 17:12:05 test_task_imval.py::imval_test::test_inputFloatVal
15-Sep-2026 17:12:05 Test when a float/invalid file is given as the input
15-Sep-2026 17:12:05 Starting imval INPUT/OUTPUT tests.
15-Sep-2026 17:12:05 Performing input/output tests on imagename, errors WILL occur.
15-Sep-2026 17:12:05 PASSED
15-Sep-2026 17:12:05
15-Sep-2026 17:12:05 2026-09-15 21:12:06        WARN        imval::::casa        Complex region found, only processing the first SIMPLE region found
15-Sep-2026 17:12:05 test_task_imval.py::imval_test::test_inputGoodRegionFile
15-Sep-2026 17:12:05 Test region seleciton with good region file
15-Sep-2026 17:12:05 Starting imval INPUT/OUTPUT tests.
15-Sep-2026 17:12:05 Performing input/output tests on imagename, errors WILL occur.
15-Sep-2026 17:12:05 PASSED
15-Sep-2026 17:12:05
15-Sep-2026 17:12:05 2026-09-15 21:12:06        SEVERE        imval::CasacRegionManager::_fromBCS        trc in box spec is greater than or equal to number of direction coordinate pixels in the image
15-Sep-2026 17:12:05 2026-09-15 21:12:06        SEVERE        imval::regionmanager::frombcs        Exception Reported: 2026-09-15 21:12:06        SEVERE        imval::CasacRegionManager::_fromBCS        trc in box spec is greater than or equal to number of direction coordinate pixels in the image
15-Sep-2026 17:12:05 2026-09-15 21:12:06        SEVERE        imval::::casa        Task imval raised an exception of class RuntimeError with the following message: 2026-09-15 21:12:06        SEVERE        imval::CasacRegionManager::_fromBCS        trc in box spec is greater than or equal to number of direction coordinate pixels in the image
15-Sep-2026 17:12:05 test_task_imval.py::imval_test::test_inputLargeRangeY
15-Sep-2026 17:12:05 Test with large values of y in the box
15-Sep-2026 17:12:05 Starting imval INPUT/OUTPUT tests.
15-Sep-2026 17:12:05 Performing input/output tests on imagename, errors WILL occur.
15-Sep-2026 17:12:05 PASSED
15-Sep-2026 17:12:05
15-Sep-2026 17:12:06 2026-09-15 21:12:06        SEVERE        imval::regionmanager::frombcs        Exception Reported: garbage.rgn is neither a valid binary region file, nor a valid region text file. at File: /Users/casaci/bamboohome/xml-data/build-dir/CASASPECS-PR223-BPMACOS15PY312/casa6/casatools/src/code/imageanalysis/Regions/CasacRegionManager.cc, line: 431
15-Sep-2026 17:12:06 2026-09-15 21:12:06        SEVERE        imval::::casa        Task imval raised an exception of class RuntimeError with the following message: garbage.rgn is neither a valid binary region file, nor a valid region text file. at File: /Users/casaci/bamboohome/xml-data/build-dir/CASASPECS-PR223-BPMACOS15PY312/casa6/casatools/src/code/imageanalysis/Regions/CasacRegionManager.cc, line: 431
15-Sep-2026 17:12:06 test_task_imval.py::imval_test::test_inputModifiedRegionFile
15-Sep-2026 17:12:06 Test with modified bad region file
15-Sep-2026 17:12:06 Starting imval INPUT/OUTPUT tests.
15-Sep-2026 17:12:06 Performing input/output tests on imagename, errors WILL occur.
15-Sep-2026 17:12:06 PASSED
15-Sep-2026 17:12:06
15-Sep-2026 17:12:06 2026-09-15 21:12:06        SEVERE        imval::regionmanager::frombcs        Exception Reported: Invalid channel specification in -3 of spec -3 at File: /Users/casaci/bamboohome/xml-data/build-dir/CASASPECS-PR223-BPMACOS15PY312/casa6/casatools/src/code/imageanalysis/IO/ParameterParser.cc, line: 176
15-Sep-2026 17:12:06 2026-09-15 21:12:06        SEVERE        imval::::casa        Task imval raised an exception of class RuntimeError with the following message: Invalid channel specification in -3 of spec -3 at File: /Users/casaci/bamboohome/xml-data/build-dir/CASASPECS-PR223-BPMACOS15PY312/casa6/casatools/src/code/imageanalysis/IO/ParameterParser.cc, line: 176
15-Sep-2026 17:12:06 test_task_imval.py::imval_test::test_inputNegativeChans
15-Sep-2026 17:12:06 Test when the given channels are negative
15-Sep-2026 17:12:06 Starting imval INPUT/OUTPUT tests.
15-Sep-2026 17:12:06 Performing input/output tests on imagename, errors WILL occur.
15-Sep-2026 17:12:06 PASSED
15-Sep-2026 17:12:06
15-Sep-2026 17:12:06 test_task_imval.py::imval_test::test_inputNoInputImage
15-Sep-2026 17:12:06 Test when no image is provided
15-Sep-2026 17:12:06 Starting imval INPUT/OUTPUT tests.
15-Sep-2026 17:12:06 Performing input/output tests on imagename, errors WILL occur.
15-Sep-2026 17:12:06 PASSED
15-Sep-2026 17:12:06
15-Sep-2026 17:12:06 2026-09-15 21:12:06        SEVERE        imval::image::open (file /private/var/folders/60/83wxljbx2vlfbx_hy0yfv8rc0000gn/T/build-via-sdist-i5v79vie/casatools-6.7.7.8+dirty/src/tools/image/image_cmpt.cc, line 4208)        Exception Reported: Exception: Unable to open image n4826_bima_test.rgn.
15-Sep-2026 17:12:06 2026-09-15 21:12:06        SEVERE        imval::image::open (file /private/var/folders/60/83wxljbx2vlfbx_hy0yfv8rc0000gn/T/build-via-sdist-i5v79vie/casatools-6.7.7.8+dirty/src/tools/image/image_cmpt.cc, line 4208)+        ... thrown by static ITUPLE casa::ImageFactory::fromFile(const String &, Bool) at File: /Users/casaci/bamboohome/xml-data/build-dir/CASASPECS-PR223-BPMACOS15PY312/casa6/casatools/src/code/imageanalysis/ImageAnalysis/ImageFactory2.cc, line: 289
15-Sep-2026 17:12:06 2026-09-15 21:12:06        SEVERE        imval::::casa        Task imval raised an exception of class RuntimeError with the following message: Unable to determine the axes of image: n4826_bima_test.rgn
15-Sep-2026 17:12:06 test_task_imval.py::imval_test::test_inputRealInputImage
15-Sep-2026 17:12:06 Test when .rgn file is used as input instead of Image
15-Sep-2026 17:12:06 Starting imval INPUT/OUTPUT tests.
15-Sep-2026 17:12:06 Performing input/output tests on imagename, errors WILL occur.
15-Sep-2026 17:12:06 PASSED
15-Sep-2026 17:12:06
15-Sep-2026 17:12:06 2026-09-15 21:12:06        SEVERE        imval::::casa        Task imval raised an exception of class AttributeError with the following message: 'list' object has no attribute 'replace'
15-Sep-2026 17:12:06 test_task_imval.py::imval_test::test_inputRegion
15-Sep-2026 17:12:06 Test when given region array
15-Sep-2026 17:12:06 Starting imval INPUT/OUTPUT tests.
15-Sep-2026 17:12:06 Performing input/output tests on imagename, errors WILL occur.
15-Sep-2026 17:12:06 PASSED
15-Sep-2026 17:12:06
15-Sep-2026 17:12:06 2026-09-15 21:12:06        SEVERE        imval::regionmanager::frombcs        Exception Reported: Unable to open region file or region table description garbage.rgn.
15-Sep-2026 17:12:06 2026-09-15 21:12:06        SEVERE        imval::regionmanager::frombcs+        If it is supposed to be a text string its format is incorrect at File: /Users/casaci/bamboohome/xml-data/build-dir/CASASPECS-PR223-BPMACOS15PY312/casa6/casatools/src/code/imageanalysis/Regions/CasacRegionManager.cc, line: 497
15-Sep-2026 17:12:06 2026-09-15 21:12:06        SEVERE        imval::::casa        Task imval raised an exception of class RuntimeError with the following message: Unable to open region file or region table description garbage.rgn.
15-Sep-2026 17:12:06 2026-09-15 21:12:06        SEVERE        imval::::casa+        If it is supposed to be a text string its format is incorrect at File: /Users/casaci/bamboohome/xml-data/build-dir/CASASPECS-PR223-BPMACOS15PY312/casa6/casatools/src/code/imageanalysis/Regions/CasacRegionManager.cc, line: 497
15-Sep-2026 17:12:06 test_task_imval.py::imval_test::test_inputRegionFile
15-Sep-2026 17:12:06 Test when given a bad region file
15-Sep-2026 17:12:06 Starting imval INPUT/OUTPUT tests.
15-Sep-2026 17:12:06 Performing input/output tests on imagename, errors WILL occur.
15-Sep-2026 17:12:06 PASSED
15-Sep-2026 17:12:06
15-Sep-2026 17:12:06 test_task_imval.py::imval_test::test_inputStokes0
15-Sep-2026 17:12:06 Test with 0 given as stokes value
15-Sep-2026 17:12:06 Starting imval INPUT/OUTPUT tests.
15-Sep-2026 17:12:06 Performing input/output tests on imagename, errors WILL occur.
15-Sep-2026 17:12:06 PASSED
15-Sep-2026 17:12:06
15-Sep-2026 17:12:06 test_task_imval.py::imval_test::test_inputStokesI
15-Sep-2026 17:12:06 Test with valid stokes input I
15-Sep-2026 17:12:06 Starting imval INPUT/OUTPUT tests.
15-Sep-2026 17:12:06 Performing input/output tests on imagename, errors WILL occur.
15-Sep-2026 17:12:06 Performing input/output tests on "region", errors WILL occur.
15-Sep-2026 17:12:06 PASSED
15-Sep-2026 17:12:06
15-Sep-2026 17:12:06 2026-09-15 21:12:06        SEVERE        imval::regionmanager::frombcs        Exception Reported: LCBox::LCBox - blc [128, 128, 2147483647, 0] must be <= trc [128, 128, 0, 29]
15-Sep-2026 17:12:06 2026-09-15 21:12:06        SEVERE        imval::::casa        Task imval raised an exception of class RuntimeError with the following message: LCBox::LCBox - blc [128, 128, 2147483647, 0] must be <= trc [128, 128, 0, 29]
15-Sep-2026 17:12:06 test_task_imval.py::imval_test::test_inputStokesQ
15-Sep-2026 17:12:06 Test with stokes Q
15-Sep-2026 17:12:06 Starting imval INPUT/OUTPUT tests.
15-Sep-2026 17:12:06 Performing input/output tests on imagename, errors WILL occur.
15-Sep-2026 17:12:06 PASSED
15-Sep-2026 17:12:06
15-Sep-2026 17:12:06 test_task_imval.py::imval_test::test_inputn4826_bima
15-Sep-2026 17:12:06 Test with real image file n4826_bima
15-Sep-2026 17:12:06 Starting imval INPUT/OUTPUT tests.
15-Sep-2026 17:12:06 Performing input/output tests on imagename, errors WILL occur.
15-Sep-2026 17:12:06 Performing input/output tests on "box", errors WILL occur.
15-Sep-2026 17:12:06 PASSED
15-Sep-2026 17:12:06
15-Sep-2026 17:12:06 2026-09-15 21:12:06        WARN        imval::CasacRegionManager::fromBCS        Stokes cannot be determined because this region type is not handled yet. But chances are very good this is no need to be alarmed.
15-Sep-2026 17:12:06 2026-09-15 21:12:06        WARN        imval::::        Stokes cannot be determined because this region type is not handled yet. But chances are very good this is no need to be alarmed.
15-Sep-2026 17:12:06 2026-09-15 21:12:06        WARN        imval::::        Stokes cannot be determined because this region type is not handled yet. But chances are very good this is no need to be alarmed.
15-Sep-2026 17:12:06 test_task_imval.py::imval_test::test_non_rect_region
15-Sep-2026 17:12:06 verify imval works on non-rectangular regions, CAS-5734
15-Sep-2026 17:12:06 PASSED
15-Sep-2026 17:12:06
15-Sep-2026 17:12:06 test_task_imval.py::imval_test::test_pv
15-Sep-2026 17:12:06 Test fix so imval works with pv images, CAS-7573
15-Sep-2026 17:12:06 PASSED
15-Sep-2026 17:12:06
15-Sep-2026 17:12:06 test_task_imval.py::imval_test::test_singlePointBottomLeft
15-Sep-2026 17:12:06 Test box selection at bottom left
15-Sep-2026 17:12:06 PASSED
15-Sep-2026 17:12:06
15-Sep-2026 17:12:06 test_task_imval.py::imval_test::test_singlePointBottomRight
15-Sep-2026 17:12:06 Test box seleciton at bottom right
15-Sep-2026 17:12:06 PASSED
15-Sep-2026 17:12:06
15-Sep-2026 17:12:06 test_task_imval.py::imval_test::test_singlePointLastChanStokes
15-Sep-2026 17:12:06 Test box seleciton with max stokes and chans
15-Sep-2026 17:12:06 PASSED
15-Sep-2026 17:12:06
15-Sep-2026 17:12:06 test_task_imval.py::imval_test::test_singlePointRandom
15-Sep-2026 17:12:06 Test selection a single random point
15-Sep-2026 17:12:06 PASSED
15-Sep-2026 17:12:06
15-Sep-2026 17:12:06 test_task_imval.py::imval_test::test_singlePointSecondRandom
15-Sep-2026 17:12:06 Test selecting another single random point
15-Sep-2026 17:12:06 PASSED
15-Sep-2026 17:12:06
15-Sep-2026 17:12:06 test_task_imval.py::imval_test::test_singlePointTopLeft
15-Sep-2026 17:12:06 Test box selection at top left
15-Sep-2026 17:12:06 PASSED
15-Sep-2026 17:12:06
15-Sep-2026 17:12:06 test_task_imval.py::imval_test::test_singlePointTopRight
15-Sep-2026 17:12:06 Test box selection at top right
15-Sep-2026 17:12:06 PASSED
15-Sep-2026 17:12:06
15-Sep-2026 17:12:06 - generated xml file: /Users/casaci/bamboohome/xml-data/build-dir/CASASPECS-PR223-TTA14/casa6/casatestutils/nosedir/xml/test_task_imval/nose.xml -
15-Sep-2026 17:12:06 ======================== 31 passed, 2 warnings in 3.03s ========================
15-Sep-2026 17:12:06 ============================= test session starts ==============================
15-Sep-2026 17:12:06 platform darwin -- Python 3.12.8, pytest-9.1.1, pluggy-1.6.0 -- /Users/casaci/bamboohome/xml-data/build-dir/CASASPECS-PR223-TTA14/casa6testenv/bin/python3.12
15-Sep-2026 17:12:06 cachedir: .pytest_cache
15-Sep-2026 17:12:06 rootdir: /Users/casaci/bamboohome/xml-data/build-dir/CASASPECS-PR223-TTA14/casa6/casatestutils/nosedir/test_task_defintent
15-Sep-2026 17:12:06 configfile: pytest.ini
15-Sep-2026 17:12:09 collecting ... collected 7 items
15-Sep-2026 17:12:09
15-Sep-2026 17:12:09
15-Sep-2026 17:12:09 test_task_defintent.py::Defintent_tests::test_mode_append
15-Sep-2026 17:12:09 A new intent should be added that appends to the previous intent 
15-Sep-2026 17:12:09 Number of matching rows found:  328860
15-Sep-2026 17:12:09 PASSED
15-Sep-2026 17:12:09
15-Sep-2026 17:12:09 test_task_defintent.py::Defintent_tests::test_mode_set
15-Sep-2026 17:12:09 A new intent is added and replaces the old intent 
15-Sep-2026 17:12:09 Number of matching rows found:  328860
15-Sep-2026 17:12:09 PASSED
15-Sep-2026 17:12:09
15-Sep-2026 17:12:09 test_task_defintent.py::Defintent_tests::test_multi_append
15-Sep-2026 17:12:09 Test that multiple consecutive appends still change the data. bug noticed in CAS-14566
15-Sep-2026 17:12:09 Number of matching rows found:  172260
15-Sep-2026 17:12:09 Number of matching rows found:  156600
15-Sep-2026 17:12:09 Intent already exists
15-Sep-2026 17:12:09 PASSED
15-Sep-2026 17:12:09
15-Sep-2026 17:12:10 test_task_defintent.py::Defintent_tests::test_select_field
15-Sep-2026 17:12:10 A selection of intents to replace can be made with field 
15-Sep-2026 17:12:10 Number of matching rows found:  172260
15-Sep-2026 17:12:10 PASSED
15-Sep-2026 17:12:10
15-Sep-2026 17:12:10 test_task_defintent.py::Defintent_tests::test_select_obsid
15-Sep-2026 17:12:10 A selection of intents to replace can be made with obsid 
15-Sep-2026 17:12:10 Number of matching rows found:  328860
15-Sep-2026 17:12:10 PASSED
15-Sep-2026 17:12:10
15-Sep-2026 17:12:10 test_task_defintent.py::Defintent_tests::test_select_scan
15-Sep-2026 17:12:10 A selection of intents to replace can be made with scan 
15-Sep-2026 17:12:10 Number of matching rows found:  31320
15-Sep-2026 17:12:10 PASSED
15-Sep-2026 17:12:10
15-Sep-2026 17:12:10 test_task_defintent.py::Defintent_tests::test_set_existing
15-Sep-2026 17:12:10 Test that state id is changed when setting to an existing intent 
15-Sep-2026 17:12:10 Number of matching rows found:  328860
15-Sep-2026 17:12:10 Number of matching rows found:  328860
15-Sep-2026 17:12:10 Intent already exists
15-Sep-2026 17:12:10 PASSED
15-Sep-2026 17:12:10
15-Sep-2026 17:12:10 - generated xml file: /Users/casaci/bamboohome/xml-data/build-dir/CASASPECS-PR223-TTA14/casa6/casatestutils/nosedir/xml/test_task_defintent/nose.xml -
15-Sep-2026 17:12:10 ========================= 7 passed, 1 warning in 4.36s =========================
15-Sep-2026 17:12:11 ============================= test session starts ==============================
15-Sep-2026 17:12:11 platform darwin -- Python 3.12.8, pytest-9.1.1, pluggy-1.6.0 -- /Users/casaci/bamboohome/xml-data/build-dir/CASASPECS-PR223-TTA14/casa6testenv/bin/python3.12
15-Sep-2026 17:12:11 cachedir: .pytest_cache
15-Sep-2026 17:12:11 rootdir: /Users/casaci/bamboohome/xml-data/build-dir/CASASPECS-PR223-TTA14/casa6/casatestutils/nosedir/test_task_immath
15-Sep-2026 17:12:11 configfile: pytest.ini
15-Sep-2026 17:12:13 collecting ... collected 32 items
15-Sep-2026 17:12:13
15-Sep-2026 17:12:13
15-Sep-2026 17:12:13 2026-09-15 21:12:14        WARN        ::casa        The BOX parameter tests will cause errors to occur, do not be alarmed
15-Sep-2026 17:12:13 2026-09-15 21:12:14        SEVERE        CasacRegionManager::_fromBCS        blc in box spec is less than 0
15-Sep-2026 17:12:13 2026-09-15 21:12:14        SEVERE        regionmanager::frombcs        Exception Reported: 2026-09-15 21:12:14        SEVERE        CasacRegionManager::_fromBCS        blc in box spec is less than 0
15-Sep-2026 17:12:13 2026-09-15 21:12:14        SEVERE        immath::::casa        Unable to process expression IM0
15-Sep-2026 17:12:13 2026-09-15 21:12:14        SEVERE        immath::::casa        Exception caught was: Unable to apply region to file: ngc5921.clean.image
15-Sep-2026 17:12:13 2026-09-15 21:12:14        SEVERE        immath::::casa        Task immath raised an exception of class Exception with the following message: Unable to apply region to file: ngc5921.clean.image
15-Sep-2026 17:12:13 2026-09-15 21:12:14        SEVERE        CasacRegionManager::_fromBCS        blc in box spec is less than 0
15-Sep-2026 17:12:13 2026-09-15 21:12:14        SEVERE        regionmanager::frombcs        Exception Reported: 2026-09-15 21:12:14        SEVERE        CasacRegionManager::_fromBCS        blc in box spec is less than 0
15-Sep-2026 17:12:13 2026-09-15 21:12:14        SEVERE        immath::::casa        Unable to process expression IM0
15-Sep-2026 17:12:13 2026-09-15 21:12:14        SEVERE        immath::::casa        Exception caught was: Unable to apply region to file: ngc5921.clean.image
15-Sep-2026 17:12:13 2026-09-15 21:12:14        SEVERE        immath::::casa        Task immath raised an exception of class Exception with the following message: Unable to apply region to file: ngc5921.clean.image
15-Sep-2026 17:12:13 2026-09-15 21:12:14        SEVERE        CasacRegionManager::_fromBCS        blc in box spec is less than 0
15-Sep-2026 17:12:13 2026-09-15 21:12:14        SEVERE        regionmanager::frombcs        Exception Reported: 2026-09-15 21:12:14        SEVERE        CasacRegionManager::_fromBCS        blc in box spec is less than 0
15-Sep-2026 17:12:13 2026-09-15 21:12:14        SEVERE        immath::::casa        Unable to process expression IM0
15-Sep-2026 17:12:13 2026-09-15 21:12:14        SEVERE        immath::::casa        Exception caught was: Unable to apply region to file: ngc5921.clean.image
15-Sep-2026 17:12:13 2026-09-15 21:12:14        SEVERE        immath::::casa        Task immath raised an exception of class Exception with the following message: Unable to apply region to file: ngc5921.clean.image
15-Sep-2026 17:12:13 2026-09-15 21:12:14        SEVERE        CasacRegionManager::_fromBCS        blc in box spec is less than 0
15-Sep-2026 17:12:13 2026-09-15 21:12:14        SEVERE        regionmanager::frombcs        Exception Reported: 2026-09-15 21:12:14        SEVERE        CasacRegionManager::_fromBCS        blc in box spec is less than 0
15-Sep-2026 17:12:13 2026-09-15 21:12:14        SEVERE        immath::::casa        Unable to process expression IM0
15-Sep-2026 17:12:13 2026-09-15 21:12:14        SEVERE        immath::::casa        Exception caught was: Unable to apply region to file: ngc5921.clean.image
15-Sep-2026 17:12:13 2026-09-15 21:12:14        SEVERE        immath::::casa        Task immath raised an exception of class Exception with the following message: Unable to apply region to file: ngc5921.clean.image
15-Sep-2026 17:12:13 2026-09-15 21:12:14        SEVERE        CasacRegionManager::_fromBCS        trc in box spec is greater than or equal to number of direction coordinate pixels in the image
15-Sep-2026 17:12:13 2026-09-15 21:12:14        SEVERE        regionmanager::frombcs        Exception Reported: 2026-09-15 21:12:14        SEVERE        CasacRegionManager::_fromBCS        trc in box spec is greater than or equal to number of direction coordinate pixels in the image
15-Sep-2026 17:12:13 2026-09-15 21:12:14        SEVERE        immath::::casa        Unable to process expression IM0
15-Sep-2026 17:12:13 2026-09-15 21:12:14        SEVERE        immath::::casa        Exception caught was: Unable to apply region to file: ngc5921.clean.image
15-Sep-2026 17:12:13 2026-09-15 21:12:14        SEVERE        immath::::casa        Task immath raised an exception of class Exception with the following message: Unable to apply region to file: ngc5921.clean.image
15-Sep-2026 17:12:13 2026-09-15 21:12:14        SEVERE        CasacRegionManager::_fromBCS        trc in box spec is greater than or equal to number of direction coordinate pixels in the image
15-Sep-2026 17:12:13 2026-09-15 21:12:14        SEVERE        regionmanager::frombcs        Exception Reported: 2026-09-15 21:12:14        SEVERE        CasacRegionManager::_fromBCS        trc in box spec is greater than or equal to number of direction coordinate pixels in the image
15-Sep-2026 17:12:13 2026-09-15 21:12:14        SEVERE        immath::::casa        Unable to process expression IM0
15-Sep-2026 17:12:13 2026-09-15 21:12:14        SEVERE        immath::::casa        Exception caught was: Unable to apply region to file: ngc5921.clean.image
15-Sep-2026 17:12:13 2026-09-15 21:12:14        SEVERE        immath::::casa        Task immath raised an exception of class Exception with the following message: Unable to apply region to file: ngc5921.clean.image
15-Sep-2026 17:12:13 2026-09-15 21:12:14        SEVERE        CasacRegionManager::_fromBCS        trc in box spec is greater than or equal to number of direction coordinate pixels in the image
15-Sep-2026 17:12:13 2026-09-15 21:12:14        SEVERE        regionmanager::frombcs        Exception Reported: 2026-09-15 21:12:14        SEVERE        CasacRegionManager::_fromBCS        trc in box spec is greater than or equal to number of direction coordinate pixels in the image
15-Sep-2026 17:12:13 2026-09-15 21:12:14        SEVERE        immath::::casa        Unable to process expression IM0
15-Sep-2026 17:12:13 2026-09-15 21:12:14        SEVERE        immath::::casa        Exception caught was: Unable to apply region to file: ngc5921.clean.image
15-Sep-2026 17:12:13 2026-09-15 21:12:14        SEVERE        immath::::casa        Task immath raised an exception of class Exception with the following message: Unable to apply region to file: ngc5921.clean.image
15-Sep-2026 17:12:13 2026-09-15 21:12:14        SEVERE        CasacRegionManager::_fromBCS        trc in box spec is greater than or equal to number of direction coordinate pixels in the image
15-Sep-2026 17:12:13 2026-09-15 21:12:14        SEVERE        regionmanager::frombcs        Exception Reported: 2026-09-15 21:12:14        SEVERE        CasacRegionManager::_fromBCS        trc in box spec is greater than or equal to number of direction coordinate pixels in the image
15-Sep-2026 17:12:13 2026-09-15 21:12:14        SEVERE        immath::::casa        Unable to process expression IM0
15-Sep-2026 17:12:13 2026-09-15 21:12:14        SEVERE        immath::::casa        Exception caught was: Unable to apply region to file: ngc5921.clean.image
15-Sep-2026 17:12:13 2026-09-15 21:12:14        SEVERE        immath::::casa        Task immath raised an exception of class Exception with the following message: Unable to apply region to file: ngc5921.clean.image
15-Sep-2026 17:12:13 test_task_immath.py::immath_test1::test_input10
15-Sep-2026 17:12:13 Immath 10: Test bad x and y box values
15-Sep-2026 17:12:13 PASSED
15-Sep-2026 17:12:13
15-Sep-2026 17:12:13 2026-09-15 21:12:14        WARN        immath::::casa        The CHANS parameter tests will cause errors to occur, do not be alarmed
15-Sep-2026 17:12:13 2026-09-15 21:12:14        SEVERE        regionmanager::frombcs        Exception Reported: Invalid channel specification in -5 of spec -5 at File: /Users/casaci/bamboohome/xml-data/build-dir/CASASPECS-PR223-BPMACOS15PY312/casa6/casatools/src/code/imageanalysis/IO/ParameterParser.cc, line: 176
15-Sep-2026 17:12:13 2026-09-15 21:12:14        SEVERE        immath::::casa        Unable to process expression IM0
15-Sep-2026 17:12:13 2026-09-15 21:12:14        SEVERE        immath::::casa        Exception caught was: Unable to apply region to file: ngc5921.clean.image
15-Sep-2026 17:12:13 2026-09-15 21:12:14        SEVERE        immath::::casa        Task immath raised an exception of class Exception with the following message: Unable to apply region to file: ngc5921.clean.image
15-Sep-2026 17:12:13 2026-09-15 21:12:14        SEVERE        regionmanager::frombcs        Exception Reported: Invalid channel specification in -2 of spec -2 at File: /Users/casaci/bamboohome/xml-data/build-dir/CASASPECS-PR223-BPMACOS15PY312/casa6/casatools/src/code/imageanalysis/IO/ParameterParser.cc, line: 176
15-Sep-2026 17:12:13 2026-09-15 21:12:14        SEVERE        immath::::casa        Unable to process expression IM0
15-Sep-2026 17:12:13 2026-09-15 21:12:14        SEVERE        immath::::casa        Exception caught was: Unable to apply region to file: ngc5921.clean.image
15-Sep-2026 17:12:13 2026-09-15 21:12:14        SEVERE        immath::::casa        Task immath raised an exception of class Exception with the following message: Unable to apply region to file: ngc5921.clean.image
15-Sep-2026 17:12:13 2026-09-15 21:12:14        SEVERE        regionmanager::frombcs        Exception Reported: Invalid channel specification in -18 of spec -18 at File: /Users/casaci/bamboohome/xml-data/build-dir/CASASPECS-PR223-BPMACOS15PY312/casa6/casatools/src/code/imageanalysis/IO/ParameterParser.cc, line: 176
15-Sep-2026 17:12:13 2026-09-15 21:12:14        SEVERE        immath::::casa        Unable to process expression IM0
15-Sep-2026 17:12:13 2026-09-15 21:12:14        SEVERE        immath::::casa        Exception caught was: Unable to apply region to file: ngc5921.clean.image
15-Sep-2026 17:12:13 2026-09-15 21:12:14        SEVERE        immath::::casa        Task immath raised an exception of class Exception with the following message: Unable to apply region to file: ngc5921.clean.image
15-Sep-2026 17:12:13 2026-09-15 21:12:14        SEVERE        regionmanager::frombcs        Exception Reported: Exception: Zero-based max channel 47 must be less than the total number of channels (46) in the channel specification 47.
15-Sep-2026 17:12:13 2026-09-15 21:12:14        SEVERE        regionmanager::frombcs+        ... thrown by static std::vector<uInt> casa::ParameterParser::spectralRangesFromChans(uInt &, const String &, const uInt) at File: /Users/casaci/bamboohome/xml-data/build-dir/CASASPECS-PR223-BPMACOS15PY312/casa6/casatools/src/code/imageanalysis/IO/ParameterParser.cc, line: 188
15-Sep-2026 17:12:13 2026-09-15 21:12:14        SEVERE        immath::::casa        Unable to process expression IM0
15-Sep-2026 17:12:13 2026-09-15 21:12:14        SEVERE        immath::::casa        Exception caught was: Unable to apply region to file: ngc5921.clean.image
15-Sep-2026 17:12:13 2026-09-15 21:12:14        SEVERE        immath::::casa        Task immath raised an exception of class Exception with the following message: Unable to apply region to file: ngc5921.clean.image
15-Sep-2026 17:12:13 2026-09-15 21:12:14        SEVERE        regionmanager::frombcs        Exception Reported: Exception: Zero-based max channel 46 must be less than the total number of channels (46) in the channel specification 46.
15-Sep-2026 17:12:13 2026-09-15 21:12:14        SEVERE        regionmanager::frombcs+        ... thrown by static std::vector<uInt> casa::ParameterParser::spectralRangesFromChans(uInt &, const String &, const uInt) at File: /Users/casaci/bamboohome/xml-data/build-dir/CASASPECS-PR223-BPMACOS15PY312/casa6/casatools/src/code/imageanalysis/IO/ParameterParser.cc, line: 188
15-Sep-2026 17:12:13 2026-09-15 21:12:14        SEVERE        immath::::casa        Unable to process expression IM0
15-Sep-2026 17:12:13 2026-09-15 21:12:14        SEVERE        immath::::casa        Exception caught was: Unable to apply region to file: ngc5921.clean.image
15-Sep-2026 17:12:13 2026-09-15 21:12:14        SEVERE        immath::::casa        Task immath raised an exception of class Exception with the following message: Unable to apply region to file: ngc5921.clean.image
15-Sep-2026 17:12:13 test_task_immath.py::immath_test1::test_input12
15-Sep-2026 17:12:13 Immath 12: Test bad values of channels
15-Sep-2026 17:12:13 PASSED
15-Sep-2026 17:12:13
15-Sep-2026 17:12:14 test_task_immath.py::immath_test1::test_input13
15-Sep-2026 17:12:14 Immath 12: Test selection of channels
15-Sep-2026 17:12:14 immath( imagename=ngc5921.clean.image, varnames='A', expr='A', chans='22~35', outfile='input_test14' )
15-Sep-2026 17:12:14 PASSED
15-Sep-2026 17:12:14
15-Sep-2026 17:12:14 2026-09-15 21:12:14        WARN        immath::::casa        The STOKES parameter tests will cause errors to occur, do not be alarmed
15-Sep-2026 17:12:14 2026-09-15 21:12:14        SEVERE        regionmanager::frombcs        Exception Reported: LCBox::LCBox - blc [0, 0, 2147483647, 0] must be <= trc [255, 255, 0, 45]
15-Sep-2026 17:12:14 2026-09-15 21:12:14        SEVERE        immath::::casa        Unable to process expression IM0
15-Sep-2026 17:12:14 2026-09-15 21:12:14        SEVERE        immath::::casa        Exception caught was: Unable to apply region to file: ngc5921.clean.image
15-Sep-2026 17:12:14 2026-09-15 21:12:14        SEVERE        immath::::casa        Task immath raised an exception of class Exception with the following message: Unable to apply region to file: ngc5921.clean.image
15-Sep-2026 17:12:14 2026-09-15 21:12:14        SEVERE        CasacRegionManager::_setPolarizationRanges        (Sub)String YELLOW in stokes specification part YELLOW does not match a known polarization.
15-Sep-2026 17:12:14 2026-09-15 21:12:14        SEVERE        regionmanager::frombcs        Exception Reported: 2026-09-15 21:12:14        SEVERE        CasacRegionManager::_setPolarizationRanges        (Sub)String YELLOW in stokes specification part YELLOW does not match a known polarization.
15-Sep-2026 17:12:14 2026-09-15 21:12:14        SEVERE        immath::::casa        Unable to process expression IM0
15-Sep-2026 17:12:14 2026-09-15 21:12:14        SEVERE        immath::::casa        Exception caught was: Unable to apply region to file: ngc5921.clean.image
15-Sep-2026 17:12:14 2026-09-15 21:12:14        SEVERE        immath::::casa        Task immath raised an exception of class Exception with the following message: Unable to apply region to file: ngc5921.clean.image
15-Sep-2026 17:12:14 test_task_immath.py::immath_test1::test_input14
15-Sep-2026 17:12:14 Immath 13: Test STOKES parameter, values: I, Q, yellow
15-Sep-2026 17:12:14 PASSED
15-Sep-2026 17:12:14
15-Sep-2026 17:12:14 2026-09-15 21:12:14        WARN        immath::::casa        The IMAGENAME parameter tests will cause errors to occur, do not be alarmed
15-Sep-2026 17:12:14 2026-09-15 21:12:14        SEVERE        immath::::casa        Image data set not found - please verify junk
15-Sep-2026 17:12:14 2026-09-15 21:12:14        SEVERE        immath::::casa        Unable to process expression IM0
15-Sep-2026 17:12:14 2026-09-15 21:12:14        SEVERE        immath::::casa        Exception caught was: Image data set not found - please verify junk
15-Sep-2026 17:12:14 2026-09-15 21:12:14        SEVERE        immath::::casa        Task immath raised an exception of class Exception with the following message: Image data set not found - please verify junk
15-Sep-2026 17:12:14 test_task_immath.py::immath_test1::test_input2
15-Sep-2026 17:12:14 Immath 2: Test bad input file
15-Sep-2026 17:12:14 PASSED
15-Sep-2026 17:12:14
15-Sep-2026 17:12:14 test_task_immath.py::immath_test1::test_input3
15-Sep-2026 17:12:14 Immath 3: test good input file
15-Sep-2026 17:12:14 PASSED
15-Sep-2026 17:12:14
15-Sep-2026 17:12:14 2026-09-15 21:12:14        SEVERE        immath::::casa        Unable to process expression IM0
15-Sep-2026 17:12:14 2026-09-15 21:12:14        SEVERE        immath::::casa        Exception caught was: can only concatenate str (not "int") to str
15-Sep-2026 17:12:14 2026-09-15 21:12:14        SEVERE        immath::::casa        Task immath raised an exception of class TypeError with the following message: can only concatenate str (not "int") to str
15-Sep-2026 17:12:14 test_task_immath.py::immath_test1::test_input4
15-Sep-2026 17:12:14 Immath 4: Test bad list of input files
15-Sep-2026 17:12:14 PASSED
15-Sep-2026 17:12:14
15-Sep-2026 17:12:14 2026-09-15 21:12:15        WARN        immath::::casa        The OUTFILE parameter tests will cause errors to occur, do not be alarmed
15-Sep-2026 17:12:14 2026-09-15 21:12:15        SEVERE        immath::::casa        Unable to process expression IM0*1
15-Sep-2026 17:12:14 2026-09-15 21:12:15        SEVERE        immath::::casa        Exception caught was: Output file input_test4 exists. immath can not proceed, please remove it or change the output file name.
15-Sep-2026 17:12:14 2026-09-15 21:12:15        SEVERE        immath::::casa        Task immath raised an exception of class Exception with the following message: Output file input_test4 exists. immath can not proceed, please remove it or change the output file name.
15-Sep-2026 17:12:14 test_task_immath.py::immath_test1::test_input5
15-Sep-2026 17:12:14 Immath 5: test list with good input files
15-Sep-2026 17:12:14 PASSED
15-Sep-2026 17:12:14
15-Sep-2026 17:12:14 test_task_immath.py::immath_test1::test_input7
15-Sep-2026 17:12:14 Immath 7: test outfile
15-Sep-2026 17:12:14 PASSED
15-Sep-2026 17:12:14
15-Sep-2026 17:12:14 2026-09-15 21:12:15        WARN        immath::::casa        The REGION parameter tests will cause errors to occur, do not be alarmed
15-Sep-2026 17:12:14 2026-09-15 21:12:15        SEVERE        regionmanager::frombcs        Exception Reported: Unable to open region file or region table description garbage.rgn.
15-Sep-2026 17:12:14 2026-09-15 21:12:15        SEVERE        regionmanager::frombcs+        If it is supposed to be a text string its format is incorrect at File: /Users/casaci/bamboohome/xml-data/build-dir/CASASPECS-PR223-BPMACOS15PY312/casa6/casatools/src/code/imageanalysis/Regions/CasacRegionManager.cc, line: 497
15-Sep-2026 17:12:14 2026-09-15 21:12:15        SEVERE        immath::::casa        Unable to process expression IM0
15-Sep-2026 17:12:14 2026-09-15 21:12:15        SEVERE        immath::::casa        Exception caught was: Unable to apply region to file: n1333_both.image
15-Sep-2026 17:12:14 2026-09-15 21:12:15        SEVERE        immath::::casa        Task immath raised an exception of class Exception with the following message: Unable to apply region to file: n1333_both.image
15-Sep-2026 17:12:14 2026-09-15 21:12:15        SEVERE        regionmanager::frombcs        Exception Reported: /Users/casaci/bamboohome/xml-data/build-dir/CASASPECS-PR223-TTA14/casa6/casatestutils/nosedir/test_task_immath/garbage.rgn is neither a valid binary region file, nor a valid region text file. at File: /Users/casaci/bamboohome/xml-data/build-dir/CASASPECS-PR223-BPMACOS15PY312/casa6/casatools/src/code/imageanalysis/Regions/CasacRegionManager.cc, line: 431
15-Sep-2026 17:12:14 2026-09-15 21:12:15        SEVERE        immath::::casa        Unable to process expression IM0
15-Sep-2026 17:12:14 2026-09-15 21:12:15        SEVERE        immath::::casa        Exception caught was: Unable to apply region to file: n1333_both.image
15-Sep-2026 17:12:14 2026-09-15 21:12:15        SEVERE        immath::::casa        Task immath raised an exception of class Exception with the following message: Unable to apply region to file: n1333_both.image
15-Sep-2026 17:12:14 test_task_immath.py::immath_test1::test_input8
15-Sep-2026 17:12:14 Immath 8: Test bad region parameter
15-Sep-2026 17:12:14 PASSED
15-Sep-2026 17:12:14
15-Sep-2026 17:12:14 test_task_immath.py::immath_test1::test_input9
15-Sep-2026 17:12:14 Immath 9: Test good region parameter
15-Sep-2026 17:12:14 ARG
15-Sep-2026 17:12:14 immath( imagename=n1333_both.image, expr='IM0', region=n1333_both.image.rgn, outfile='input_test12' )
15-Sep-2026 17:12:14 PASSED
15-Sep-2026 17:12:14
15-Sep-2026 17:12:15 test_task_immath.py::immath_test2::test_CAS_1830_fix
15-Sep-2026 17:12:15 Immath: verification of fix to CAS-1830
15-Sep-2026 17:12:15 PASSED
15-Sep-2026 17:12:15
15-Sep-2026 17:12:15 test_task_immath.py::immath_test2::test_CAS_1910_fix
15-Sep-2026 17:12:15 Immath: verification of fix to CAS-1910
15-Sep-2026 17:12:15 PASSED
15-Sep-2026 17:12:15
15-Sep-2026 17:12:15 test_task_immath.py::immath_test2::test_expr1
15-Sep-2026 17:12:15 Immath expr1: Testing various math expressions
15-Sep-2026 17:12:15 PASSED
15-Sep-2026 17:12:15
15-Sep-2026 17:12:15 test_task_immath.py::immath_test2::test_expr2
15-Sep-2026 17:12:15 Immath expr2: Test extraction of single plane
15-Sep-2026 17:12:15 PASSED
15-Sep-2026 17:12:15
15-Sep-2026 17:12:15 test_task_immath.py::immath_test2::test_expr3
15-Sep-2026 17:12:15 Immath expr3: Add plane to an image
15-Sep-2026 17:12:15 PASSED
15-Sep-2026 17:12:15
15-Sep-2026 17:12:15 test_task_immath.py::immath_test2::test_many_images
15-Sep-2026 17:12:15 Immath: verification of fix to CAS-1678
15-Sep-2026 17:12:15 PASSED
15-Sep-2026 17:12:15
15-Sep-2026 17:12:16 test_task_immath.py::immath_test2::test_one_function
15-Sep-2026 17:12:16 Immath: verification of fix to CAS-1452
15-Sep-2026 17:12:16 PASSED
15-Sep-2026 17:12:16
15-Sep-2026 17:12:16 2026-09-15 21:12:16        SEVERE        MeasTable::dUTC(Double) (file ../../measures/Measures/MeasTable.cc, line 4290)        Leap second table TAI_UTC seems out-of-date.
15-Sep-2026 17:12:16 2026-09-15 21:12:16        SEVERE        MeasTable::dUTC(Double) (file ../../measures/Measures/MeasTable.cc, line 4290)+        Until the table is updated (see the CASA documentation or your system admin),
15-Sep-2026 17:12:16 2026-09-15 21:12:16        SEVERE        MeasTable::dUTC(Double) (file ../../measures/Measures/MeasTable.cc, line 4290)+        times and coordinates derived from UTC could be wrong by 1s or more.
15-Sep-2026 17:12:16 test_task_immath.py::immath_test2::test_pol
15-Sep-2026 17:12:16 Immath pol: Testing various polarization modes for data correctness
15-Sep-2026 17:12:16 PASSED
15-Sep-2026 17:12:16
15-Sep-2026 17:12:17 2026-09-15 21:12:17        SEVERE        image::close (file /private/var/folders/60/83wxljbx2vlfbx_hy0yfv8rc0000gn/T/build-via-sdist-i5v79vie/casatools-6.7.7.8+dirty/src/tools/image/image_cmpt.cc, line 693)        Exception Reported: ImageExprParse: 'im..2' is an unknown lattice, image, or region
15-Sep-2026 17:12:17 2026-09-15 21:12:17        SEVERE        image::close (file /private/var/folders/60/83wxljbx2vlfbx_hy0yfv8rc0000gn/T/build-via-sdist-i5v79vie/casatools-6.7.7.8+dirty/src/tools/image/image_cmpt.cc, line 693)+        Scanned so far: "im.1"+"im..2"
15-Sep-2026 17:12:17 2026-09-15 21:12:17        SEVERE        image::close (file /private/var/folders/60/83wxljbx2vlfbx_hy0yfv8rc0000gn/T/build-via-sdist-i5v79vie/casatools-6.7.7.8+dirty/src/tools/image/image_cmpt.cc, line 693)        Exception Reported: 3-argument function max is unknown
15-Sep-2026 17:12:17 2026-09-15 21:12:17        SEVERE        image::close (file /private/var/folders/60/83wxljbx2vlfbx_hy0yfv8rc0000gn/T/build-via-sdist-i5v79vie/casatools-6.7.7.8+dirty/src/tools/image/image_cmpt.cc, line 693)+        Scanned so far: "im.2" - max("im.1", "im.2", "im.1")
15-Sep-2026 17:12:17 test_task_immath.py::immath_test3::test21
15-Sep-2026 17:12:17 Test moved from imagetest regreesion
15-Sep-2026 17:12:17 PASSED
15-Sep-2026 17:12:17
15-Sep-2026 17:12:17 2026-09-15 21:12:17        SEVERE        image::close (file /private/var/folders/60/83wxljbx2vlfbx_hy0yfv8rc0000gn/T/build-via-sdist-i5v79vie/casatools-6.7.7.8+dirty/src/tools/image/image_cmpt.cc, line 693)        Exception Reported: ImageExprParse: 'i_like_doggies' is an unknown lattice or image or it is an unqualified region
15-Sep-2026 17:12:17 2026-09-15 21:12:17        SEVERE        image::close (file /private/var/folders/60/83wxljbx2vlfbx_hy0yfv8rc0000gn/T/build-via-sdist-i5v79vie/casatools-6.7.7.8+dirty/src/tools/image/image_cmpt.cc, line 693)+        Scanned so far: i_like_doggies
15-Sep-2026 17:12:17 2026-09-15 21:12:17        SEVERE        image::newimagefromshape (file /private/var/folders/60/83wxljbx2vlfbx_hy0yfv8rc0000gn/T/build-via-sdist-i5v79vie/casatools-6.7.7.8+dirty/src/tools/image/image_cmpt.cc, line 4176)        Exception Reported: LatticeExprNode - shapes of operands mismatch
15-Sep-2026 17:12:17 2026-09-15 21:12:17        SEVERE        image::newimagefromshape (file /private/var/folders/60/83wxljbx2vlfbx_hy0yfv8rc0000gn/T/build-via-sdist-i5v79vie/casatools-6.7.7.8+dirty/src/tools/image/image_cmpt.cc, line 4176)+        Scanned so far: ia.fromarray1.image+ia.fromshape2.image
15-Sep-2026 17:12:17 test_task_immath.py::immath_test3::test_8
15-Sep-2026 17:12:17 Tests moved from imagetest regression, some are probably useless
15-Sep-2026 17:12:17 PASSED
15-Sep-2026 17:12:17
15-Sep-2026 17:12:17 2026-09-15 21:12:17        SEVERE        imagepol::open        Exception Reported: This Stokes coordinate has only one of Q and U. This is not useful at File: /Users/casaci/bamboohome/xml-data/build-dir/CASASPECS-PR223-BPMACOS15PY312/casa6/casatools/src/code/imageanalysis/ImageAnalysis/ImagePolarimetry.cc, line: 1141
15-Sep-2026 17:12:17 2026-09-15 21:12:17        SEVERE        immath::::casa        Error running immath
15-Sep-2026 17:12:17 2026-09-15 21:12:17        SEVERE        immath::::casa        Exception caught was: This Stokes coordinate has only one of Q and U. This is not useful at File: /Users/casaci/bamboohome/xml-data/build-dir/CASASPECS-PR223-BPMACOS15PY312/casa6/casatools/src/code/imageanalysis/ImageAnalysis/ImagePolarimetry.cc, line: 1141
15-Sep-2026 17:12:17 2026-09-15 21:12:17        SEVERE        immath::::casa        Task immath raised an exception of class RuntimeError with the following message: This Stokes coordinate has only one of Q and U. This is not useful at File: /Users/casaci/bamboohome/xml-data/build-dir/CASASPECS-PR223-BPMACOS15PY312/casa6/casatools/src/code/imageanalysis/ImageAnalysis/ImagePolarimetry.cc, line: 1141
15-Sep-2026 17:12:17 2026-09-15 21:12:17        SEVERE        imagepol::open        Exception Reported: This Stokes coordinate has only one of Q and U. This is not useful at File: /Users/casaci/bamboohome/xml-data/build-dir/CASASPECS-PR223-BPMACOS15PY312/casa6/casatools/src/code/imageanalysis/ImageAnalysis/ImagePolarimetry.cc, line: 1141
15-Sep-2026 17:12:17 2026-09-15 21:12:17        SEVERE        immath::::casa        Error running immath
15-Sep-2026 17:12:17 2026-09-15 21:12:17        SEVERE        immath::::casa        Exception caught was: This Stokes coordinate has only one of Q and U. This is not useful at File: /Users/casaci/bamboohome/xml-data/build-dir/CASASPECS-PR223-BPMACOS15PY312/casa6/casatools/src/code/imageanalysis/ImageAnalysis/ImagePolarimetry.cc, line: 1141
15-Sep-2026 17:12:17 2026-09-15 21:12:17        SEVERE        immath::::casa        Task immath raised an exception of class RuntimeError with the following message: This Stokes coordinate has only one of Q and U. This is not useful at File: /Users/casaci/bamboohome/xml-data/build-dir/CASASPECS-PR223-BPMACOS15PY312/casa6/casatools/src/code/imageanalysis/ImageAnalysis/ImagePolarimetry.cc, line: 1141
15-Sep-2026 17:12:17 2026-09-15 21:12:17        SEVERE        imagepol::open        Exception Reported: This Stokes coordinate has only one of Q and U. This is not useful at File: /Users/casaci/bamboohome/xml-data/build-dir/CASASPECS-PR223-BPMACOS15PY312/casa6/casatools/src/code/imageanalysis/ImageAnalysis/ImagePolarimetry.cc, line: 1141
15-Sep-2026 17:12:17 2026-09-15 21:12:17        SEVERE        immath::::casa        Error running immath
15-Sep-2026 17:12:17 2026-09-15 21:12:17        SEVERE        immath::::casa        Exception caught was: This Stokes coordinate has only one of Q and U. This is not useful at File: /Users/casaci/bamboohome/xml-data/build-dir/CASASPECS-PR223-BPMACOS15PY312/casa6/casatools/src/code/imageanalysis/ImageAnalysis/ImagePolarimetry.cc, line: 1141
15-Sep-2026 17:12:17 2026-09-15 21:12:17        SEVERE        immath::::casa        Task immath raised an exception of class RuntimeError with the following message: This Stokes coordinate has only one of Q and U. This is not useful at File: /Users/casaci/bamboohome/xml-data/build-dir/CASASPECS-PR223-BPMACOS15PY312/casa6/casatools/src/code/imageanalysis/ImageAnalysis/ImagePolarimetry.cc, line: 1141
15-Sep-2026 17:12:17 2026-09-15 21:12:18        SEVERE        imagepol::open        Exception Reported: This Stokes coordinate has only one of Q and U. This is not useful at File: /Users/casaci/bamboohome/xml-data/build-dir/CASASPECS-PR223-BPMACOS15PY312/casa6/casatools/src/code/imageanalysis/ImageAnalysis/ImagePolarimetry.cc, line: 1141
15-Sep-2026 17:12:17 2026-09-15 21:12:18        SEVERE        immath::::casa        Error running immath
15-Sep-2026 17:12:17 2026-09-15 21:12:18        SEVERE        immath::::casa        Exception caught was: This Stokes coordinate has only one of Q and U. This is not useful at File: /Users/casaci/bamboohome/xml-data/build-dir/CASASPECS-PR223-BPMACOS15PY312/casa6/casatools/src/code/imageanalysis/ImageAnalysis/ImagePolarimetry.cc, line: 1141
15-Sep-2026 17:12:17 2026-09-15 21:12:18        SEVERE        immath::::casa        Task immath raised an exception of class RuntimeError with the following message: This Stokes coordinate has only one of Q and U. This is not useful at File: /Users/casaci/bamboohome/xml-data/build-dir/CASASPECS-PR223-BPMACOS15PY312/casa6/casatools/src/code/imageanalysis/ImageAnalysis/ImagePolarimetry.cc, line: 1141
15-Sep-2026 17:12:17 2026-09-15 21:12:18        SEVERE        imagepol::open        Exception Reported: This Stokes coordinate has only one of Q and U. This is not useful at File: /Users/casaci/bamboohome/xml-data/build-dir/CASASPECS-PR223-BPMACOS15PY312/casa6/casatools/src/code/imageanalysis/ImageAnalysis/ImagePolarimetry.cc, line: 1141
15-Sep-2026 17:12:17 2026-09-15 21:12:18        SEVERE        immath::::casa        Error running immath
15-Sep-2026 17:12:17 2026-09-15 21:12:18        SEVERE        immath::::casa        Exception caught was: This Stokes coordinate has only one of Q and U. This is not useful at File: /Users/casaci/bamboohome/xml-data/build-dir/CASASPECS-PR223-BPMACOS15PY312/casa6/casatools/src/code/imageanalysis/ImageAnalysis/ImagePolarimetry.cc, line: 1141
15-Sep-2026 17:12:17 2026-09-15 21:12:18        SEVERE        immath::::casa        Task immath raised an exception of class RuntimeError with the following message: This Stokes coordinate has only one of Q and U. This is not useful at File: /Users/casaci/bamboohome/xml-data/build-dir/CASASPECS-PR223-BPMACOS15PY312/casa6/casatools/src/code/imageanalysis/ImageAnalysis/ImagePolarimetry.cc, line: 1141
15-Sep-2026 17:12:17 test_task_immath.py::immath_test3::test_CAS2120
15-Sep-2026 17:12:17 immath: verification of old functionality and similar new functionality introduced by CAS-2120
15-Sep-2026 17:12:17 PASSED
15-Sep-2026 17:12:17
15-Sep-2026 17:12:17 2026-09-15 21:12:18        SEVERE        image::subimage (file /private/var/folders/60/83wxljbx2vlfbx_hy0yfv8rc0000gn/T/build-via-sdist-i5v79vie/casatools-6.7.7.8+dirty/src/tools/image/image_cmpt.cc, line 6162)        Exception Reported: The input image shape ([10, 20, 4, 40]) and mask shape ([10, 20, 1, 1]) are different, and it was specified that the mask should not be extended, so the mask cannot be applied to the (sub)image. Specifying that the mask should be extended may resolve the issue at File: /Users/casaci/bamboohome/xml-data/build-dir/CASASPECS-PR223-BPMACOS15PY312/casainstall/include/casacpp/imageanalysis/ImageAnalysis/SubImageFactory.tcc, line: 306
15-Sep-2026 17:12:17 2026-09-15 21:12:18        SEVERE        immath::::casa        Unable to process expression 1*IM0
15-Sep-2026 17:12:17 2026-09-15 21:12:18        SEVERE        immath::::casa        Exception caught was: Unable to apply region to file: myim.im
15-Sep-2026 17:12:17 2026-09-15 21:12:18        SEVERE        immath::::casa        Task immath raised an exception of class Exception with the following message: Unable to apply region to file: myim.im
15-Sep-2026 17:12:17 2026-09-15 21:12:18        SEVERE        image::subimage (file /private/var/folders/60/83wxljbx2vlfbx_hy0yfv8rc0000gn/T/build-via-sdist-i5v79vie/casatools-6.7.7.8+dirty/src/tools/image/image_cmpt.cc, line 6162)        Exception Reported: The input image shape ([10, 20, 4, 40]) and mask shape ([10, 20, 4, 2]) are different, and it was specified that the mask should not be extended, so the mask cannot be applied to the (sub)image. Specifying that the mask should be extended may resolve the issue at File: /Users/casaci/bamboohome/xml-data/build-dir/CASASPECS-PR223-BPMACOS15PY312/casainstall/include/casacpp/imageanalysis/ImageAnalysis/SubImageFactory.tcc, line: 306
15-Sep-2026 17:12:17 2026-09-15 21:12:18        SEVERE        immath::::casa        Unable to process expression 1*IM0
15-Sep-2026 17:12:17 2026-09-15 21:12:18        SEVERE        immath::::casa        Exception caught was: Unable to apply region to file: myim.im
15-Sep-2026 17:12:17 2026-09-15 21:12:18        SEVERE        immath::::casa        Task immath raised an exception of class Exception with the following message: Unable to apply region to file: myim.im
15-Sep-2026 17:12:17 test_task_immath.py::immath_test3::test_CAS2943
15-Sep-2026 17:12:17 Test the stretch parameter
15-Sep-2026 17:12:17 PASSED
15-Sep-2026 17:12:17
15-Sep-2026 17:12:17 2026-09-15 21:12:18        WARN        ImageExprCalculator::compute        image units are not the same: 'Jy/beam' vs 'Jy/pixel'. Proceed with caution. Output image metadata will be copied from image a.im
15-Sep-2026 17:12:17 2026-09-15 21:12:18        WARN        ImageExprCalculator::compute        image units are not the same: 'Jy/beam' vs 'Jy/pixel'. Proceed with caution. Output image metadata will be copied from image b.im
15-Sep-2026 17:12:17 2026-09-15 21:12:18        WARN        ImageExprCalculator::compute        image units are not the same: 'Jy/beam' vs 'Jy/pixel'. Proceed with caution. Output image metadata will be copied from image c.im
15-Sep-2026 17:12:17 2026-09-15 21:12:18        WARN        ImageExprCalculator::compute        image units are not the same: 'Jy/beam' vs 'Jy/pixel'. Proceed with caution. Output image metadata will be copied from image a.im
15-Sep-2026 17:12:17 2026-09-15 21:12:18        WARN        ImageExprCalculator::compute        image units are not the same: 'Jy/beam' vs 'Jy/pixel'. Proceed with caution. Output image metadata will be copied from image a.im
15-Sep-2026 17:12:17 2026-09-15 21:12:18        WARN        ImageExprCalculator::compute        image units are not the same: 'Jy/beam' vs 'Jy/pixel'. Proceed with caution. Output image metadata will be copied from image b.im
15-Sep-2026 17:12:17 2026-09-15 21:12:18        WARN        ImageExprCalculator::compute        image units are not the same: 'Jy/beam' vs 'Jy/pixel'. Proceed with caution. Output image metadata will be copied from image b.im
15-Sep-2026 17:12:17 2026-09-15 21:12:18        WARN        ImageExprCalculator::compute        image units are not the same: 'Jy/beam' vs 'Jy/pixel'. Proceed with caution. Output image metadata will be copied from image c.im
15-Sep-2026 17:12:17 2026-09-15 21:12:18        WARN        ImageExprCalculator::compute        image units are not the same: 'Jy/beam' vs 'Jy/pixel'. Proceed with caution. Output image metadata will be copied from image c.im
15-Sep-2026 17:12:18 test_task_immath.py::immath_test3::test_CAS6896
15-Sep-2026 17:12:18 Verify CAS-6896, user can choose from which image to copy metadata
15-Sep-2026 17:12:18 PASSED
15-Sep-2026 17:12:18
15-Sep-2026 17:12:18 2026-09-15 21:12:18        WARN        ImageExprCalculator::compute        image beams are not the same: Axis Lengths: [1, 1]  (NB: Matrix in Row/Column order)
15-Sep-2026 17:12:18 2026-09-15 21:12:18        WARN        ImageExprCalculator::compute+        [major: 3.235 arcmin, minor: 1 arcmin, pa: 0 deg]
15-Sep-2026 17:12:18 2026-09-15 21:12:18        WARN        ImageExprCalculator::compute+         vs Axis Lengths: [1, 1]  (NB: Matrix in Row/Column order)
15-Sep-2026 17:12:18 2026-09-15 21:12:18        WARN        ImageExprCalculator::compute+        [major: 3.234 arcmin, minor: 1 arcmin, pa: 0 deg]
15-Sep-2026 17:12:18 2026-09-15 21:12:18        WARN        ImageExprCalculator::compute        image beams are not the same: Axis Lengths: [1, 1]  (NB: Matrix in Row/Column order)
15-Sep-2026 17:12:18 2026-09-15 21:12:18        WARN        ImageExprCalculator::compute+        [major: 3.234568 arcmin, minor: 1 arcmin, pa: 0 deg]
15-Sep-2026 17:12:18 2026-09-15 21:12:18        WARN        ImageExprCalculator::compute+         vs Axis Lengths: [1, 1]  (NB: Matrix in Row/Column order)
15-Sep-2026 17:12:18 2026-09-15 21:12:18        WARN        ImageExprCalculator::compute+        [major: 3.234567 arcmin, minor: 1 arcmin, pa: 0 deg]
15-Sep-2026 17:12:18 2026-09-15 21:12:18        WARN        ImageExprCalculator::compute        image beams are not the same: Axis Lengths: [1, 1]  (NB: Matrix in Row/Column order)
15-Sep-2026 17:12:18 2026-09-15 21:12:18        WARN        ImageExprCalculator::compute+        [major: 3.23456789027778 arcmin, minor: 1 arcmin, pa: 0 deg]
15-Sep-2026 17:12:18 2026-09-15 21:12:18        WARN        ImageExprCalculator::compute+         vs Axis Lengths: [1, 1]  (NB: Matrix in Row/Column order)
15-Sep-2026 17:12:18 2026-09-15 21:12:18        WARN        ImageExprCalculator::compute+        [major: 3.23456789017778 arcmin, minor: 1 arcmin, pa: 0 deg]
15-Sep-2026 17:12:18 test_task_immath.py::immath_test3::test_beam_logging_precision
15-Sep-2026 17:12:18 Test that when beams are different, immath logs enough digits to show where the
15-Sep-2026 17:12:18 difference occurs. CAS-13135
15-Sep-2026 17:12:18 PASSED
15-Sep-2026 17:12:18
15-Sep-2026 17:12:18 2026-09-15 21:12:18        WARN        ImageExprCalculator::compute2        Overwriting pixel values of the currently attached image
15-Sep-2026 17:12:18 test_task_immath.py::immath_test3::test_complex_calc
15-Sep-2026 17:12:18 Test ia.calc on complex images
15-Sep-2026 17:12:18 PASSED
15-Sep-2026 17:12:18
15-Sep-2026 17:12:18 2026-09-15 21:12:18        WARN        image::open (file /private/var/folders/60/83wxljbx2vlfbx_hy0yfv8rc0000gn/T/build-via-sdist-i5v79vie/casatools-6.7.7.8+dirty/src/tools/image/image_cmpt.cc, line 4208)        Another image is already open, closing first
15-Sep-2026 17:12:18 test_task_immath.py::immath_test3::test_flush
15-Sep-2026 17:12:18 CAS-8570: ensure image is flushed to disk when it is created
15-Sep-2026 17:12:18 PASSED
15-Sep-2026 17:12:18
15-Sep-2026 17:12:18 2026-09-15 21:12:18        WARN        ImageExprCalculator::compute2        Overwriting pixel values of the currently attached image
15-Sep-2026 17:12:18 test_task_immath.py::immath_test3::test_history
15-Sep-2026 17:12:18 Test that history records are added
15-Sep-2026 17:12:18 PASSED
15-Sep-2026 17:12:18
15-Sep-2026 17:12:18 2026-09-15 21:12:18        WARN        image::open (file /private/var/folders/60/83wxljbx2vlfbx_hy0yfv8rc0000gn/T/build-via-sdist-i5v79vie/casatools-6.7.7.8+dirty/src/tools/image/image_cmpt.cc, line 4208)        Another image is already open, closing first
15-Sep-2026 17:12:18 test_task_immath.py::immath_test3::test_poli_sigma
15-Sep-2026 17:12:18 Verify poli sigma fix, CAS-8880
15-Sep-2026 17:12:18 PASSED
15-Sep-2026 17:12:18
15-Sep-2026 17:12:18 test_task_immath.py::immath_test3::test_precision
15-Sep-2026 17:12:18 Test ia.imagecalc() support for various precisions
15-Sep-2026 17:12:18 PASSED
15-Sep-2026 17:12:18
15-Sep-2026 17:12:18 test_task_immath.py::immath_test3::test_spix
15-Sep-2026 17:12:18 CAS-13079: Verify mode="spix" works as expected
15-Sep-2026 17:12:18 PASSED
15-Sep-2026 17:12:18
15-Sep-2026 17:12:18 2026-09-15 21:12:19        WARN        immath::::casa        Ignoring stokes parameters selection for mode='poli'.
15-Sep-2026 17:12:18 2026-09-15 21:12:19        SEVERE        immath::::casa        Error running immath
15-Sep-2026 17:12:18 2026-09-15 21:12:19        SEVERE        immath::::casa        Exception caught was: Stokes V is required for mode tpoli but was not found
15-Sep-2026 17:12:18 2026-09-15 21:12:19        SEVERE        immath::::casa        Task immath raised an exception of class Exception with the following message: Stokes V is required for mode tpoli but was not found
15-Sep-2026 17:12:18 test_task_immath.py::immath_test3::test_tlpol
15-Sep-2026 17:12:18 CAS-12116 test various polarization modes
15-Sep-2026 17:12:18 PASSED
15-Sep-2026 17:12:18
15-Sep-2026 17:12:18 - generated xml file: /Users/casaci/bamboohome/xml-data/build-dir/CASASPECS-PR223-TTA14/casa6/casatestutils/nosedir/xml/test_task_immath/nose.xml -
15-Sep-2026 17:12:18 ======================== 32 passed, 1 warning in 7.38s =========================
15-Sep-2026 17:12:18
15-Sep-2026 17:12:18
15-Sep-2026 17:12:18 Setting Working Directory: /Users/casaci/bamboohome/xml-data/build-dir/CASASPECS-PR223-TTA14/casa6/casatestutils/nosedir/test_task_blcal/
15-Sep-2026 17:12:18 Test Directory: /Users/casaci/bamboohome/xml-data/build-dir/CASASPECS-PR223-TTA14/casa6/casatestutils/nosedir/test_task_blcal
15-Sep-2026 17:12:18
15-Sep-2026 17:12:18 Running Command: pytest --junitxml=/Users/casaci/bamboohome/xml-data/build-dir/CASASPECS-PR223-TTA14/casa6/casatestutils/nosedir/xml/test_task_blcal/nose.xml -s --disable-pytest-warnings --verbose -ra --tb=short /Users/casaci/bamboohome/xml-data/build-dir/CASASPECS-PR223-TTA14/casa6/casatestutils/nosedir/test_task_blcal/
15-Sep-2026 17:12:18
15-Sep-2026 17:12:18 Setting Working Directory: /Users/casaci/bamboohome/xml-data/build-dir/CASASPECS-PR223-TTA14/casa6/casatestutils/nosedir/test_task_sdatmcor/
15-Sep-2026 17:12:18 Test Directory: /Users/casaci/bamboohome/xml-data/build-dir/CASASPECS-PR223-TTA14/casa6/casatestutils/nosedir/test_task_sdatmcor
15-Sep-2026 17:12:18
15-Sep-2026 17:12:18 Running Command: pytest --junitxml=/Users/casaci/bamboohome/xml-data/build-dir/CASASPECS-PR223-TTA14/casa6/casatestutils/nosedir/xml/test_task_sdatmcor/nose.xml -s --disable-pytest-warnings --verbose -ra --tb=short /Users/casaci/bamboohome/xml-data/build-dir/CASASPECS-PR223-TTA14/casa6/casatestutils/nosedir/test_task_sdatmcor/
15-Sep-2026 17:12:18
15-Sep-2026 17:12:18 Setting Working Directory: /Users/casaci/bamboohome/xml-data/build-dir/CASASPECS-PR223-TTA14/casa6/casatestutils/nosedir/test_task_imhead/
15-Sep-2026 17:12:18 Test Directory: /Users/casaci/bamboohome/xml-data/build-dir/CASASPECS-PR223-TTA14/casa6/casatestutils/nosedir/test_task_imhead
15-Sep-2026 17:12:18
15-Sep-2026 17:12:18 Running Command: pytest --junitxml=/Users/casaci/bamboohome/xml-data/build-dir/CASASPECS-PR223-TTA14/casa6/casatestutils/nosedir/xml/test_task_imhead/nose.xml -s --disable-pytest-warnings --verbose -ra --tb=short /Users/casaci/bamboohome/xml-data/build-dir/CASASPECS-PR223-TTA14/casa6/casatestutils/nosedir/test_task_imhead/
15-Sep-2026 17:12:18
15-Sep-2026 17:12:18 Setting Working Directory: /Users/casaci/bamboohome/xml-data/build-dir/CASASPECS-PR223-TTA14/casa6/casatestutils/nosedir/test_task_getantposalma/
15-Sep-2026 17:12:18 Test Directory: /Users/casaci/bamboohome/xml-data/build-dir/CASASPECS-PR223-TTA14/casa6/casatestutils/nosedir/test_task_getantposalma
15-Sep-2026 17:12:18
15-Sep-2026 17:12:18 Running Command: pytest --junitxml=/Users/casaci/bamboohome/xml-data/build-dir/CASASPECS-PR223-TTA14/casa6/casatestutils/nosedir/xml/test_task_getantposalma/nose.xml -s --disable-pytest-warnings --verbose -ra --tb=short /Users/casaci/bamboohome/xml-data/build-dir/CASASPECS-PR223-TTA14/casa6/casatestutils/nosedir/test_task_getantposalma/
15-Sep-2026 17:12:18
15-Sep-2026 17:12:18 Setting Working Directory: /Users/casaci/bamboohome/xml-data/build-dir/CASASPECS-PR223-TTA14/casa6/casatestutils/nosedir/test_task_pccor/
15-Sep-2026 17:12:18 Test Directory: /Users/casaci/bamboohome/xml-data/build-dir/CASASPECS-PR223-TTA14/casa6/casatestutils/nosedir/test_task_pccor
15-Sep-2026 17:12:18
15-Sep-2026 17:12:18 Running Command: pytest --junitxml=/Users/casaci/bamboohome/xml-data/build-dir/CASASPECS-PR223-TTA14/casa6/casatestutils/nosedir/xml/test_task_pccor/nose.xml -s --disable-pytest-warnings --verbose -ra --tb=short /Users/casaci/bamboohome/xml-data/build-dir/CASASPECS-PR223-TTA14/casa6/casatestutils/nosedir/test_task_pccor/
15-Sep-2026 17:12:18
15-Sep-2026 17:12:18 Setting Working Directory: /Users/casaci/bamboohome/xml-data/build-dir/CASASPECS-PR223-TTA14/casa6/casatestutils/nosedir/test_task_split/
15-Sep-2026 17:12:18 Test Directory: /Users/casaci/bamboohome/xml-data/build-dir/CASASPECS-PR223-TTA14/casa6/casatestutils/nosedir/test_task_split
15-Sep-2026 17:12:18
15-Sep-2026 17:12:18 Running Command: pytest --junitxml=/Users/casaci/bamboohome/xml-data/build-dir/CASASPECS-PR223-TTA14/casa6/casatestutils/nosedir/xml/test_task_split/nose.xml -s --disable-pytest-warnings --verbose -ra --tb=short /Users/casaci/bamboohome/xml-data/build-dir/CASASPECS-PR223-TTA14/casa6/casatestutils/nosedir/test_task_split/
15-Sep-2026 17:12:18
15-Sep-2026 17:12:18 Setting Working Directory: /Users/casaci/bamboohome/xml-data/build-dir/CASASPECS-PR223-TTA14/casa6/casatestutils/nosedir/test_task_makemask/
15-Sep-2026 17:12:18 Test Directory: /Users/casaci/bamboohome/xml-data/build-dir/CASASPECS-PR223-TTA14/casa6/casatestutils/nosedir/test_task_makemask
15-Sep-2026 17:12:18
15-Sep-2026 17:12:18 Running Command: pytest --junitxml=/Users/casaci/bamboohome/xml-data/build-dir/CASASPECS-PR223-TTA14/casa6/casatestutils/nosedir/xml/test_task_makemask/nose.xml -s --disable-pytest-warnings --verbose -ra --tb=short /Users/casaci/bamboohome/xml-data/build-dir/CASASPECS-PR223-TTA14/casa6/casatestutils/nosedir/test_task_makemask/
15-Sep-2026 17:12:18
15-Sep-2026 17:12:18 Setting Working Directory: /Users/casaci/bamboohome/xml-data/build-dir/CASASPECS-PR223-TTA14/casa6/casatestutils/nosedir/test_task_visstat/
15-Sep-2026 17:12:18 Test Directory: /Users/casaci/bamboohome/xml-data/build-dir/CASASPECS-PR223-TTA14/casa6/casatestutils/nosedir/test_task_visstat
15-Sep-2026 17:12:18
15-Sep-2026 17:12:18 Running Command: pytest --junitxml=/Users/casaci/bamboohome/xml-data/build-dir/CASASPECS-PR223-TTA14/casa6/casatestutils/nosedir/xml/test_task_visstat/nose.xml -s --disable-pytest-warnings --verbose -ra --tb=short /Users/casaci/bamboohome/xml-data/build-dir/CASASPECS-PR223-TTA14/casa6/casatestutils/nosedir/test_task_visstat/
15-Sep-2026 17:12:18
15-Sep-2026 17:12:18 Setting Working Directory: /Users/casaci/bamboohome/xml-data/build-dir/CASASPECS-PR223-TTA14/casa6/casatestutils/nosedir/test_task_exportuvfits/
15-Sep-2026 17:12:18 Test Directory: /Users/casaci/bamboohome/xml-data/build-dir/CASASPECS-PR223-TTA14/casa6/casatestutils/nosedir/test_task_exportuvfits
15-Sep-2026 17:12:18
15-Sep-2026 17:12:18 Running Command: pytest --junitxml=/Users/casaci/bamboohome/xml-data/build-dir/CASASPECS-PR223-TTA14/casa6/casatestutils/nosedir/xml/test_task_exportuvfits/nose.xml -s --disable-pytest-warnings --verbose -ra --tb=short /Users/casaci/bamboohome/xml-data/build-dir/CASASPECS-PR223-TTA14/casa6/casatestutils/nosedir/test_task_exportuvfits/
15-Sep-2026 17:12:18
15-Sep-2026 17:12:18 Setting Working Directory: /Users/casaci/bamboohome/xml-data/build-dir/CASASPECS-PR223-TTA14/casa6/casatestutils/nosedir/test_task_delmod/
15-Sep-2026 17:12:18 Test Directory: /Users/casaci/bamboohome/xml-data/build-dir/CASASPECS-PR223-TTA14/casa6/casatestutils/nosedir/test_task_delmod
15-Sep-2026 17:12:18
15-Sep-2026 17:12:18 Running Command: pytest --junitxml=/Users/casaci/bamboohome/xml-data/build-dir/CASASPECS-PR223-TTA14/casa6/casatestutils/nosedir/xml/test_task_delmod/nose.xml -s --disable-pytest-warnings --verbose -ra --tb=short /Users/casaci/bamboohome/xml-data/build-dir/CASASPECS-PR223-TTA14/casa6/casatestutils/nosedir/test_task_delmod/
15-Sep-2026 17:12:18
15-Sep-2026 17:12:18 Setting Working Directory: /Users/casaci/bamboohome/xml-data/build-dir/CASASPECS-PR223-TTA14/casa6/casatestutils/nosedir/test_task_rmtables/
15-Sep-2026 17:12:18 Test Directory: /Users/casaci/bamboohome/xml-data/build-dir/CASASPECS-PR223-TTA14/casa6/casatestutils/nosedir/test_task_rmtables
15-Sep-2026 17:12:18
15-Sep-2026 17:12:18 Running Command: pytest --junitxml=/Users/casaci/bamboohome/xml-data/build-dir/CASASPECS-PR223-TTA14/casa6/casatestutils/nosedir/xml/test_task_rmtables/nose.xml -s --disable-pytest-warnings --verbose -ra --tb=short /Users/casaci/bamboohome/xml-data/build-dir/CASASPECS-PR223-TTA14/casa6/casatestutils/nosedir/test_task_rmtables/
15-Sep-2026 17:12:18
15-Sep-2026 17:12:18 Setting Working Directory: /Users/casaci/bamboohome/xml-data/build-dir/CASASPECS-PR223-TTA14/casa6/casatestutils/nosedir/test_task_imsmooth/
15-Sep-2026 17:12:18 Test Directory: /Users/casaci/bamboohome/xml-data/build-dir/CASASPECS-PR223-TTA14/casa6/casatestutils/nosedir/test_task_imsmooth
15-Sep-2026 17:12:18
15-Sep-2026 17:12:18 Running Command: pytest --junitxml=/Users/casaci/bamboohome/xml-data/build-dir/CASASPECS-PR223-TTA14/casa6/casatestutils/nosedir/xml/test_task_imsmooth/nose.xml -s --disable-pytest-warnings --verbose -ra --tb=short /Users/casaci/bamboohome/xml-data/build-dir/CASASPECS-PR223-TTA14/casa6/casatestutils/nosedir/test_task_imsmooth/
15-Sep-2026 17:12:18
15-Sep-2026 17:12:18 Setting Working Directory: /Users/casaci/bamboohome/xml-data/build-dir/CASASPECS-PR223-TTA14/casa6/casatestutils/nosedir/test_task_immoments/
15-Sep-2026 17:12:18 Test Directory: /Users/casaci/bamboohome/xml-data/build-dir/CASASPECS-PR223-TTA14/casa6/casatestutils/nosedir/test_task_immoments
15-Sep-2026 17:12:18
15-Sep-2026 17:12:18 Running Command: pytest --junitxml=/Users/casaci/bamboohome/xml-data/build-dir/CASASPECS-PR223-TTA14/casa6/casatestutils/nosedir/xml/test_task_immoments/nose.xml -s --disable-pytest-warnings --verbose -ra --tb=short /Users/casaci/bamboohome/xml-data/build-dir/CASASPECS-PR223-TTA14/casa6/casatestutils/nosedir/test_task_immoments/
15-Sep-2026 17:12:18
15-Sep-2026 17:12:18 Setting Working Directory: /Users/casaci/bamboohome/xml-data/build-dir/CASASPECS-PR223-TTA14/casa6/casatestutils/nosedir/test_task_importmiriad/
15-Sep-2026 17:12:18 Test Directory: /Users/casaci/bamboohome/xml-data/build-dir/CASASPECS-PR223-TTA14/casa6/casatestutils/nosedir/test_task_importmiriad
15-Sep-2026 17:12:18
15-Sep-2026 17:12:18 Running Command: pytest --junitxml=/Users/casaci/bamboohome/xml-data/build-dir/CASASPECS-PR223-TTA14/casa6/casatestutils/nosedir/xml/test_task_importmiriad/nose.xml -s --disable-pytest-warnings --verbose -ra --tb=short /Users/casaci/bamboohome/xml-data/build-dir/CASASPECS-PR223-TTA14/casa6/casatestutils/nosedir/test_task_importmiriad/
15-Sep-2026 17:12:18
15-Sep-2026 17:12:18 Setting Working Directory: /Users/casaci/bamboohome/xml-data/build-dir/CASASPECS-PR223-TTA14/casa6/casatestutils/nosedir/test_task_impv/
15-Sep-2026 17:12:18 Test Directory: /Users/casaci/bamboohome/xml-data/build-dir/CASASPECS-PR223-TTA14/casa6/casatestutils/nosedir/test_task_impv
15-Sep-2026 17:12:18
15-Sep-2026 17:12:18 Running Command: pytest --junitxml=/Users/casaci/bamboohome/xml-data/build-dir/CASASPECS-PR223-TTA14/casa6/casatestutils/nosedir/xml/test_task_impv/nose.xml -s --disable-pytest-warnings --verbose -ra --tb=short /Users/casaci/bamboohome/xml-data/build-dir/CASASPECS-PR223-TTA14/casa6/casatestutils/nosedir/test_task_impv/
15-Sep-2026 17:12:18
15-Sep-2026 17:12:18 Setting Working Directory: /Users/casaci/bamboohome/xml-data/build-dir/CASASPECS-PR223-TTA14/casa6/casatestutils/nosedir/test_task_tsdimaging/
15-Sep-2026 17:12:18 Test Directory: /Users/casaci/bamboohome/xml-data/build-dir/CASASPECS-PR223-TTA14/casa6/casatestutils/nosedir/test_task_tsdimaging
15-Sep-2026 17:12:18
15-Sep-2026 17:12:18 Running Command: pytest --junitxml=/Users/casaci/bamboohome/xml-data/build-dir/CASASPECS-PR223-TTA14/casa6/casatestutils/nosedir/xml/test_task_tsdimaging/nose.xml -s --disable-pytest-warnings --verbose -ra --tb=short /Users/casaci/bamboohome/xml-data/build-dir/CASASPECS-PR223-TTA14/casa6/casatestutils/nosedir/test_task_tsdimaging/
15-Sep-2026 17:12:18
15-Sep-2026 17:12:18 Setting Working Directory: /Users/casaci/bamboohome/xml-data/build-dir/CASASPECS-PR223-TTA14/casa6/casatestutils/nosedir/test_task_flagcmd/
15-Sep-2026 17:12:18 Test Directory: /Users/casaci/bamboohome/xml-data/build-dir/CASASPECS-PR223-TTA14/casa6/casatestutils/nosedir/test_task_flagcmd
15-Sep-2026 17:12:18
15-Sep-2026 17:12:18 Running Command: pytest --junitxml=/Users/casaci/bamboohome/xml-data/build-dir/CASASPECS-PR223-TTA14/casa6/casatestutils/nosedir/xml/test_task_flagcmd/nose.xml -s --disable-pytest-warnings --verbose -ra --tb=short /Users/casaci/bamboohome/xml-data/build-dir/CASASPECS-PR223-TTA14/casa6/casatestutils/nosedir/test_task_flagcmd/
15-Sep-2026 17:12:18
15-Sep-2026 17:12:18 Setting Working Directory: /Users/casaci/bamboohome/xml-data/build-dir/CASASPECS-PR223-TTA14/casa6/casatestutils/nosedir/test_task_splattotable/
15-Sep-2026 17:12:18 Test Directory: /Users/casaci/bamboohome/xml-data/build-dir/CASASPECS-PR223-TTA14/casa6/casatestutils/nosedir/test_task_splattotable
15-Sep-2026 17:12:18
15-Sep-2026 17:12:18 Running Command: pytest --junitxml=/Users/casaci/bamboohome/xml-data/build-dir/CASASPECS-PR223-TTA14/casa6/casatestutils/nosedir/xml/test_task_splattotable/nose.xml -s --disable-pytest-warnings --verbose -ra --tb=short /Users/casaci/bamboohome/xml-data/build-dir/CASASPECS-PR223-TTA14/casa6/casatestutils/nosedir/test_task_splattotable/
15-Sep-2026 17:12:18
15-Sep-2026 17:12:18 Setting Working Directory: /Users/casaci/bamboohome/xml-data/build-dir/CASASPECS-PR223-TTA14/casa6/casatestutils/nosedir/test_task_getephemtable/
15-Sep-2026 17:12:18 Test Directory: /Users/casaci/bamboohome/xml-data/build-dir/CASASPECS-PR223-TTA14/casa6/casatestutils/nosedir/test_task_getephemtable
15-Sep-2026 17:12:18
15-Sep-2026 17:12:18 Running Command: pytest --junitxml=/Users/casaci/bamboohome/xml-data/build-dir/CASASPECS-PR223-TTA14/casa6/casatestutils/nosedir/xml/test_task_getephemtable/nose.xml -s --disable-pytest-warnings --verbose -ra --tb=short /Users/casaci/bamboohome/xml-data/build-dir/CASASPECS-PR223-TTA14/casa6/casatestutils/nosedir/test_task_getephemtable/
15-Sep-2026 17:12:18
15-Sep-2026 17:12:18 Setting Working Directory: /Users/casaci/bamboohome/xml-data/build-dir/CASASPECS-PR223-TTA14/casa6/casatestutils/nosedir/test_task_sdtimeaverage/
15-Sep-2026 17:12:18 Test Directory: /Users/casaci/bamboohome/xml-data/build-dir/CASASPECS-PR223-TTA14/casa6/casatestutils/nosedir/test_task_sdtimeaverage
15-Sep-2026 17:12:18
15-Sep-2026 17:12:18 Running Command: pytest --junitxml=/Users/casaci/bamboohome/xml-data/build-dir/CASASPECS-PR223-TTA14/casa6/casatestutils/nosedir/xml/test_task_sdtimeaverage/nose.xml -s --disable-pytest-warnings --verbose -ra --tb=short /Users/casaci/bamboohome/xml-data/build-dir/CASASPECS-PR223-TTA14/casa6/casatestutils/nosedir/test_task_sdtimeaverage/
15-Sep-2026 17:12:18
15-Sep-2026 17:12:18 Setting Working Directory: /Users/casaci/bamboohome/xml-data/build-dir/CASASPECS-PR223-TTA14/casa6/casatestutils/nosedir/test_task_importasap/
15-Sep-2026 17:12:18 Test Directory: /Users/casaci/bamboohome/xml-data/build-dir/CASASPECS-PR223-TTA14/casa6/casatestutils/nosedir/test_task_importasap
15-Sep-2026 17:12:18
15-Sep-2026 17:12:18 Running Command: pytest --junitxml=/Users/casaci/bamboohome/xml-data/build-dir/CASASPECS-PR223-TTA14/casa6/casatestutils/nosedir/xml/test_task_importasap/nose.xml -s --disable-pytest-warnings --verbose -ra --tb=short /Users/casaci/bamboohome/xml-data/build-dir/CASASPECS-PR223-TTA14/casa6/casatestutils/nosedir/test_task_importasap/
15-Sep-2026 17:12:18
15-Sep-2026 17:12:18 Setting Working Directory: /Users/casaci/bamboohome/xml-data/build-dir/CASASPECS-PR223-TTA14/casa6/casatestutils/nosedir/test_task_imval/
15-Sep-2026 17:12:18 Test Directory: /Users/casaci/bamboohome/xml-data/build-dir/CASASPECS-PR223-TTA14/casa6/casatestutils/nosedir/test_task_imval
15-Sep-2026 17:12:18
15-Sep-2026 17:12:18 Running Command: pytest --junitxml=/Users/casaci/bamboohome/xml-data/build-dir/CASASPECS-PR223-TTA14/casa6/casatestutils/nosedir/xml/test_task_imval/nose.xml -s --disable-pytest-warnings --verbose -ra --tb=short /Users/casaci/bamboohome/xml-data/build-dir/CASASPECS-PR223-TTA14/casa6/casatestutils/nosedir/test_task_imval/
15-Sep-2026 17:12:18
15-Sep-2026 17:12:18 Setting Working Directory: /Users/casaci/bamboohome/xml-data/build-dir/CASASPECS-PR223-TTA14/casa6/casatestutils/nosedir/test_task_defintent/
15-Sep-2026 17:12:18 Test Directory: /Users/casaci/bamboohome/xml-data/build-dir/CASASPECS-PR223-TTA14/casa6/casatestutils/nosedir/test_task_defintent
15-Sep-2026 17:12:18
15-Sep-2026 17:12:18 Running Command: pytest --junitxml=/Users/casaci/bamboohome/xml-data/build-dir/CASASPECS-PR223-TTA14/casa6/casatestutils/nosedir/xml/test_task_defintent/nose.xml -s --disable-pytest-warnings --verbose -ra --tb=short /Users/casaci/bamboohome/xml-data/build-dir/CASASPECS-PR223-TTA14/casa6/casatestutils/nosedir/test_task_defintent/
15-Sep-2026 17:12:18
15-Sep-2026 17:12:18 Setting Working Directory: /Users/casaci/bamboohome/xml-data/build-dir/CASASPECS-PR223-TTA14/casa6/casatestutils/nosedir/test_task_immath/
15-Sep-2026 17:12:18 Test Directory: /Users/casaci/bamboohome/xml-data/build-dir/CASASPECS-PR223-TTA14/casa6/casatestutils/nosedir/test_task_immath
15-Sep-2026 17:12:18
15-Sep-2026 17:12:18 Running Command: pytest --junitxml=/Users/casaci/bamboohome/xml-data/build-dir/CASASPECS-PR223-TTA14/casa6/casatestutils/nosedir/xml/test_task_immath/nose.xml -s --disable-pytest-warnings --verbose -ra --tb=short /Users/casaci/bamboohome/xml-data/build-dir/CASASPECS-PR223-TTA14/casa6/casatestutils/nosedir/test_task_immath/
15-Sep-2026 17:12:18 Finished task 'Test wheel' with result: Success
15-Sep-2026 17:12:18 Starting task 'Parse tests' of type 'com.atlassian.bamboo.plugins.testresultparser:task.testresultparser.junit'
15-Sep-2026 17:12:18 Parsing test results under /Users/casaci/bamboohome/xml-data/build-dir/CASASPECS-PR223-TTA14...
15-Sep-2026 17:12:18 Failing task since 1 failing test cases were found.
15-Sep-2026 17:12:18 Finished task 'Parse tests' with result: Failed
15-Sep-2026 17:12:18 Running post build plugin 'Docker Container Cleanup'
15-Sep-2026 17:12:18 Running post build plugin 'NCover Results Collector'
15-Sep-2026 17:12:18 Running post build plugin 'Build Results Label Collector'
15-Sep-2026 17:12:18 Running post build plugin 'Clover Results Collector'
15-Sep-2026 17:12:18 Running post build plugin 'npm Cache Cleanup'
15-Sep-2026 17:12:18 Running post build plugin 'Artifact Copier'
15-Sep-2026 17:12:18 Publishing an artifact: macOS 15 ARM py3.12 tasks wheel
15-Sep-2026 17:12:19 Finished publishing of artifact Non required job artifact Http Compression On : [macOS 15 ARM py3.12 tasks wheel], patterns: [casatasks*.whl] anchored at: [wheeldirectory/] in 144.2 ms
15-Sep-2026 17:12:19 Finalising the build...
15-Sep-2026 17:12:19 Stopping timer.
15-Sep-2026 17:12:19 Build CASASPECS-PR223-TTA14-1 completed.
15-Sep-2026 17:12:19 Running on server: post build plugin 'Build Hanging Detection Configuration'
15-Sep-2026 17:12:19 Running on server: post build plugin 'NCover Results Collector'
15-Sep-2026 17:12:19 Running on server: post build plugin 'Build Labeller'
15-Sep-2026 17:12:19 Running on server: post build plugin 'Clover Delta Calculator'
15-Sep-2026 17:12:19 Running on server: post build plugin 'Maven Dependencies Postprocessor'
15-Sep-2026 17:12:19 All post build plugins have finished
15-Sep-2026 17:12:19 Generating build results summary...
15-Sep-2026 17:12:20 Saving build results to disk...
15-Sep-2026 17:12:20 Store variable context...
15-Sep-2026 17:12:20 Finished building CASASPECS-PR223-TTA14-1.