Build: #1 failed First build for this plan

Test results

  • 8,753 tests in total
  • 2 tests failed
  • 2 failures are new
  • 297 tests were quarantined / skipped
  • 599 minutes taken in total.
New test failures 2
Status Test View job Duration
Collapse Failed test_task_tclean test_widefield.test_widefield_mvc_squint_awp2
Test Tasks Many Linux 2.28 Python3.12 34 mins
AssertionError: False is not true
test_task_tclean.py:4341: in test_widefield_mvc_squint_awp2
    self.assertTrue(self.check_final(report))
E   AssertionError: False is not true
Collapse Failed test_task_tclean test_widefield.test_widefield_mvc_squint_awp2
Test Tasks macOS15 4 mins
AssertionError: False is not true
test_task_tclean.py:4341: in test_widefield_mvc_squint_awp2
    self.assertTrue(self.check_final(report))
E   AssertionError: False is not true
Skipped tests 100
Status Test Failing since View job
Skipped test_flaghelper test_flaghelper.test_evaluateParameters2
Test Tasks Many Linux 2.28 Python3.12
Skipped test_flaghelper test_flaghelper.test_evaluateParameters2
Test Tasks macOS15
Skipped test_task_cvel cvel_test.test29
Test Tasks Many Linux 2.28 Python3.12
Skipped test_task_cvel cvel_test.test19
Test Tasks Many Linux 2.28 Python3.12
Skipped test_task_cvel cvel_test.test28
Test Tasks Many Linux 2.28 Python3.12
Skipped test_task_cvel cvel_test.test47
Test Tasks Many Linux 2.28 Python3.12
Skipped test_task_cvel cvel_test.test24
Test Tasks Many Linux 2.28 Python3.12
Skipped test_task_cvel cvel_test.test45
Test Tasks Many Linux 2.28 Python3.12
Skipped test_task_cvel cvel_test.test44
Test Tasks Many Linux 2.28 Python3.12
Skipped test_task_cvel cvel_test.test22
Test Tasks Many Linux 2.28 Python3.12
Skipped test_task_cvel cvel_test.test43
Test Tasks Many Linux 2.28 Python3.12
Skipped test_task_cvel cvel_test.test20
Test Tasks Many Linux 2.28 Python3.12
Skipped test_task_cvel cvel_test.test20
Test Tasks macOS15
Skipped test_task_cvel cvel_test.test29
Test Tasks macOS15
Skipped test_task_cvel cvel_test.test19
Test Tasks macOS15
Skipped test_task_cvel cvel_test.test28
Test Tasks macOS15
Skipped test_task_cvel cvel_test.test47
Test Tasks macOS15
Skipped test_task_cvel cvel_test.test24
Test Tasks macOS15
Skipped test_task_cvel cvel_test.test45
Test Tasks macOS15
Skipped test_task_cvel cvel_test.test44
Test Tasks macOS15
Skipped test_task_cvel cvel_test.test22
Test Tasks macOS15
Skipped test_task_cvel cvel_test.test43
Test Tasks macOS15
Skipped test_task_deconvolve test_mtmfsimgval.test_mtmfsimgval_startmodel_axesmismatch
Test Tasks Many Linux 2.28 Python3.12
Skipped test_task_deconvolve test_imgval.test_imgval_startmodel_axesmismatch
Test Tasks Many Linux 2.28 Python3.12
Skipped test_task_exportasdm exportasdm_test.test10
Test Tasks Many Linux 2.28 Python3.12
Skipped test_task_exportasdm exportasdm_test.test10
Test Tasks macOS15
Skipped test_task_flagdata test_auto_methods_display.test_display_clip_timeavg_chanavg
Test Tasks macOS15
Skipped test_task_flagdata test_auto_methods_display.test_display_tfcrop_timeavg_chanavg_extendflags
Test Tasks macOS15
Skipped test_task_flagdata test_auto_methods_display.test_display_rflag_timeavg_chanavg_extendflags
Test Tasks macOS15
Skipped test_task_flagdata test_auto_methods_display.test_display_all_auto_timeavg_chanavg_extendflags_list_antint
Test Tasks macOS15
Skipped test_task_flagdata test_auto_methods_display.test_display_rflag_timeavg_chanavg_extendflags
Test Tasks Many Linux 2.28 Python3.12
Skipped test_task_flagdata test_auto_methods_display.test_display_tfcrop_timeavg_chanavg_extendflags
Test Tasks Many Linux 2.28 Python3.12
Skipped test_task_flagdata test_auto_methods_display.test_display_all_auto_timeavg_chanavg_extendflags_list_antint
Test Tasks Many Linux 2.28 Python3.12
Skipped test_task_flagdata test_auto_methods_display.test_display_clip_timeavg_chanavg
Test Tasks Many Linux 2.28 Python3.12
Skipped test_task_mstransform test_channelAverageByDefault.test_channelAverageByDefaultInVelocityMode
Test Tasks Many Linux 2.28 Python3.12
Skipped test_task_mstransform test_spectrum_transformations_median.test_spw_separation_median_model
Test Tasks Many Linux 2.28 Python3.12
Skipped test_task_mstransform test_spectrum_transformations_median.test_timeavg_median_model
Test Tasks Many Linux 2.28 Python3.12
Skipped test_task_mstransform test_spectrum_transformations_median.test_timeavg_median_corrected
Test Tasks Many Linux 2.28 Python3.12
Skipped test_task_mstransform test_spectrum_transformations_median.test_timeavg_median_data
Test Tasks Many Linux 2.28 Python3.12
Skipped test_task_mstransform test_spectrum_transformations_median.test_chanavg_median_data
Test Tasks Many Linux 2.28 Python3.12
Skipped test_task_mstransform test_spectrum_transformations_weight_zero_flag_set.test_timeavg_chanavg_weight_zero_flag_set_corrected
Test Tasks Many Linux 2.28 Python3.12
Skipped test_task_mstransform test_spectrum_transformations_median.test_timeavg_chanavg_median_data
Test Tasks Many Linux 2.28 Python3.12
Skipped test_task_mstransform test_radial_velocity_correction_largetimerange.test_descending_freq
Test Tasks Many Linux 2.28 Python3.12
Skipped test_task_mstransform test_spectrum_transformations_median.test_chanavg_median_model
Test Tasks Many Linux 2.28 Python3.12
Skipped test_task_mstransform test_spectrum_transformations_weight_zero_flag_set.test_chanavg_weight_zero_flag_set_corrected
Test Tasks Many Linux 2.28 Python3.12
Skipped test_task_mstransform test_regridms_multiple_spws.test_combine_regrid_fftshift
Test Tasks Many Linux 2.28 Python3.12
Skipped test_task_mstransform test_spectrum_transformations_median.test_timeavg_chanavg_median_all
Test Tasks Many Linux 2.28 Python3.12
Skipped test_task_mstransform test_spectrum_transformations_median.test_timeavg_median_all
Test Tasks Many Linux 2.28 Python3.12
Skipped test_task_mstransform test_spectrum_transformations_median.test_spw_separation_median_all
Test Tasks Many Linux 2.28 Python3.12
Skipped test_task_mstransform test_spectrum_transformations_weight_zero_flag_set.test_timeavg_weight_zero_flag_set_corrected
Test Tasks Many Linux 2.28 Python3.12
Skipped test_task_mstransform test_Shape.test_shape2
Test Tasks Many Linux 2.28 Python3.12
Skipped test_task_mstransform test_spectrum_transformations_median.test_timeavg_chanavg_median_model
Test Tasks Many Linux 2.28 Python3.12
Skipped test_task_mstransform test_spectrum_transformations_median.test_chanavg_median_corrected
Test Tasks Many Linux 2.28 Python3.12
Skipped test_task_mstransform test_spectrum_transformations_median.test_timeavg_chanavg_median_corrected
Test Tasks Many Linux 2.28 Python3.12
Skipped test_task_mstransform test_spectrum_transformations_median.test_chanavg_median_all
Test Tasks Many Linux 2.28 Python3.12
Skipped test_task_mstransform test_WeightSpectrum.test_fillWeightSpectrumFromWeight
Test Tasks Many Linux 2.28 Python3.12
Skipped test_task_mstransform test_radial_velocity_correction_largetimerange.test_ascending_freq
Test Tasks Many Linux 2.28 Python3.12
Skipped test_task_mstransform test_spectrum_transformations_median.test_spw_separation_median_corrected
Test Tasks Many Linux 2.28 Python3.12
Skipped test_task_mstransform test_spectrum_transformations_median.test_spw_separation_median_data
Test Tasks Many Linux 2.28 Python3.12
Skipped test_task_mstransform test_spectrum_transformations_median.test_spw_separation_median_model
Test Tasks macOS15
Skipped test_task_mstransform test_spectrum_transformations_weight_zero_flag_set.test_timeavg_chanavg_weight_zero_flag_set_corrected
Test Tasks macOS15
Skipped test_task_mstransform test_radial_velocity_correction_largetimerange.test_ascending_freq
Test Tasks macOS15
Skipped test_task_mstransform test_spectrum_transformations_median.test_timeavg_chanavg_median_model
Test Tasks macOS15
Skipped test_task_mstransform test_spectrum_transformations_median.test_chanavg_median_data
Test Tasks macOS15
Skipped test_task_mstransform test_spectrum_transformations_median.test_chanavg_median_model
Test Tasks macOS15
Skipped test_task_mstransform test_spectrum_transformations_weight_zero_flag_set.test_timeavg_weight_zero_flag_set_corrected
Test Tasks macOS15
Skipped test_task_mstransform test_regridms_multiple_spws.test_combine_regrid_fftshift
Test Tasks macOS15
Skipped test_task_mstransform test_Shape.test_shape2
Test Tasks macOS15
Skipped test_task_mstransform test_spectrum_transformations_median.test_spw_separation_median_data
Test Tasks macOS15
Skipped test_task_mstransform test_spectrum_transformations_median.test_timeavg_chanavg_median_data
Test Tasks macOS15
Skipped test_task_mstransform test_spectrum_transformations_median.test_spw_separation_median_corrected
Test Tasks macOS15
Skipped test_task_mstransform test_spectrum_transformations_median.test_timeavg_median_data
Test Tasks macOS15
Skipped test_task_mstransform test_spectrum_transformations_weight_zero_flag_set.test_chanavg_weight_zero_flag_set_corrected
Test Tasks macOS15
Skipped test_task_mstransform test_spectrum_transformations_median.test_chanavg_median_corrected
Test Tasks macOS15
Skipped test_task_mstransform test_radial_velocity_correction_largetimerange.test_descending_freq
Test Tasks macOS15
Skipped test_task_mstransform test_WeightSpectrum.test_fillWeightSpectrumFromWeight
Test Tasks macOS15
Skipped test_task_mstransform test_spectrum_transformations_median.test_timeavg_chanavg_median_all
Test Tasks macOS15
Skipped test_task_mstransform test_spectrum_transformations_median.test_timeavg_median_model
Test Tasks macOS15
Skipped test_task_mstransform test_spectrum_transformations_median.test_timeavg_chanavg_median_corrected
Test Tasks macOS15
Skipped test_task_mstransform test_channelAverageByDefault.test_channelAverageByDefaultInVelocityMode
Test Tasks macOS15
Skipped test_task_mstransform test_spectrum_transformations_median.test_timeavg_median_all
Test Tasks macOS15
Skipped test_task_mstransform test_spectrum_transformations_median.test_chanavg_median_all
Test Tasks macOS15
Skipped test_task_mstransform test_spectrum_transformations_median.test_timeavg_median_corrected
Test Tasks macOS15
Skipped test_task_mstransform test_spectrum_transformations_median.test_spw_separation_median_all
Test Tasks macOS15
Skipped test_task_mstransform_mms test_mms_transformations.test_shape3
Test Tasks macOS15
Skipped test_task_mstransform_mms test_mms_transformations.test_shape3
Test Tasks Many Linux 2.28 Python3.12
Skipped test_task_msuvbinflag test_msuvbinflag.test_regionalMean_method
Test Tasks Many Linux 2.28 Python3.12
Skipped test_task_msuvbinflag test_msuvbinflag.test_gradient_method
Test Tasks Many Linux 2.28 Python3.12
Skipped test_task_msuvbinflag test_msuvbinflag.test_gradient_method
Test Tasks macOS15
Skipped test_task_msuvbinflag test_msuvbinflag.test_regionalMean_method
Test Tasks macOS15
Skipped test_task_predictcomp predictcomp_test.test_predicted_visplot
Test Tasks macOS15
Skipped test_task_predictcomp predictcomp_test.test_predicted_visplot
Test Tasks Many Linux 2.28 Python3.12
Skipped test_task_sdatmcor test_sdatmcor.test_set_omp_num_threads
Test Tasks macOS15
Skipped test_task_sdatmcor test_sdatmcor.test_set_omp_num_threads_zero
Test Tasks macOS15
Skipped test_task_sdatmcor test_sdatmcor.test_unset_omp_num_threads
Test Tasks macOS15
Skipped test_task_sdbaseline sdbaseline_bloutputTest.test020
Test Tasks macOS15
Skipped test_task_sdbaseline sdbaseline_bloutputTest.test021
Test Tasks macOS15
Skipped test_task_sdbaseline sdbaseline_bloutputTest.test030
Test Tasks macOS15
Skipped test_task_sdbaseline sdbaseline_multi_IF_test.test200
Test Tasks macOS15
Skipped test_task_sdbaseline sdbaseline_multi_IF_test.test200
Test Tasks Many Linux 2.28 Python3.12