Build: #1 failed

Job: Test Tasks Many Linux 2.28 Python3.12 failed

Test results

  • 3,813 tests in total
  • 62 tests failed
  • 62 failures are new
  • 255 tests were quarantined / skipped
  • 374 minutes taken in total.

Build 1 has the following 62 errors: 62 new failure(s) occurred since the previous build.

New test failures 62
Status Test Duration
Collapse Failed test_task_imregrid imregrid_test.test_history
< 1 sec
TypeError: only 0-dimensional arrays can be converted to Python scalars
test_task_imregrid.py:943: in test_history
    imregrid(
/usr/local/lib/python3.12/site-packages/casatasks/imregrid.py:331: in __call__
    task_result = _imregrid_t( _pc.document['imagename'], _pc.document['template'], _pc.document['output'], _pc.document['asvelocity'], _pc.document['axes'], _pc.document['shape'], _pc.document['interpolation'], _pc.document['decimate'], _pc.document['replicate'], _pc.document['overwrite'] )
                  ^^^^^^^^^^^^^^^^^^^^^^^^^^^^^^^^^^^^^^^^^^^^^^^^^^^^^^^^^^^^^^^^^^^^^^^^^^^^^^^^^^^^^^^^^^^^^^^^^^^^^^^^^^^^^^^^^^^^^^^^^^^^^^^^^^^^^^^^^^^^^^^^^^^^^^^^^^^^^^^^^^^^^^^^^^^^^^^^^^^^^^^^^^^^^^^^^^^^^^^^^^^^^^^^^^^^^^^^^^^^^^^^^^^^^^^^^^^^^^^^^^^^^^^^^^^^^^^^^^^^^^^^^^^^^^^^^^
/usr/local/lib/python3.12/site-packages/casatasks/private/task_imregrid.py:42: in imregrid
    outia = _imregrid_to_new_ref_frame(
(4 more lines...)
Collapse Failed test_task_imregrid imregrid_test.test_ref_code_preserves_position
< 1 sec
TypeError: only 0-dimensional arrays can be converted to Python scalars
test_task_imregrid.py:413: in test_ref_code_preserves_position
    imregrid(gim,template="GALACTIC", output=gal)
/usr/local/lib/python3.12/site-packages/casatasks/imregrid.py:331: in __call__
    task_result = _imregrid_t( _pc.document['imagename'], _pc.document['template'], _pc.document['output'], _pc.document['asvelocity'], _pc.document['axes'], _pc.document['shape'], _pc.document['interpolation'], _pc.document['decimate'], _pc.document['replicate'], _pc.document['overwrite'] )
                  ^^^^^^^^^^^^^^^^^^^^^^^^^^^^^^^^^^^^^^^^^^^^^^^^^^^^^^^^^^^^^^^^^^^^^^^^^^^^^^^^^^^^^^^^^^^^^^^^^^^^^^^^^^^^^^^^^^^^^^^^^^^^^^^^^^^^^^^^^^^^^^^^^^^^^^^^^^^^^^^^^^^^^^^^^^^^^^^^^^^^^^^^^^^^^^^^^^^^^^^^^^^^^^^^^^^^^^^^^^^^^^^^^^^^^^^^^^^^^^^^^^^^^^^^^^^^^^^^^^^^^^^^^^^^^^^^^^
/usr/local/lib/python3.12/site-packages/casatasks/private/task_imregrid.py:42: in imregrid
    outia = _imregrid_to_new_ref_frame(
(4 more lines...)
Collapse Failed test_task_sdfixscan SomeClass.test_task_sdfixscan
< 1 sec
Aborted
Aborted
Collapse Failed test_task_sdimaging sdimaging_autocoord.test402
< 1 sec
TypeError: %d format: a real number is required, not numpy.ndarray
test_task_sdimaging.py:1251: in test402
    self.run_test(self.task_param, outshape, dirax)
test_task_sdimaging.py:1228: in run_test
    res = sdimaging(**task_param)
          ^^^^^^^^^^^^^^^^^^^^^^^
/usr/local/lib/python3.12/site-packages/casatasks/sdimaging.py:365: in __call__
    task_result = _sdimaging_t( _pc.document['infiles'], _pc.document['outfile'], _pc.document['overwrite'], _pc.document['field'], _pc.document['spw'], _pc.document['antenna'], _pc.document['scan'], _pc.document['intent'], _pc.document['mode'], _pc.document['nchan'], _pc.document['start'], _pc.document['width'], _pc.document['veltype'], _pc.document['outframe'], _pc.document['gridfunction'], _pc.document['convsupport'], _pc.document['truncate'], _pc.document['gwidth'], _pc.document['jwidth'], _pc.document['imsize'], _pc.document['cell'], _pc.document['phasecenter'], _pc.document['projection'], _pc.document['ephemsrcname'], _pc.document['pointingcolumn'], _pc.document['restfreq'], _pc.document['stokes'], _pc.document['minweight'], _pc.document['brightnessunit'], _pc.document['clipminmax'], _pc.document['enablecache'], _pc.document['convertfirst'], _pc.document['interpolation'] )
(14 more lines...)
Collapse Failed test_task_sdimaging sdimaging_autocoord.test405
< 1 sec
TypeError: %d format: a real number is required, not numpy.ndarray
test_task_sdimaging.py:1274: in test405
    self.run_test(self.task_param, outshape, dirax)
test_task_sdimaging.py:1228: in run_test
    res = sdimaging(**task_param)
          ^^^^^^^^^^^^^^^^^^^^^^^
/usr/local/lib/python3.12/site-packages/casatasks/sdimaging.py:365: in __call__
    task_result = _sdimaging_t( _pc.document['infiles'], _pc.document['outfile'], _pc.document['overwrite'], _pc.document['field'], _pc.document['spw'], _pc.document['antenna'], _pc.document['scan'], _pc.document['intent'], _pc.document['mode'], _pc.document['nchan'], _pc.document['start'], _pc.document['width'], _pc.document['veltype'], _pc.document['outframe'], _pc.document['gridfunction'], _pc.document['convsupport'], _pc.document['truncate'], _pc.document['gwidth'], _pc.document['jwidth'], _pc.document['imsize'], _pc.document['cell'], _pc.document['phasecenter'], _pc.document['projection'], _pc.document['ephemsrcname'], _pc.document['pointingcolumn'], _pc.document['restfreq'], _pc.document['stokes'], _pc.document['minweight'], _pc.document['brightnessunit'], _pc.document['clipminmax'], _pc.document['enablecache'], _pc.document['convertfirst'], _pc.document['interpolation'] )
(14 more lines...)
Collapse Failed test_task_sdimaging sdimaging_test0.test005
< 1 sec
AssertionError: -1 == -1 : Unexpected exception was thrown: %d format: a real number is required, not numpy.ndarray
test_task_sdimaging.py:455: in test005
    sdimaging(infiles=self.rawfile, stokes='BAD', intent='', outfile=self.outfile)
/usr/local/lib/python3.12/site-packages/casatasks/sdimaging.py:365: in __call__
    task_result = _sdimaging_t( _pc.document['infiles'], _pc.document['outfile'], _pc.document['overwrite'], _pc.document['field'], _pc.document['spw'], _pc.document['antenna'], _pc.document['scan'], _pc.document['intent'], _pc.document['mode'], _pc.document['nchan'], _pc.document['start'], _pc.document['width'], _pc.document['veltype'], _pc.document['outframe'], _pc.document['gridfunction'], _pc.document['convsupport'], _pc.document['truncate'], _pc.document['gwidth'], _pc.document['jwidth'], _pc.document['imsize'], _pc.document['cell'], _pc.document['phasecenter'], _pc.document['projection'], _pc.document['ephemsrcname'], _pc.document['pointingcolumn'], _pc.document['restfreq'], _pc.document['stokes'], _pc.document['minweight'], _pc.document['brightnessunit'], _pc.document['clipminmax'], _pc.document['enablecache'], _pc.document['convertfirst'], _pc.document['interpolation'] )
                  ^^^^^^^^^^^^^^^^^^^^^^^^^^^^^^^^^^^^^^^^^^^^^^^^^^^^^^^^^^^^^^^^^^^^^^^^^^^^^^^^^^^^^^^^^^^^^^^^^^^^^^^^^^^^^^^^^^^^^^^^^^^^^^^^^^^^^^^^^^^^^^^^^^^^^^^^^^^^^^^^^^^^^^^^^^^^^^^^^^^^^^^^^^^^^^^^^^^^^^^^^^^^^^^^^^^^^^^^^^^^^^^^^^^^^^^^^^^^^^^^^^^^^^^^^^^^^^^^^^^^^^^^^^^^^^^^^^^^^^^^^^^^^^^^^^^^^^^^^^^^^^^^^^^^^^^^^^^^^^^^^^^^^^^^^^^^^^^^^^^^^^^^^^^^^^^^^^^^^^^^^^^^^^^^^^^^^^^^^^^^^^^^^^^^^^^^^^^^^^^^^^^^^^^^^^^^^^^^^^^^^^^^^^^^^^^^^^^^^^^^^^^^^^^^^^^^^^^^^^^^^^^^^^^^^^^^^^^^^^^^^^^^^^^^^^^^^^^^^^^^^^^^^^^^^^^^^^^^^^^^^^^^^^^^^^^^^^^^^^^^^^^^^^^^^^^^^^^^^^^^^^^^^^^^^^^^^^^^^^^^^^^^^^^^^^^^^^^^^^^^^^^^^^^^^^^^^^^^^^^^^^^^^^^^^^^^^^^^^^^^^^^^^^^^^^^^^^^^^^^^^^^^^^^^^^^^^^^^^^^^^^^^^^^^^^^^^^^^^^^^^^^^^^^^^^^^^^^^^^^^^^^^^^^^^^^^^^^^^^^^^^^^^^^^^^^^^^^^^^^^^^^^^^^^^^^^^^^^^^^^^^^^^^^^^^^^^^^^^^^^^^^^^^^^^^^^^^^^^^^^^^^^^^^^^^^^^^^^^^^^^^^^^^^^^^^^^^^^^^^^^^^^^^^^^^^^^
/usr/local/lib/python3.12/site-packages/casatasks/private/sdutil.py:129: in wrapper
    retval = func(*args, **kwargs)
(16 more lines...)
Collapse Failed test_task_sdimaging sdimaging_test_mapextent.test_azel_pointing
< 1 sec
TypeError: %d format: a real number is required, not numpy.ndarray
test_task_sdimaging.py:2875: in test_azel_pointing
    self.run_test(infiles=self.infiles_azel)
test_task_sdimaging.py:2828: in run_test
    status = sdimaging(**self.param)
             ^^^^^^^^^^^^^^^^^^^^^^^
/usr/local/lib/python3.12/site-packages/casatasks/sdimaging.py:365: in __call__
    task_result = _sdimaging_t( _pc.document['infiles'], _pc.document['outfile'], _pc.document['overwrite'], _pc.document['field'], _pc.document['spw'], _pc.document['antenna'], _pc.document['scan'], _pc.document['intent'], _pc.document['mode'], _pc.document['nchan'], _pc.document['start'], _pc.document['width'], _pc.document['veltype'], _pc.document['outframe'], _pc.document['gridfunction'], _pc.document['convsupport'], _pc.document['truncate'], _pc.document['gwidth'], _pc.document['jwidth'], _pc.document['imsize'], _pc.document['cell'], _pc.document['phasecenter'], _pc.document['projection'], _pc.document['ephemsrcname'], _pc.document['pointingcolumn'], _pc.document['restfreq'], _pc.document['stokes'], _pc.document['minweight'], _pc.document['brightnessunit'], _pc.document['clipminmax'], _pc.document['enablecache'], _pc.document['convertfirst'], _pc.document['interpolation'] )
(14 more lines...)
Collapse Failed test_task_sdimaging sdimaging_test_mapextent.test_ephemeris
2 secs
TypeError: %d format: a real number is required, not numpy.ndarray
test_task_sdimaging.py:2900: in test_ephemeris
    self.run_test(infiles=self.infiles_ephem, ephemsrcname='Uranus', restfreq='230GHz')
test_task_sdimaging.py:2828: in run_test
    status = sdimaging(**self.param)
             ^^^^^^^^^^^^^^^^^^^^^^^
/usr/local/lib/python3.12/site-packages/casatasks/sdimaging.py:365: in __call__
    task_result = _sdimaging_t( _pc.document['infiles'], _pc.document['outfile'], _pc.document['overwrite'], _pc.document['field'], _pc.document['spw'], _pc.document['antenna'], _pc.document['scan'], _pc.document['intent'], _pc.document['mode'], _pc.document['nchan'], _pc.document['start'], _pc.document['width'], _pc.document['veltype'], _pc.document['outframe'], _pc.document['gridfunction'], _pc.document['convsupport'], _pc.document['truncate'], _pc.document['gwidth'], _pc.document['jwidth'], _pc.document['imsize'], _pc.document['cell'], _pc.document['phasecenter'], _pc.document['projection'], _pc.document['ephemsrcname'], _pc.document['pointingcolumn'], _pc.document['restfreq'], _pc.document['stokes'], _pc.document['minweight'], _pc.document['brightnessunit'], _pc.document['clipminmax'], _pc.document['enablecache'], _pc.document['convertfirst'], _pc.document['interpolation'] )
(14 more lines...)
Collapse Failed test_task_sdimaging sdimaging_test_polflag.test_i
< 1 sec
TypeError: %d format: a real number is required, not numpy.ndarray
test_task_sdimaging.py:2450: in test_i
    self.run_test(self.task_param, refstats, out_shape, atol=1.e-5)
test_task_sdimaging.py:2434: in run_test
    self.res = sdimaging(**task_param)
               ^^^^^^^^^^^^^^^^^^^^^^^
/usr/local/lib/python3.12/site-packages/casatasks/sdimaging.py:365: in __call__
    task_result = _sdimaging_t( _pc.document['infiles'], _pc.document['outfile'], _pc.document['overwrite'], _pc.document['field'], _pc.document['spw'], _pc.document['antenna'], _pc.document['scan'], _pc.document['intent'], _pc.document['mode'], _pc.document['nchan'], _pc.document['start'], _pc.document['width'], _pc.document['veltype'], _pc.document['outframe'], _pc.document['gridfunction'], _pc.document['convsupport'], _pc.document['truncate'], _pc.document['gwidth'], _pc.document['jwidth'], _pc.document['imsize'], _pc.document['cell'], _pc.document['phasecenter'], _pc.document['projection'], _pc.document['ephemsrcname'], _pc.document['pointingcolumn'], _pc.document['restfreq'], _pc.document['stokes'], _pc.document['minweight'], _pc.document['brightnessunit'], _pc.document['clipminmax'], _pc.document['enablecache'], _pc.document['convertfirst'], _pc.document['interpolation'] )
(14 more lines...)
Collapse Failed test_task_sdimaging sdimaging_test_polflag.test_xx
< 1 sec
TypeError: %d format: a real number is required, not numpy.ndarray
test_task_sdimaging.py:2462: in test_xx
    self.run_test(self.task_param, refstats, out_shape, atol=1.e-5)
test_task_sdimaging.py:2434: in run_test
    self.res = sdimaging(**task_param)
               ^^^^^^^^^^^^^^^^^^^^^^^
/usr/local/lib/python3.12/site-packages/casatasks/sdimaging.py:365: in __call__
    task_result = _sdimaging_t( _pc.document['infiles'], _pc.document['outfile'], _pc.document['overwrite'], _pc.document['field'], _pc.document['spw'], _pc.document['antenna'], _pc.document['scan'], _pc.document['intent'], _pc.document['mode'], _pc.document['nchan'], _pc.document['start'], _pc.document['width'], _pc.document['veltype'], _pc.document['outframe'], _pc.document['gridfunction'], _pc.document['convsupport'], _pc.document['truncate'], _pc.document['gwidth'], _pc.document['jwidth'], _pc.document['imsize'], _pc.document['cell'], _pc.document['phasecenter'], _pc.document['projection'], _pc.document['ephemsrcname'], _pc.document['pointingcolumn'], _pc.document['restfreq'], _pc.document['stokes'], _pc.document['minweight'], _pc.document['brightnessunit'], _pc.document['clipminmax'], _pc.document['enablecache'], _pc.document['convertfirst'], _pc.document['interpolation'] )
(14 more lines...)
Collapse Failed test_task_sdimaging sdimaging_test_polflag.test_xxyy
< 1 sec
TypeError: %d format: a real number is required, not numpy.ndarray
test_task_sdimaging.py:2486: in test_xxyy
    self.run_test(self.task_param, refstats, out_shape, atol=1.e-5)
test_task_sdimaging.py:2434: in run_test
    self.res = sdimaging(**task_param)
               ^^^^^^^^^^^^^^^^^^^^^^^
/usr/local/lib/python3.12/site-packages/casatasks/sdimaging.py:365: in __call__
    task_result = _sdimaging_t( _pc.document['infiles'], _pc.document['outfile'], _pc.document['overwrite'], _pc.document['field'], _pc.document['spw'], _pc.document['antenna'], _pc.document['scan'], _pc.document['intent'], _pc.document['mode'], _pc.document['nchan'], _pc.document['start'], _pc.document['width'], _pc.document['veltype'], _pc.document['outframe'], _pc.document['gridfunction'], _pc.document['convsupport'], _pc.document['truncate'], _pc.document['gwidth'], _pc.document['jwidth'], _pc.document['imsize'], _pc.document['cell'], _pc.document['phasecenter'], _pc.document['projection'], _pc.document['ephemsrcname'], _pc.document['pointingcolumn'], _pc.document['restfreq'], _pc.document['stokes'], _pc.document['minweight'], _pc.document['brightnessunit'], _pc.document['clipminmax'], _pc.document['enablecache'], _pc.document['convertfirst'], _pc.document['interpolation'] )
(14 more lines...)
Collapse Failed test_task_sdimaging sdimaging_test_polflag.test_yy
< 1 sec
TypeError: %d format: a real number is required, not numpy.ndarray
test_task_sdimaging.py:2474: in test_yy
    self.run_test(self.task_param, refstats, out_shape, atol=1.e-5)
test_task_sdimaging.py:2434: in run_test
    self.res = sdimaging(**task_param)
               ^^^^^^^^^^^^^^^^^^^^^^^
/usr/local/lib/python3.12/site-packages/casatasks/sdimaging.py:365: in __call__
    task_result = _sdimaging_t( _pc.document['infiles'], _pc.document['outfile'], _pc.document['overwrite'], _pc.document['field'], _pc.document['spw'], _pc.document['antenna'], _pc.document['scan'], _pc.document['intent'], _pc.document['mode'], _pc.document['nchan'], _pc.document['start'], _pc.document['width'], _pc.document['veltype'], _pc.document['outframe'], _pc.document['gridfunction'], _pc.document['convsupport'], _pc.document['truncate'], _pc.document['gwidth'], _pc.document['jwidth'], _pc.document['imsize'], _pc.document['cell'], _pc.document['phasecenter'], _pc.document['projection'], _pc.document['ephemsrcname'], _pc.document['pointingcolumn'], _pc.document['restfreq'], _pc.document['stokes'], _pc.document['minweight'], _pc.document['brightnessunit'], _pc.document['clipminmax'], _pc.document['enablecache'], _pc.document['convertfirst'], _pc.document['interpolation'] )
(14 more lines...)
Collapse Failed test_task_setjy test_MultipleObservations.test2_MultipleObservationNewModel
< 1 sec
TypeError: only 0-dimensional arrays can be converted to Python scalars
test_task_setjy.py:941: in test2_MultipleObservationNewModel
    sjran = setjy(self.inpms, field='Titan', spw='',
/usr/local/lib/python3.12/site-packages/casatasks/setjy.py:416: in __call__
    task_result = _setjy_t( _pc.document['vis'], _pc.document['field'], _pc.document['spw'], _pc.document['selectdata'], _pc.document['timerange'], _pc.document['scan'], _pc.document['intent'], _pc.document['observation'], _pc.document['scalebychan'], _pc.document['standard'], _pc.document['model'], _pc.document['listmodels'], _pc.document['fluxdensity'], _pc.document['spix'], _pc.document['reffreq'], _pc.document['polindex'], _pc.document['polangle'], _pc.document['rotmeas'], _pc.document['fluxdict'], _pc.document['useephemdir'], _pc.document['interpolation'], _pc.document['usescratch'], _pc.document['ismms'] )
                  ^^^^^^^^^^^^^^^^^^^^^^^^^^^^^^^^^^^^^^^^^^^^^^^^^^^^^^^^^^^^^^^^^^^^^^^^^^^^^^^^^^^^^^^^^^^^^^^^^^^^^^^^^^^^^^^^^^^^^^^^^^^^^^^^^^^^^^^^^^^^^^^^^^^^^^^^^^^^^^^^^^^^^^^^^^^^^^^^^^^^^^^^^^^^^^^^^^^^^^^^^^^^^^^^^^^^^^^^^^^^^^^^^^^^^^^^^^^^^^^^^^^^^^^^^^^^^^^^^^^^^^^^^^^^^^^^^^^^^^^^^^^^^^^^^^^^^^^^^^^^^^^^^^^^^^^^^^^^^^^^^^^^^^^^^^^^^^^^^^^^^^^^^^^^^^^^^^^^^^^^^^^^^^^^^^^^^^^^^^^^^^^^^^^^^^^^^^^^^^^^^^^^^^^^^^^^^^^^^^^^^^^^^^^^^^^^^^^^^^^^^^^^^^^^^^^^^^^^^^^^^^^^^^^^^^^^^^^^^^^^^^^^^^^^^^^^^^^^^^^^^^^^^^^^^^^^^^^^^^^^^^^^^^^^^^^^^^^^^^^^^^^^^^^^^^^^^^^^^^^^^^^^^^^^^^^^^^^^^^^^^^^^^^^^^^^^^^^^^^^^^
/usr/local/lib/python3.12/site-packages/casatasks/private/task_setjy.py:127: in setjy
    retval = setjy_core(vis, field, spw, selectdata, timerange,
(6 more lines...)
Collapse Failed test_task_setjy test_SingleObservation.test3_SingleObservationNewModel
1 sec
TypeError: only 0-dimensional arrays can be converted to Python scalars
test_task_setjy.py:496: in test3_SingleObservationNewModel
    sjran = setjy(vis=self.inpms, field='Titan', spw='', model='',
/usr/local/lib/python3.12/site-packages/casatasks/setjy.py:416: in __call__
    task_result = _setjy_t( _pc.document['vis'], _pc.document['field'], _pc.document['spw'], _pc.document['selectdata'], _pc.document['timerange'], _pc.document['scan'], _pc.document['intent'], _pc.document['observation'], _pc.document['scalebychan'], _pc.document['standard'], _pc.document['model'], _pc.document['listmodels'], _pc.document['fluxdensity'], _pc.document['spix'], _pc.document['reffreq'], _pc.document['polindex'], _pc.document['polangle'], _pc.document['rotmeas'], _pc.document['fluxdict'], _pc.document['useephemdir'], _pc.document['interpolation'], _pc.document['usescratch'], _pc.document['ismms'] )
                  ^^^^^^^^^^^^^^^^^^^^^^^^^^^^^^^^^^^^^^^^^^^^^^^^^^^^^^^^^^^^^^^^^^^^^^^^^^^^^^^^^^^^^^^^^^^^^^^^^^^^^^^^^^^^^^^^^^^^^^^^^^^^^^^^^^^^^^^^^^^^^^^^^^^^^^^^^^^^^^^^^^^^^^^^^^^^^^^^^^^^^^^^^^^^^^^^^^^^^^^^^^^^^^^^^^^^^^^^^^^^^^^^^^^^^^^^^^^^^^^^^^^^^^^^^^^^^^^^^^^^^^^^^^^^^^^^^^^^^^^^^^^^^^^^^^^^^^^^^^^^^^^^^^^^^^^^^^^^^^^^^^^^^^^^^^^^^^^^^^^^^^^^^^^^^^^^^^^^^^^^^^^^^^^^^^^^^^^^^^^^^^^^^^^^^^^^^^^^^^^^^^^^^^^^^^^^^^^^^^^^^^^^^^^^^^^^^^^^^^^^^^^^^^^^^^^^^^^^^^^^^^^^^^^^^^^^^^^^^^^^^^^^^^^^^^^^^^^^^^^^^^^^^^^^^^^^^^^^^^^^^^^^^^^^^^^^^^^^^^^^^^^^^^^^^^^^^^^^^^^^^^^^^^^^^^^^^^^^^^^^^^^^^^^^^^^^^^^^^^^^^
/usr/local/lib/python3.12/site-packages/casatasks/private/task_setjy.py:127: in setjy
    retval = setjy_core(vis, field, spw, selectdata, timerange,
(6 more lines...)
Collapse Failed test_task_setjy test_SingleObservation.test5_SingleObservationSelectByIntentNewModel
1 sec
TypeError: only 0-dimensional arrays can be converted to Python scalars
test_task_setjy.py:741: in test5_SingleObservationSelectByIntentNewModel
    sjran = setjy(vis=self.inpms, field='', spw='', model='',
/usr/local/lib/python3.12/site-packages/casatasks/setjy.py:416: in __call__
    task_result = _setjy_t( _pc.document['vis'], _pc.document['field'], _pc.document['spw'], _pc.document['selectdata'], _pc.document['timerange'], _pc.document['scan'], _pc.document['intent'], _pc.document['observation'], _pc.document['scalebychan'], _pc.document['standard'], _pc.document['model'], _pc.document['listmodels'], _pc.document['fluxdensity'], _pc.document['spix'], _pc.document['reffreq'], _pc.document['polindex'], _pc.document['polangle'], _pc.document['rotmeas'], _pc.document['fluxdict'], _pc.document['useephemdir'], _pc.document['interpolation'], _pc.document['usescratch'], _pc.document['ismms'] )
                  ^^^^^^^^^^^^^^^^^^^^^^^^^^^^^^^^^^^^^^^^^^^^^^^^^^^^^^^^^^^^^^^^^^^^^^^^^^^^^^^^^^^^^^^^^^^^^^^^^^^^^^^^^^^^^^^^^^^^^^^^^^^^^^^^^^^^^^^^^^^^^^^^^^^^^^^^^^^^^^^^^^^^^^^^^^^^^^^^^^^^^^^^^^^^^^^^^^^^^^^^^^^^^^^^^^^^^^^^^^^^^^^^^^^^^^^^^^^^^^^^^^^^^^^^^^^^^^^^^^^^^^^^^^^^^^^^^^^^^^^^^^^^^^^^^^^^^^^^^^^^^^^^^^^^^^^^^^^^^^^^^^^^^^^^^^^^^^^^^^^^^^^^^^^^^^^^^^^^^^^^^^^^^^^^^^^^^^^^^^^^^^^^^^^^^^^^^^^^^^^^^^^^^^^^^^^^^^^^^^^^^^^^^^^^^^^^^^^^^^^^^^^^^^^^^^^^^^^^^^^^^^^^^^^^^^^^^^^^^^^^^^^^^^^^^^^^^^^^^^^^^^^^^^^^^^^^^^^^^^^^^^^^^^^^^^^^^^^^^^^^^^^^^^^^^^^^^^^^^^^^^^^^^^^^^^^^^^^^^^^^^^^^^^^^^^^^^^^^^^^^^
/usr/local/lib/python3.12/site-packages/casatasks/private/task_setjy.py:127: in setjy
    retval = setjy_core(vis, field, spw, selectdata, timerange,
(6 more lines...)
Collapse Failed test_task_simanalyze simanalyze_main_usage_modes_test_sd.test_imaging_False_single_dish_analysis_True_showfidelity_True
9 secs
TypeError: only 0-dimensional arrays can be converted to Python scalars
test_task_simanalyze.py:189: in test_imaging_False_single_dish_analysis_True_showfidelity_True
    simanalyze(project=sd_project, image=True, vis=visname_sd, modelimage='', imsize = [],
/usr/local/lib/python3.12/site-packages/casatasks/simanalyze.py:137: in __call__
    task_result = _simanalyze_t( _pc.document['project'], _pc.document['image'], _pc.document['imagename'], _pc.document['skymodel'], _pc.document['vis'], _pc.document['modelimage'], _pc.document['imsize'], _pc.document['imdirection'], _pc.document['cell'], _pc.document['interactive'], _pc.document['niter'], _pc.document['threshold'], _pc.document['weighting'], _pc.document['mask'], _pc.document['outertaper'], _pc.document['pbcor'], _pc.document['stokes'], _pc.document['featherimage'], _pc.document['analyze'], _pc.document['showuv'], _pc.document['showpsf'], _pc.document['showmodel'], _pc.document['showconvolved'], _pc.document['showclean'], _pc.document['showresidual'], _pc.document['showdifference'], _pc.document['showfidelity'], _pc.document['graphics'], _pc.document['verbose'], _pc.document['overwrite'], _pc.document['dryrun'], _pc.document['logfile'] )
                  ^^^^^^^^^^^^^^^^^^^^^^^^^^^^^^^^^^^^^^^^^^^^^^^^^^^^^^^^^^^^^^^^^^^^^^^^^^^^^^^^^^^^^^^^^^^^^^^^^^^^^^^^^^^^^^^^^^^^^^^^^^^^^^^^^^^^^^^^^^^^^^^^^^^^^^^^^^^^^^^^^^^^^^^^^^^^^^^^^^^^^^^^^^^^^^^^^^^^^^^^^^^^^^^^^^^^^^^^^^^^^^^^^^^^^^^^^^^^^^^^^^^^^^^^^^^^^^^^^^^^^^^^^^^^^^^^^^^^^^^^^^^^^^^^^^^^^^^^^^^^^^^^^^^^^^^^^^^^^^^^^^^^^^^^^^^^^^^^^^^^^^^^^^^^^^^^^^^^^^^^^^^^^^^^^^^^^^^^^^^^^^^^^^^^^^^^^^^^^^^^^^^^^^^^^^^^^^^^^^^^^^^^^^^^^^^^^^^^^^^^^^^^^^^^^^^^^^^^^^^^^^^^^^^^^^^^^^^^^^^^^^^^^^^^^^^^^^^^^^^^^^^^^^^^^^^^^^^^^^^^^^^^^^^^^^^^^^^^^^^^^^^^^^^^^^^^^^^^^^^^^^^^^^^^^^^^^^^^^^^^^^^^^^^^^^^^^^^^^^^^^^^^^^^^^^^^^^^^^^^^^^^^^^^^^^^^^^^^^^^^^^^^^^^^^^^^^^^^^^^^^^^^^^^^^^^^^^^^^^^^^^^^^^^^^^^^^^^^^^^^^^^^^^^^^^^^^^^^^^^^^^^^^^^^^^^^^^^^^^^^^^^^^^^^^^^^^^^^^^^^^^^^^^^^^^^^^^^^^^^^^^^^^^^^^^^^^^^^^^^^^^^^^^^^^^^^^^^^^^^^^^^^^^^^^^^^^^^^^^^^^^^^^^^^^^^
/usr/local/lib/python3.12/site-packages/casatasks/private/task_simanalyze.py:481: in simanalyze
    msg("Scaling TP image intensity by %f." % (beam_area_ratio),origin='simanalyze')
(2 more lines...)
Collapse Failed test_task_simanalyze simanalyze_main_usage_modes_test_sd.test_imaging_True_single_dish_analysis_False
9 secs
TypeError: only 0-dimensional arrays can be converted to Python scalars
test_task_simanalyze.py:163: in test_imaging_True_single_dish_analysis_False
    simanalyze(project=sd_project, image=True, vis=visname_sd, modelimage='', imsize = [],
/usr/local/lib/python3.12/site-packages/casatasks/simanalyze.py:137: in __call__
    task_result = _simanalyze_t( _pc.document['project'], _pc.document['image'], _pc.document['imagename'], _pc.document['skymodel'], _pc.document['vis'], _pc.document['modelimage'], _pc.document['imsize'], _pc.document['imdirection'], _pc.document['cell'], _pc.document['interactive'], _pc.document['niter'], _pc.document['threshold'], _pc.document['weighting'], _pc.document['mask'], _pc.document['outertaper'], _pc.document['pbcor'], _pc.document['stokes'], _pc.document['featherimage'], _pc.document['analyze'], _pc.document['showuv'], _pc.document['showpsf'], _pc.document['showmodel'], _pc.document['showconvolved'], _pc.document['showclean'], _pc.document['showresidual'], _pc.document['showdifference'], _pc.document['showfidelity'], _pc.document['graphics'], _pc.document['verbose'], _pc.document['overwrite'], _pc.document['dryrun'], _pc.document['logfile'] )
                  ^^^^^^^^^^^^^^^^^^^^^^^^^^^^^^^^^^^^^^^^^^^^^^^^^^^^^^^^^^^^^^^^^^^^^^^^^^^^^^^^^^^^^^^^^^^^^^^^^^^^^^^^^^^^^^^^^^^^^^^^^^^^^^^^^^^^^^^^^^^^^^^^^^^^^^^^^^^^^^^^^^^^^^^^^^^^^^^^^^^^^^^^^^^^^^^^^^^^^^^^^^^^^^^^^^^^^^^^^^^^^^^^^^^^^^^^^^^^^^^^^^^^^^^^^^^^^^^^^^^^^^^^^^^^^^^^^^^^^^^^^^^^^^^^^^^^^^^^^^^^^^^^^^^^^^^^^^^^^^^^^^^^^^^^^^^^^^^^^^^^^^^^^^^^^^^^^^^^^^^^^^^^^^^^^^^^^^^^^^^^^^^^^^^^^^^^^^^^^^^^^^^^^^^^^^^^^^^^^^^^^^^^^^^^^^^^^^^^^^^^^^^^^^^^^^^^^^^^^^^^^^^^^^^^^^^^^^^^^^^^^^^^^^^^^^^^^^^^^^^^^^^^^^^^^^^^^^^^^^^^^^^^^^^^^^^^^^^^^^^^^^^^^^^^^^^^^^^^^^^^^^^^^^^^^^^^^^^^^^^^^^^^^^^^^^^^^^^^^^^^^^^^^^^^^^^^^^^^^^^^^^^^^^^^^^^^^^^^^^^^^^^^^^^^^^^^^^^^^^^^^^^^^^^^^^^^^^^^^^^^^^^^^^^^^^^^^^^^^^^^^^^^^^^^^^^^^^^^^^^^^^^^^^^^^^^^^^^^^^^^^^^^^^^^^^^^^^^^^^^^^^^^^^^^^^^^^^^^^^^^^^^^^^^^^^^^^^^^^^^^^^^^^^^^^^^^^^^^^^^^^^^^^^^^^^^^^^^^^^^^^^^^^^^^^^^
/usr/local/lib/python3.12/site-packages/casatasks/private/task_simanalyze.py:481: in simanalyze
    msg("Scaling TP image intensity by %f." % (beam_area_ratio),origin='simanalyze')
(2 more lines...)
Collapse Failed test_task_simobserve simobserve_badinputs.testBad_caldirection
3 secs
AssertionError: None
test_task_simobserve.py:2089: in testBad_caldirection
    simobserve(project=self.project,skymodel=self.inimage,
/usr/local/lib/python3.12/site-packages/casatasks/simobserve.py:350: in __call__
    task_result = _simobserve_t( _pc.document['project'], _pc.document['skymodel'], _pc.document['inbright'], _pc.document['indirection'], _pc.document['incell'], _pc.document['incenter'], _pc.document['inwidth'], _pc.document['complist'], _pc.document['compwidth'], _pc.document['comp_nchan'], _pc.document['setpointings'], _pc.document['ptgfile'], _pc.document['integration'], _pc.document['direction'], _pc.document['mapsize'], _pc.document['maptype'], _pc.document['pointingspacing'], _pc.document['caldirection'], _pc.document['calflux'], _pc.document['obsmode'], _pc.document['refdate'], _pc.document['hourangle'], _pc.document['totaltime'], _pc.document['antennalist'], _pc.document['sdantlist'], _pc.document['sdant'], _pc.document['outframe'], _pc.document['thermalnoise'], _pc.document['user_pwv'], _pc.document['t_ground'], _pc.document['t_sky'], _pc.document['tau0'], _pc.document['seed'], _pc.document['leakage'], _pc.document['graphics'], _pc.document['verbose'], _pc.document['overwrite'] )
                  ^^^^^^^^^^^^^^^^^^^^^^^^^^^^^^^^^^^^^^^^^^^^^^^^^^^^^^^^^^^^^^^^^^^^^^^^^^^^^^^^^^^^^^^^^^^^^^^^^^^^^^^^^^^^^^^^^^^^^^^^^^^^^^^^^^^^^^^^^^^^^^^^^^^^^^^^^^^^^^^^^^^^^^^^^^^^^^^^^^^^^^^^^^^^^^^^^^^^^^^^^^^^^^^^^^^^^^^^^^^^^^^^^^^^^^^^^^^^^^^^^^^^^^^^^^^^^^^^^^^^^^^^^^^^^^^^^^^^^^^^^^^^^^^^^^^^^^^^^^^^^^^^^^^^^^^^^^^^^^^^^^^^^^^^^^^^^^^^^^^^^^^^^^^^^^^^^^^^^^^^^^^^^^^^^^^^^^^^^^^^^^^^^^^^^^^^^^^^^^^^^^^^^^^^^^^^^^^^^^^^^^^^^^^^^^^^^^^^^^^^^^^^^^^^^^^^^^^^^^^^^^^^^^^^^^^^^^^^^^^^^^^^^^^^^^^^^^^^^^^^^^^^^^^^^^^^^^^^^^^^^^^^^^^^^^^^^^^^^^^^^^^^^^^^^^^^^^^^^^^^^^^^^^^^^^^^^^^^^^^^^^^^^^^^^^^^^^^^^^^^^^^^^^^^^^^^^^^^^^^^^^^^^^^^^^^^^^^^^^^^^^^^^^^^^^^^^^^^^^^^^^^^^^^^^^^^^^^^^^^^^^^^^^^^^^^^^^^^^^^^^^^^^^^^^^^^^^^^^^^^^^^^^^^^^^^^^^^^^^^^^^^^^^^^^^^^^^^^^^^^^^^^^^^^^^^^^^^^^^^^^^^^^^^^^^^^^^^^^^^^^^^^^^^^^^^^^^^^^^^^^^^^^^^^^^^^^^^^^^^^^^^^^^^^^^^^^^^^^^^^^^^^^^^^^^^^^^^^^^^^^^^^^^^^^^^^^^^^^^^^^^^^^^^^^^^^^^^^^^^^^^^^^^^^^^^^^^^^^^^^^^^^^^^^^^^^^^^^^^^^^^^^^^^^^^^^^^^^^^^^^^^^^^^
/usr/local/lib/python3.12/site-packages/casatasks/private/task_simobserve.py:749: in simobserve
    discard = util.statim(modelflat,plot=True,incell=model_cell)
(10 more lines...)
Collapse Failed test_task_simobserve simobserve_badinputs.testBad_direction
3 secs
AssertionError: None
test_task_simobserve.py:2004: in testBad_direction
    simobserve(project=self.project,skymodel=self.inimage,
/usr/local/lib/python3.12/site-packages/casatasks/simobserve.py:350: in __call__
    task_result = _simobserve_t( _pc.document['project'], _pc.document['skymodel'], _pc.document['inbright'], _pc.document['indirection'], _pc.document['incell'], _pc.document['incenter'], _pc.document['inwidth'], _pc.document['complist'], _pc.document['compwidth'], _pc.document['comp_nchan'], _pc.document['setpointings'], _pc.document['ptgfile'], _pc.document['integration'], _pc.document['direction'], _pc.document['mapsize'], _pc.document['maptype'], _pc.document['pointingspacing'], _pc.document['caldirection'], _pc.document['calflux'], _pc.document['obsmode'], _pc.document['refdate'], _pc.document['hourangle'], _pc.document['totaltime'], _pc.document['antennalist'], _pc.document['sdantlist'], _pc.document['sdant'], _pc.document['outframe'], _pc.document['thermalnoise'], _pc.document['user_pwv'], _pc.document['t_ground'], _pc.document['t_sky'], _pc.document['tau0'], _pc.document['seed'], _pc.document['leakage'], _pc.document['graphics'], _pc.document['verbose'], _pc.document['overwrite'] )
                  ^^^^^^^^^^^^^^^^^^^^^^^^^^^^^^^^^^^^^^^^^^^^^^^^^^^^^^^^^^^^^^^^^^^^^^^^^^^^^^^^^^^^^^^^^^^^^^^^^^^^^^^^^^^^^^^^^^^^^^^^^^^^^^^^^^^^^^^^^^^^^^^^^^^^^^^^^^^^^^^^^^^^^^^^^^^^^^^^^^^^^^^^^^^^^^^^^^^^^^^^^^^^^^^^^^^^^^^^^^^^^^^^^^^^^^^^^^^^^^^^^^^^^^^^^^^^^^^^^^^^^^^^^^^^^^^^^^^^^^^^^^^^^^^^^^^^^^^^^^^^^^^^^^^^^^^^^^^^^^^^^^^^^^^^^^^^^^^^^^^^^^^^^^^^^^^^^^^^^^^^^^^^^^^^^^^^^^^^^^^^^^^^^^^^^^^^^^^^^^^^^^^^^^^^^^^^^^^^^^^^^^^^^^^^^^^^^^^^^^^^^^^^^^^^^^^^^^^^^^^^^^^^^^^^^^^^^^^^^^^^^^^^^^^^^^^^^^^^^^^^^^^^^^^^^^^^^^^^^^^^^^^^^^^^^^^^^^^^^^^^^^^^^^^^^^^^^^^^^^^^^^^^^^^^^^^^^^^^^^^^^^^^^^^^^^^^^^^^^^^^^^^^^^^^^^^^^^^^^^^^^^^^^^^^^^^^^^^^^^^^^^^^^^^^^^^^^^^^^^^^^^^^^^^^^^^^^^^^^^^^^^^^^^^^^^^^^^^^^^^^^^^^^^^^^^^^^^^^^^^^^^^^^^^^^^^^^^^^^^^^^^^^^^^^^^^^^^^^^^^^^^^^^^^^^^^^^^^^^^^^^^^^^^^^^^^^^^^^^^^^^^^^^^^^^^^^^^^^^^^^^^^^^^^^^^^^^^^^^^^^^^^^^^^^^^^^^^^^^^^^^^^^^^^^^^^^^^^^^^^^^^^^^^^^^^^^^^^^^^^^^^^^^^^^^^^^^^^^^^^^^^^^^^^^^^^^^^^^^^^^^^^^^^^^^^^^^^^^^^^^^^^^^^^^^^^^^^^^^^^^^^^^^^^
/usr/local/lib/python3.12/site-packages/casatasks/private/task_simobserve.py:749: in simobserve
    discard = util.statim(modelflat,plot=True,incell=model_cell)
(10 more lines...)
Collapse Failed test_task_simobserve simobserve_badinputs.testBad_hourangle
4 secs
AssertionError: -1 == -1 : Unexpected exception was thrown: only 0-dimensional arrays can be converted to Python scalars
test_task_simobserve.py:2171: in testBad_hourangle
    simobserve(project=self.project,skymodel=self.inimage,
/usr/local/lib/python3.12/site-packages/casatasks/simobserve.py:350: in __call__
    task_result = _simobserve_t( _pc.document['project'], _pc.document['skymodel'], _pc.document['inbright'], _pc.document['indirection'], _pc.document['incell'], _pc.document['incenter'], _pc.document['inwidth'], _pc.document['complist'], _pc.document['compwidth'], _pc.document['comp_nchan'], _pc.document['setpointings'], _pc.document['ptgfile'], _pc.document['integration'], _pc.document['direction'], _pc.document['mapsize'], _pc.document['maptype'], _pc.document['pointingspacing'], _pc.document['caldirection'], _pc.document['calflux'], _pc.document['obsmode'], _pc.document['refdate'], _pc.document['hourangle'], _pc.document['totaltime'], _pc.document['antennalist'], _pc.document['sdantlist'], _pc.document['sdant'], _pc.document['outframe'], _pc.document['thermalnoise'], _pc.document['user_pwv'], _pc.document['t_ground'], _pc.document['t_sky'], _pc.document['tau0'], _pc.document['seed'], _pc.document['leakage'], _pc.document['graphics'], _pc.document['verbose'], _pc.document['overwrite'] )
                  ^^^^^^^^^^^^^^^^^^^^^^^^^^^^^^^^^^^^^^^^^^^^^^^^^^^^^^^^^^^^^^^^^^^^^^^^^^^^^^^^^^^^^^^^^^^^^^^^^^^^^^^^^^^^^^^^^^^^^^^^^^^^^^^^^^^^^^^^^^^^^^^^^^^^^^^^^^^^^^^^^^^^^^^^^^^^^^^^^^^^^^^^^^^^^^^^^^^^^^^^^^^^^^^^^^^^^^^^^^^^^^^^^^^^^^^^^^^^^^^^^^^^^^^^^^^^^^^^^^^^^^^^^^^^^^^^^^^^^^^^^^^^^^^^^^^^^^^^^^^^^^^^^^^^^^^^^^^^^^^^^^^^^^^^^^^^^^^^^^^^^^^^^^^^^^^^^^^^^^^^^^^^^^^^^^^^^^^^^^^^^^^^^^^^^^^^^^^^^^^^^^^^^^^^^^^^^^^^^^^^^^^^^^^^^^^^^^^^^^^^^^^^^^^^^^^^^^^^^^^^^^^^^^^^^^^^^^^^^^^^^^^^^^^^^^^^^^^^^^^^^^^^^^^^^^^^^^^^^^^^^^^^^^^^^^^^^^^^^^^^^^^^^^^^^^^^^^^^^^^^^^^^^^^^^^^^^^^^^^^^^^^^^^^^^^^^^^^^^^^^^^^^^^^^^^^^^^^^^^^^^^^^^^^^^^^^^^^^^^^^^^^^^^^^^^^^^^^^^^^^^^^^^^^^^^^^^^^^^^^^^^^^^^^^^^^^^^^^^^^^^^^^^^^^^^^^^^^^^^^^^^^^^^^^^^^^^^^^^^^^^^^^^^^^^^^^^^^^^^^^^^^^^^^^^^^^^^^^^^^^^^^^^^^^^^^^^^^^^^^^^^^^^^^^^^^^^^^^^^^^^^^^^^^^^^^^^^^^^^^^^^^^^^^^^^^^^^^^^^^^^^^^^^^^^^^^^^^^^^^^^^^^^^^^^^^^^^^^^^^^^^^^^^^^^^^^^^^^^^^^^^^^^^^^^^^^^^^^^^^^^^^^^^^^^^^^^^^^^^^^^^^^^^^^^^^^^^^^^^^^^^^^^^^
/usr/local/lib/python3.12/site-packages/casatasks/private/task_simobserve.py:749: in simobserve
    discard = util.statim(modelflat,plot=True,incell=model_cell)
(10 more lines...)
Collapse Failed test_task_simobserve simobserve_badinputs.testBad_incenter
3 secs
AssertionError: None
test_task_simobserve.py:1869: in testBad_incenter
    simobserve(project=self.project,skymodel=self.inimage,
/usr/local/lib/python3.12/site-packages/casatasks/simobserve.py:350: in __call__
    task_result = _simobserve_t( _pc.document['project'], _pc.document['skymodel'], _pc.document['inbright'], _pc.document['indirection'], _pc.document['incell'], _pc.document['incenter'], _pc.document['inwidth'], _pc.document['complist'], _pc.document['compwidth'], _pc.document['comp_nchan'], _pc.document['setpointings'], _pc.document['ptgfile'], _pc.document['integration'], _pc.document['direction'], _pc.document['mapsize'], _pc.document['maptype'], _pc.document['pointingspacing'], _pc.document['caldirection'], _pc.document['calflux'], _pc.document['obsmode'], _pc.document['refdate'], _pc.document['hourangle'], _pc.document['totaltime'], _pc.document['antennalist'], _pc.document['sdantlist'], _pc.document['sdant'], _pc.document['outframe'], _pc.document['thermalnoise'], _pc.document['user_pwv'], _pc.document['t_ground'], _pc.document['t_sky'], _pc.document['tau0'], _pc.document['seed'], _pc.document['leakage'], _pc.document['graphics'], _pc.document['verbose'], _pc.document['overwrite'] )
                  ^^^^^^^^^^^^^^^^^^^^^^^^^^^^^^^^^^^^^^^^^^^^^^^^^^^^^^^^^^^^^^^^^^^^^^^^^^^^^^^^^^^^^^^^^^^^^^^^^^^^^^^^^^^^^^^^^^^^^^^^^^^^^^^^^^^^^^^^^^^^^^^^^^^^^^^^^^^^^^^^^^^^^^^^^^^^^^^^^^^^^^^^^^^^^^^^^^^^^^^^^^^^^^^^^^^^^^^^^^^^^^^^^^^^^^^^^^^^^^^^^^^^^^^^^^^^^^^^^^^^^^^^^^^^^^^^^^^^^^^^^^^^^^^^^^^^^^^^^^^^^^^^^^^^^^^^^^^^^^^^^^^^^^^^^^^^^^^^^^^^^^^^^^^^^^^^^^^^^^^^^^^^^^^^^^^^^^^^^^^^^^^^^^^^^^^^^^^^^^^^^^^^^^^^^^^^^^^^^^^^^^^^^^^^^^^^^^^^^^^^^^^^^^^^^^^^^^^^^^^^^^^^^^^^^^^^^^^^^^^^^^^^^^^^^^^^^^^^^^^^^^^^^^^^^^^^^^^^^^^^^^^^^^^^^^^^^^^^^^^^^^^^^^^^^^^^^^^^^^^^^^^^^^^^^^^^^^^^^^^^^^^^^^^^^^^^^^^^^^^^^^^^^^^^^^^^^^^^^^^^^^^^^^^^^^^^^^^^^^^^^^^^^^^^^^^^^^^^^^^^^^^^^^^^^^^^^^^^^^^^^^^^^^^^^^^^^^^^^^^^^^^^^^^^^^^^^^^^^^^^^^^^^^^^^^^^^^^^^^^^^^^^^^^^^^^^^^^^^^^^^^^^^^^^^^^^^^^^^^^^^^^^^^^^^^^^^^^^^^^^^^^^^^^^^^^^^^^^^^^^^^^^^^^^^^^^^^^^^^^^^^^^^^^^^^^^^^^^^^^^^^^^^^^^^^^^^^^^^^^^^^^^^^^^^^^^^^^^^^^^^^^^^^^^^^^^^^^^^^^^^^^^^^^^^^^^^^^^^^^^^^^^^^^^^^^^^^^^^^^^^^^^^^^^^^^^^^^^^^^^^^^^^^^
/usr/local/lib/python3.12/site-packages/casatasks/private/task_simobserve.py:749: in simobserve
    discard = util.statim(modelflat,plot=True,incell=model_cell)
(10 more lines...)
Collapse Failed test_task_simobserve simobserve_badinputs.testBad_indirection
3 secs
AssertionError: None
test_task_simobserve.py:1841: in testBad_indirection
    simobserve(project=self.project,skymodel=self.inimage,
/usr/local/lib/python3.12/site-packages/casatasks/simobserve.py:350: in __call__
    task_result = _simobserve_t( _pc.document['project'], _pc.document['skymodel'], _pc.document['inbright'], _pc.document['indirection'], _pc.document['incell'], _pc.document['incenter'], _pc.document['inwidth'], _pc.document['complist'], _pc.document['compwidth'], _pc.document['comp_nchan'], _pc.document['setpointings'], _pc.document['ptgfile'], _pc.document['integration'], _pc.document['direction'], _pc.document['mapsize'], _pc.document['maptype'], _pc.document['pointingspacing'], _pc.document['caldirection'], _pc.document['calflux'], _pc.document['obsmode'], _pc.document['refdate'], _pc.document['hourangle'], _pc.document['totaltime'], _pc.document['antennalist'], _pc.document['sdantlist'], _pc.document['sdant'], _pc.document['outframe'], _pc.document['thermalnoise'], _pc.document['user_pwv'], _pc.document['t_ground'], _pc.document['t_sky'], _pc.document['tau0'], _pc.document['seed'], _pc.document['leakage'], _pc.document['graphics'], _pc.document['verbose'], _pc.document['overwrite'] )
                  ^^^^^^^^^^^^^^^^^^^^^^^^^^^^^^^^^^^^^^^^^^^^^^^^^^^^^^^^^^^^^^^^^^^^^^^^^^^^^^^^^^^^^^^^^^^^^^^^^^^^^^^^^^^^^^^^^^^^^^^^^^^^^^^^^^^^^^^^^^^^^^^^^^^^^^^^^^^^^^^^^^^^^^^^^^^^^^^^^^^^^^^^^^^^^^^^^^^^^^^^^^^^^^^^^^^^^^^^^^^^^^^^^^^^^^^^^^^^^^^^^^^^^^^^^^^^^^^^^^^^^^^^^^^^^^^^^^^^^^^^^^^^^^^^^^^^^^^^^^^^^^^^^^^^^^^^^^^^^^^^^^^^^^^^^^^^^^^^^^^^^^^^^^^^^^^^^^^^^^^^^^^^^^^^^^^^^^^^^^^^^^^^^^^^^^^^^^^^^^^^^^^^^^^^^^^^^^^^^^^^^^^^^^^^^^^^^^^^^^^^^^^^^^^^^^^^^^^^^^^^^^^^^^^^^^^^^^^^^^^^^^^^^^^^^^^^^^^^^^^^^^^^^^^^^^^^^^^^^^^^^^^^^^^^^^^^^^^^^^^^^^^^^^^^^^^^^^^^^^^^^^^^^^^^^^^^^^^^^^^^^^^^^^^^^^^^^^^^^^^^^^^^^^^^^^^^^^^^^^^^^^^^^^^^^^^^^^^^^^^^^^^^^^^^^^^^^^^^^^^^^^^^^^^^^^^^^^^^^^^^^^^^^^^^^^^^^^^^^^^^^^^^^^^^^^^^^^^^^^^^^^^^^^^^^^^^^^^^^^^^^^^^^^^^^^^^^^^^^^^^^^^^^^^^^^^^^^^^^^^^^^^^^^^^^^^^^^^^^^^^^^^^^^^^^^^^^^^^^^^^^^^^^^^^^^^^^^^^^^^^^^^^^^^^^^^^^^^^^^^^^^^^^^^^^^^^^^^^^^^^^^^^^^^^^^^^^^^^^^^^^^^^^^^^^^^^^^^^^^^^^^^^^^^^^^^^^^^^^^^^^^^^^^^^^^^^^^^^^^^^^^^^^^^^^^^^^^^^^^^^^^^^^^^
/usr/local/lib/python3.12/site-packages/casatasks/private/task_simobserve.py:749: in simobserve
    discard = util.statim(modelflat,plot=True,incell=model_cell)
(10 more lines...)
Collapse Failed test_task_simobserve simobserve_badinputs.testBad_integration
3 secs
AssertionError: -1 == -1 : Unexpected exception was thrown: only 0-dimensional arrays can be converted to Python scalars
test_task_simobserve.py:1989: in testBad_integration
    simobserve(project=self.project,skymodel=self.inimage,
/usr/local/lib/python3.12/site-packages/casatasks/simobserve.py:350: in __call__
    task_result = _simobserve_t( _pc.document['project'], _pc.document['skymodel'], _pc.document['inbright'], _pc.document['indirection'], _pc.document['incell'], _pc.document['incenter'], _pc.document['inwidth'], _pc.document['complist'], _pc.document['compwidth'], _pc.document['comp_nchan'], _pc.document['setpointings'], _pc.document['ptgfile'], _pc.document['integration'], _pc.document['direction'], _pc.document['mapsize'], _pc.document['maptype'], _pc.document['pointingspacing'], _pc.document['caldirection'], _pc.document['calflux'], _pc.document['obsmode'], _pc.document['refdate'], _pc.document['hourangle'], _pc.document['totaltime'], _pc.document['antennalist'], _pc.document['sdantlist'], _pc.document['sdant'], _pc.document['outframe'], _pc.document['thermalnoise'], _pc.document['user_pwv'], _pc.document['t_ground'], _pc.document['t_sky'], _pc.document['tau0'], _pc.document['seed'], _pc.document['leakage'], _pc.document['graphics'], _pc.document['verbose'], _pc.document['overwrite'] )
                  ^^^^^^^^^^^^^^^^^^^^^^^^^^^^^^^^^^^^^^^^^^^^^^^^^^^^^^^^^^^^^^^^^^^^^^^^^^^^^^^^^^^^^^^^^^^^^^^^^^^^^^^^^^^^^^^^^^^^^^^^^^^^^^^^^^^^^^^^^^^^^^^^^^^^^^^^^^^^^^^^^^^^^^^^^^^^^^^^^^^^^^^^^^^^^^^^^^^^^^^^^^^^^^^^^^^^^^^^^^^^^^^^^^^^^^^^^^^^^^^^^^^^^^^^^^^^^^^^^^^^^^^^^^^^^^^^^^^^^^^^^^^^^^^^^^^^^^^^^^^^^^^^^^^^^^^^^^^^^^^^^^^^^^^^^^^^^^^^^^^^^^^^^^^^^^^^^^^^^^^^^^^^^^^^^^^^^^^^^^^^^^^^^^^^^^^^^^^^^^^^^^^^^^^^^^^^^^^^^^^^^^^^^^^^^^^^^^^^^^^^^^^^^^^^^^^^^^^^^^^^^^^^^^^^^^^^^^^^^^^^^^^^^^^^^^^^^^^^^^^^^^^^^^^^^^^^^^^^^^^^^^^^^^^^^^^^^^^^^^^^^^^^^^^^^^^^^^^^^^^^^^^^^^^^^^^^^^^^^^^^^^^^^^^^^^^^^^^^^^^^^^^^^^^^^^^^^^^^^^^^^^^^^^^^^^^^^^^^^^^^^^^^^^^^^^^^^^^^^^^^^^^^^^^^^^^^^^^^^^^^^^^^^^^^^^^^^^^^^^^^^^^^^^^^^^^^^^^^^^^^^^^^^^^^^^^^^^^^^^^^^^^^^^^^^^^^^^^^^^^^^^^^^^^^^^^^^^^^^^^^^^^^^^^^^^^^^^^^^^^^^^^^^^^^^^^^^^^^^^^^^^^^^^^^^^^^^^^^^^^^^^^^^^^^^^^^^^^^^^^^^^^^^^^^^^^^^^^^^^^^^^^^^^^^^^^^^^^^^^^^^^^^^^^^^^^^^^^^^^^^^^^^^^^^^^^^^^^^^^^^^^^^^^^^^^^^^^^^^^^^^^^^^^^^^^^^^^^^^^^^^^^^^^^
/usr/local/lib/python3.12/site-packages/casatasks/private/task_simobserve.py:749: in simobserve
    discard = util.statim(modelflat,plot=True,incell=model_cell)
(10 more lines...)
Collapse Failed test_task_simobserve simobserve_badinputs.testBad_inwidth
4 secs
AssertionError: None
test_task_simobserve.py:1883: in testBad_inwidth
    simobserve(project=self.project,skymodel=self.inimage,
/usr/local/lib/python3.12/site-packages/casatasks/simobserve.py:350: in __call__
    task_result = _simobserve_t( _pc.document['project'], _pc.document['skymodel'], _pc.document['inbright'], _pc.document['indirection'], _pc.document['incell'], _pc.document['incenter'], _pc.document['inwidth'], _pc.document['complist'], _pc.document['compwidth'], _pc.document['comp_nchan'], _pc.document['setpointings'], _pc.document['ptgfile'], _pc.document['integration'], _pc.document['direction'], _pc.document['mapsize'], _pc.document['maptype'], _pc.document['pointingspacing'], _pc.document['caldirection'], _pc.document['calflux'], _pc.document['obsmode'], _pc.document['refdate'], _pc.document['hourangle'], _pc.document['totaltime'], _pc.document['antennalist'], _pc.document['sdantlist'], _pc.document['sdant'], _pc.document['outframe'], _pc.document['thermalnoise'], _pc.document['user_pwv'], _pc.document['t_ground'], _pc.document['t_sky'], _pc.document['tau0'], _pc.document['seed'], _pc.document['leakage'], _pc.document['graphics'], _pc.document['verbose'], _pc.document['overwrite'] )
                  ^^^^^^^^^^^^^^^^^^^^^^^^^^^^^^^^^^^^^^^^^^^^^^^^^^^^^^^^^^^^^^^^^^^^^^^^^^^^^^^^^^^^^^^^^^^^^^^^^^^^^^^^^^^^^^^^^^^^^^^^^^^^^^^^^^^^^^^^^^^^^^^^^^^^^^^^^^^^^^^^^^^^^^^^^^^^^^^^^^^^^^^^^^^^^^^^^^^^^^^^^^^^^^^^^^^^^^^^^^^^^^^^^^^^^^^^^^^^^^^^^^^^^^^^^^^^^^^^^^^^^^^^^^^^^^^^^^^^^^^^^^^^^^^^^^^^^^^^^^^^^^^^^^^^^^^^^^^^^^^^^^^^^^^^^^^^^^^^^^^^^^^^^^^^^^^^^^^^^^^^^^^^^^^^^^^^^^^^^^^^^^^^^^^^^^^^^^^^^^^^^^^^^^^^^^^^^^^^^^^^^^^^^^^^^^^^^^^^^^^^^^^^^^^^^^^^^^^^^^^^^^^^^^^^^^^^^^^^^^^^^^^^^^^^^^^^^^^^^^^^^^^^^^^^^^^^^^^^^^^^^^^^^^^^^^^^^^^^^^^^^^^^^^^^^^^^^^^^^^^^^^^^^^^^^^^^^^^^^^^^^^^^^^^^^^^^^^^^^^^^^^^^^^^^^^^^^^^^^^^^^^^^^^^^^^^^^^^^^^^^^^^^^^^^^^^^^^^^^^^^^^^^^^^^^^^^^^^^^^^^^^^^^^^^^^^^^^^^^^^^^^^^^^^^^^^^^^^^^^^^^^^^^^^^^^^^^^^^^^^^^^^^^^^^^^^^^^^^^^^^^^^^^^^^^^^^^^^^^^^^^^^^^^^^^^^^^^^^^^^^^^^^^^^^^^^^^^^^^^^^^^^^^^^^^^^^^^^^^^^^^^^^^^^^^^^^^^^^^^^^^^^^^^^^^^^^^^^^^^^^^^^^^^^^^^^^^^^^^^^^^^^^^^^^^^^^^^^^^^^^^^^^^^^^^^^^^^^^^^^^^^^^^^^^^^^^^^^^^^^^^^^^^^^^^^^^^^^^^^^^^^^^^^^
/usr/local/lib/python3.12/site-packages/casatasks/private/task_simobserve.py:749: in simobserve
    discard = util.statim(modelflat,plot=True,incell=model_cell)
(10 more lines...)
Collapse Failed test_task_simobserve simobserve_badinputs.testBad_refdate
3 secs
AssertionError: -1 == -1 : Unexpected exception was thrown: only 0-dimensional arrays can be converted to Python scalars
test_task_simobserve.py:2154: in testBad_refdate
    simobserve(project=self.project,skymodel=self.inimage,
/usr/local/lib/python3.12/site-packages/casatasks/simobserve.py:350: in __call__
    task_result = _simobserve_t( _pc.document['project'], _pc.document['skymodel'], _pc.document['inbright'], _pc.document['indirection'], _pc.document['incell'], _pc.document['incenter'], _pc.document['inwidth'], _pc.document['complist'], _pc.document['compwidth'], _pc.document['comp_nchan'], _pc.document['setpointings'], _pc.document['ptgfile'], _pc.document['integration'], _pc.document['direction'], _pc.document['mapsize'], _pc.document['maptype'], _pc.document['pointingspacing'], _pc.document['caldirection'], _pc.document['calflux'], _pc.document['obsmode'], _pc.document['refdate'], _pc.document['hourangle'], _pc.document['totaltime'], _pc.document['antennalist'], _pc.document['sdantlist'], _pc.document['sdant'], _pc.document['outframe'], _pc.document['thermalnoise'], _pc.document['user_pwv'], _pc.document['t_ground'], _pc.document['t_sky'], _pc.document['tau0'], _pc.document['seed'], _pc.document['leakage'], _pc.document['graphics'], _pc.document['verbose'], _pc.document['overwrite'] )
                  ^^^^^^^^^^^^^^^^^^^^^^^^^^^^^^^^^^^^^^^^^^^^^^^^^^^^^^^^^^^^^^^^^^^^^^^^^^^^^^^^^^^^^^^^^^^^^^^^^^^^^^^^^^^^^^^^^^^^^^^^^^^^^^^^^^^^^^^^^^^^^^^^^^^^^^^^^^^^^^^^^^^^^^^^^^^^^^^^^^^^^^^^^^^^^^^^^^^^^^^^^^^^^^^^^^^^^^^^^^^^^^^^^^^^^^^^^^^^^^^^^^^^^^^^^^^^^^^^^^^^^^^^^^^^^^^^^^^^^^^^^^^^^^^^^^^^^^^^^^^^^^^^^^^^^^^^^^^^^^^^^^^^^^^^^^^^^^^^^^^^^^^^^^^^^^^^^^^^^^^^^^^^^^^^^^^^^^^^^^^^^^^^^^^^^^^^^^^^^^^^^^^^^^^^^^^^^^^^^^^^^^^^^^^^^^^^^^^^^^^^^^^^^^^^^^^^^^^^^^^^^^^^^^^^^^^^^^^^^^^^^^^^^^^^^^^^^^^^^^^^^^^^^^^^^^^^^^^^^^^^^^^^^^^^^^^^^^^^^^^^^^^^^^^^^^^^^^^^^^^^^^^^^^^^^^^^^^^^^^^^^^^^^^^^^^^^^^^^^^^^^^^^^^^^^^^^^^^^^^^^^^^^^^^^^^^^^^^^^^^^^^^^^^^^^^^^^^^^^^^^^^^^^^^^^^^^^^^^^^^^^^^^^^^^^^^^^^^^^^^^^^^^^^^^^^^^^^^^^^^^^^^^^^^^^^^^^^^^^^^^^^^^^^^^^^^^^^^^^^^^^^^^^^^^^^^^^^^^^^^^^^^^^^^^^^^^^^^^^^^^^^^^^^^^^^^^^^^^^^^^^^^^^^^^^^^^^^^^^^^^^^^^^^^^^^^^^^^^^^^^^^^^^^^^^^^^^^^^^^^^^^^^^^^^^^^^^^^^^^^^^^^^^^^^^^^^^^^^^^^^^^^^^^^^^^^^^^^^^^^^^^^^^^^^^^^^^^^^^^^^^^^^^^^^^^^^^^^^^^^^^^^^^^^
/usr/local/lib/python3.12/site-packages/casatasks/private/task_simobserve.py:749: in simobserve
    discard = util.statim(modelflat,plot=True,incell=model_cell)
(10 more lines...)
Collapse Failed test_task_simobserve simobserve_badinputs.testBad_totaltime
3 secs
AssertionError: -1 == -1 : Unexpected exception was thrown: only 0-dimensional arrays can be converted to Python scalars
test_task_simobserve.py:2189: in testBad_totaltime
    simobserve(project=self.project,skymodel=self.inimage,
/usr/local/lib/python3.12/site-packages/casatasks/simobserve.py:350: in __call__
    task_result = _simobserve_t( _pc.document['project'], _pc.document['skymodel'], _pc.document['inbright'], _pc.document['indirection'], _pc.document['incell'], _pc.document['incenter'], _pc.document['inwidth'], _pc.document['complist'], _pc.document['compwidth'], _pc.document['comp_nchan'], _pc.document['setpointings'], _pc.document['ptgfile'], _pc.document['integration'], _pc.document['direction'], _pc.document['mapsize'], _pc.document['maptype'], _pc.document['pointingspacing'], _pc.document['caldirection'], _pc.document['calflux'], _pc.document['obsmode'], _pc.document['refdate'], _pc.document['hourangle'], _pc.document['totaltime'], _pc.document['antennalist'], _pc.document['sdantlist'], _pc.document['sdant'], _pc.document['outframe'], _pc.document['thermalnoise'], _pc.document['user_pwv'], _pc.document['t_ground'], _pc.document['t_sky'], _pc.document['tau0'], _pc.document['seed'], _pc.document['leakage'], _pc.document['graphics'], _pc.document['verbose'], _pc.document['overwrite'] )
                  ^^^^^^^^^^^^^^^^^^^^^^^^^^^^^^^^^^^^^^^^^^^^^^^^^^^^^^^^^^^^^^^^^^^^^^^^^^^^^^^^^^^^^^^^^^^^^^^^^^^^^^^^^^^^^^^^^^^^^^^^^^^^^^^^^^^^^^^^^^^^^^^^^^^^^^^^^^^^^^^^^^^^^^^^^^^^^^^^^^^^^^^^^^^^^^^^^^^^^^^^^^^^^^^^^^^^^^^^^^^^^^^^^^^^^^^^^^^^^^^^^^^^^^^^^^^^^^^^^^^^^^^^^^^^^^^^^^^^^^^^^^^^^^^^^^^^^^^^^^^^^^^^^^^^^^^^^^^^^^^^^^^^^^^^^^^^^^^^^^^^^^^^^^^^^^^^^^^^^^^^^^^^^^^^^^^^^^^^^^^^^^^^^^^^^^^^^^^^^^^^^^^^^^^^^^^^^^^^^^^^^^^^^^^^^^^^^^^^^^^^^^^^^^^^^^^^^^^^^^^^^^^^^^^^^^^^^^^^^^^^^^^^^^^^^^^^^^^^^^^^^^^^^^^^^^^^^^^^^^^^^^^^^^^^^^^^^^^^^^^^^^^^^^^^^^^^^^^^^^^^^^^^^^^^^^^^^^^^^^^^^^^^^^^^^^^^^^^^^^^^^^^^^^^^^^^^^^^^^^^^^^^^^^^^^^^^^^^^^^^^^^^^^^^^^^^^^^^^^^^^^^^^^^^^^^^^^^^^^^^^^^^^^^^^^^^^^^^^^^^^^^^^^^^^^^^^^^^^^^^^^^^^^^^^^^^^^^^^^^^^^^^^^^^^^^^^^^^^^^^^^^^^^^^^^^^^^^^^^^^^^^^^^^^^^^^^^^^^^^^^^^^^^^^^^^^^^^^^^^^^^^^^^^^^^^^^^^^^^^^^^^^^^^^^^^^^^^^^^^^^^^^^^^^^^^^^^^^^^^^^^^^^^^^^^^^^^^^^^^^^^^^^^^^^^^^^^^^^^^^^^^^^^^^^^^^^^^^^^^^^^^^^^^^^^^^^^^^^^^^^^^^^^^^^^^^^^^^^^^^^^^^^^^^
/usr/local/lib/python3.12/site-packages/casatasks/private/task_simobserve.py:749: in simobserve
    discard = util.statim(modelflat,plot=True,incell=model_cell)
(10 more lines...)
Collapse Failed test_task_simobserve simobserve_noise.testNZ_intMan
1 sec
AssertionError: None
test_task_simobserve.py:1228: in testNZ_intMan
    simobserve(project=project,skymodel=skymodel,
/usr/local/lib/python3.12/site-packages/casatasks/simobserve.py:350: in __call__
    task_result = _simobserve_t( _pc.document['project'], _pc.document['skymodel'], _pc.document['inbright'], _pc.document['indirection'], _pc.document['incell'], _pc.document['incenter'], _pc.document['inwidth'], _pc.document['complist'], _pc.document['compwidth'], _pc.document['comp_nchan'], _pc.document['setpointings'], _pc.document['ptgfile'], _pc.document['integration'], _pc.document['direction'], _pc.document['mapsize'], _pc.document['maptype'], _pc.document['pointingspacing'], _pc.document['caldirection'], _pc.document['calflux'], _pc.document['obsmode'], _pc.document['refdate'], _pc.document['hourangle'], _pc.document['totaltime'], _pc.document['antennalist'], _pc.document['sdantlist'], _pc.document['sdant'], _pc.document['outframe'], _pc.document['thermalnoise'], _pc.document['user_pwv'], _pc.document['t_ground'], _pc.document['t_sky'], _pc.document['tau0'], _pc.document['seed'], _pc.document['leakage'], _pc.document['graphics'], _pc.document['verbose'], _pc.document['overwrite'] )
                  ^^^^^^^^^^^^^^^^^^^^^^^^^^^^^^^^^^^^^^^^^^^^^^^^^^^^^^^^^^^^^^^^^^^^^^^^^^^^^^^^^^^^^^^^^^^^^^^^^^^^^^^^^^^^^^^^^^^^^^^^^^^^^^^^^^^^^^^^^^^^^^^^^^^^^^^^^^^^^^^^^^^^^^^^^^^^^^^^^^^^^^^^^^^^^^^^^^^^^^^^^^^^^^^^^^^^^^^^^^^^^^^^^^^^^^^^^^^^^^^^^^^^^^^^^^^^^^^^^^^^^^^^^^^^^^^^^^^^^^^^^^^^^^^^^^^^^^^^^^^^^^^^^^^^^^^^^^^^^^^^^^^^^^^^^^^^^^^^^^^^^^^^^^^^^^^^^^^^^^^^^^^^^^^^^^^^^^^^^^^^^^^^^^^^^^^^^^^^^^^^^^^^^^^^^^^^^^^^^^^^^^^^^^^^^^^^^^^^^^^^^^^^^^^^^^^^^^^^^^^^^^^^^^^^^^^^^^^^^^^^^^^^^^^^^^^^^^^^^^^^^^^^^^^^^^^^^^^^^^^^^^^^^^^^^^^^^^^^^^^^^^^^^^^^^^^^^^^^^^^^^^^^^^^^^^^^^^^^^^^^^^^^^^^^^^^^^^^^^^^^^^^^^^^^^^^^^^^^^^^^^^^^^^^^^^^^^^^^^^^^^^^^^^^^^^^^^^^^^^^^^^^^^^^^^^^^^^^^^^^^^^^^^^^^^^^^^^^^^^^^^^^^^^^^^^^^^^^^^^^^^^^^^^^^^^^^^^^^^^^^^^^^^^^^^^^^^^^^^^^^^^^^^^^^^^^^^^^^^^^^^^^^^^^^^^^^^^^^^^^^^^^^^^^^^^^^^^^^^^^^^^^^^^^^^^^^^^^^^^^^^^^^^^^^^^^^^^^^^^^^^^^^^^^^^^^^^^^^^^^^^^^^^^^^^^^^^^^^^^^^^^^^^^^^^^^^^^^^^^^^^^^^^^^^^^^^^^^^^^^^^^^^^^^^^^^^^^^^^^^^^^^^^^^^^^^^^^^^^^^^^^^^^^^
/usr/local/lib/python3.12/site-packages/casatasks/private/task_simobserve.py:749: in simobserve
    discard = util.statim(modelflat,plot=True,incell=model_cell)
(10 more lines...)
Collapse Failed test_task_simobserve simobserve_noise.testNZ_sdAtm
< 1 sec
AssertionError: None
test_task_simobserve.py:1439: in testNZ_sdAtm
    simobserve(project=self.project,skymodel=self.skymodel,
/usr/local/lib/python3.12/site-packages/casatasks/simobserve.py:350: in __call__
    task_result = _simobserve_t( _pc.document['project'], _pc.document['skymodel'], _pc.document['inbright'], _pc.document['indirection'], _pc.document['incell'], _pc.document['incenter'], _pc.document['inwidth'], _pc.document['complist'], _pc.document['compwidth'], _pc.document['comp_nchan'], _pc.document['setpointings'], _pc.document['ptgfile'], _pc.document['integration'], _pc.document['direction'], _pc.document['mapsize'], _pc.document['maptype'], _pc.document['pointingspacing'], _pc.document['caldirection'], _pc.document['calflux'], _pc.document['obsmode'], _pc.document['refdate'], _pc.document['hourangle'], _pc.document['totaltime'], _pc.document['antennalist'], _pc.document['sdantlist'], _pc.document['sdant'], _pc.document['outframe'], _pc.document['thermalnoise'], _pc.document['user_pwv'], _pc.document['t_ground'], _pc.document['t_sky'], _pc.document['tau0'], _pc.document['seed'], _pc.document['leakage'], _pc.document['graphics'], _pc.document['verbose'], _pc.document['overwrite'] )
                  ^^^^^^^^^^^^^^^^^^^^^^^^^^^^^^^^^^^^^^^^^^^^^^^^^^^^^^^^^^^^^^^^^^^^^^^^^^^^^^^^^^^^^^^^^^^^^^^^^^^^^^^^^^^^^^^^^^^^^^^^^^^^^^^^^^^^^^^^^^^^^^^^^^^^^^^^^^^^^^^^^^^^^^^^^^^^^^^^^^^^^^^^^^^^^^^^^^^^^^^^^^^^^^^^^^^^^^^^^^^^^^^^^^^^^^^^^^^^^^^^^^^^^^^^^^^^^^^^^^^^^^^^^^^^^^^^^^^^^^^^^^^^^^^^^^^^^^^^^^^^^^^^^^^^^^^^^^^^^^^^^^^^^^^^^^^^^^^^^^^^^^^^^^^^^^^^^^^^^^^^^^^^^^^^^^^^^^^^^^^^^^^^^^^^^^^^^^^^^^^^^^^^^^^^^^^^^^^^^^^^^^^^^^^^^^^^^^^^^^^^^^^^^^^^^^^^^^^^^^^^^^^^^^^^^^^^^^^^^^^^^^^^^^^^^^^^^^^^^^^^^^^^^^^^^^^^^^^^^^^^^^^^^^^^^^^^^^^^^^^^^^^^^^^^^^^^^^^^^^^^^^^^^^^^^^^^^^^^^^^^^^^^^^^^^^^^^^^^^^^^^^^^^^^^^^^^^^^^^^^^^^^^^^^^^^^^^^^^^^^^^^^^^^^^^^^^^^^^^^^^^^^^^^^^^^^^^^^^^^^^^^^^^^^^^^^^^^^^^^^^^^^^^^^^^^^^^^^^^^^^^^^^^^^^^^^^^^^^^^^^^^^^^^^^^^^^^^^^^^^^^^^^^^^^^^^^^^^^^^^^^^^^^^^^^^^^^^^^^^^^^^^^^^^^^^^^^^^^^^^^^^^^^^^^^^^^^^^^^^^^^^^^^^^^^^^^^^^^^^^^^^^^^^^^^^^^^^^^^^^^^^^^^^^^^^^^^^^^^^^^^^^^^^^^^^^^^^^^^^^^^^^^^^^^^^^^^^^^^^^^^^^^^^^^^^^^^^^^^^^^^^^^^^^^^^^^^^^^^^^^^^^^^^^
/usr/local/lib/python3.12/site-packages/casatasks/private/task_simobserve.py:749: in simobserve
    discard = util.statim(modelflat,plot=True,incell=model_cell)
(10 more lines...)
Collapse Failed test_task_simobserve simobserve_noise.testNZ_sdAtm_dnu
< 1 sec
AssertionError: None
test_task_simobserve.py:1495: in testNZ_sdAtm_dnu
    simobserve(project=self.project,skymodel=self.inimage,
/usr/local/lib/python3.12/site-packages/casatasks/simobserve.py:350: in __call__
    task_result = _simobserve_t( _pc.document['project'], _pc.document['skymodel'], _pc.document['inbright'], _pc.document['indirection'], _pc.document['incell'], _pc.document['incenter'], _pc.document['inwidth'], _pc.document['complist'], _pc.document['compwidth'], _pc.document['comp_nchan'], _pc.document['setpointings'], _pc.document['ptgfile'], _pc.document['integration'], _pc.document['direction'], _pc.document['mapsize'], _pc.document['maptype'], _pc.document['pointingspacing'], _pc.document['caldirection'], _pc.document['calflux'], _pc.document['obsmode'], _pc.document['refdate'], _pc.document['hourangle'], _pc.document['totaltime'], _pc.document['antennalist'], _pc.document['sdantlist'], _pc.document['sdant'], _pc.document['outframe'], _pc.document['thermalnoise'], _pc.document['user_pwv'], _pc.document['t_ground'], _pc.document['t_sky'], _pc.document['tau0'], _pc.document['seed'], _pc.document['leakage'], _pc.document['graphics'], _pc.document['verbose'], _pc.document['overwrite'] )
                  ^^^^^^^^^^^^^^^^^^^^^^^^^^^^^^^^^^^^^^^^^^^^^^^^^^^^^^^^^^^^^^^^^^^^^^^^^^^^^^^^^^^^^^^^^^^^^^^^^^^^^^^^^^^^^^^^^^^^^^^^^^^^^^^^^^^^^^^^^^^^^^^^^^^^^^^^^^^^^^^^^^^^^^^^^^^^^^^^^^^^^^^^^^^^^^^^^^^^^^^^^^^^^^^^^^^^^^^^^^^^^^^^^^^^^^^^^^^^^^^^^^^^^^^^^^^^^^^^^^^^^^^^^^^^^^^^^^^^^^^^^^^^^^^^^^^^^^^^^^^^^^^^^^^^^^^^^^^^^^^^^^^^^^^^^^^^^^^^^^^^^^^^^^^^^^^^^^^^^^^^^^^^^^^^^^^^^^^^^^^^^^^^^^^^^^^^^^^^^^^^^^^^^^^^^^^^^^^^^^^^^^^^^^^^^^^^^^^^^^^^^^^^^^^^^^^^^^^^^^^^^^^^^^^^^^^^^^^^^^^^^^^^^^^^^^^^^^^^^^^^^^^^^^^^^^^^^^^^^^^^^^^^^^^^^^^^^^^^^^^^^^^^^^^^^^^^^^^^^^^^^^^^^^^^^^^^^^^^^^^^^^^^^^^^^^^^^^^^^^^^^^^^^^^^^^^^^^^^^^^^^^^^^^^^^^^^^^^^^^^^^^^^^^^^^^^^^^^^^^^^^^^^^^^^^^^^^^^^^^^^^^^^^^^^^^^^^^^^^^^^^^^^^^^^^^^^^^^^^^^^^^^^^^^^^^^^^^^^^^^^^^^^^^^^^^^^^^^^^^^^^^^^^^^^^^^^^^^^^^^^^^^^^^^^^^^^^^^^^^^^^^^^^^^^^^^^^^^^^^^^^^^^^^^^^^^^^^^^^^^^^^^^^^^^^^^^^^^^^^^^^^^^^^^^^^^^^^^^^^^^^^^^^^^^^^^^^^^^^^^^^^^^^^^^^^^^^^^^^^^^^^^^^^^^^^^^^^^^^^^^^^^^^^^^^^^^^^^^^^^^^^^^^^^^^^^^^^^^^^^^^^^^^^^
/usr/local/lib/python3.12/site-packages/casatasks/private/task_simobserve.py:749: in simobserve
    discard = util.statim(modelflat,plot=True,incell=model_cell)
(10 more lines...)
Collapse Failed test_task_simobserve simobserve_noise.testNZ_sdAtm_el
< 1 sec
AssertionError: None
test_task_simobserve.py:1557: in testNZ_sdAtm_el
    simobserve(project=self.project,skymodel=self.inimage,
/usr/local/lib/python3.12/site-packages/casatasks/simobserve.py:350: in __call__
    task_result = _simobserve_t( _pc.document['project'], _pc.document['skymodel'], _pc.document['inbright'], _pc.document['indirection'], _pc.document['incell'], _pc.document['incenter'], _pc.document['inwidth'], _pc.document['complist'], _pc.document['compwidth'], _pc.document['comp_nchan'], _pc.document['setpointings'], _pc.document['ptgfile'], _pc.document['integration'], _pc.document['direction'], _pc.document['mapsize'], _pc.document['maptype'], _pc.document['pointingspacing'], _pc.document['caldirection'], _pc.document['calflux'], _pc.document['obsmode'], _pc.document['refdate'], _pc.document['hourangle'], _pc.document['totaltime'], _pc.document['antennalist'], _pc.document['sdantlist'], _pc.document['sdant'], _pc.document['outframe'], _pc.document['thermalnoise'], _pc.document['user_pwv'], _pc.document['t_ground'], _pc.document['t_sky'], _pc.document['tau0'], _pc.document['seed'], _pc.document['leakage'], _pc.document['graphics'], _pc.document['verbose'], _pc.document['overwrite'] )
                  ^^^^^^^^^^^^^^^^^^^^^^^^^^^^^^^^^^^^^^^^^^^^^^^^^^^^^^^^^^^^^^^^^^^^^^^^^^^^^^^^^^^^^^^^^^^^^^^^^^^^^^^^^^^^^^^^^^^^^^^^^^^^^^^^^^^^^^^^^^^^^^^^^^^^^^^^^^^^^^^^^^^^^^^^^^^^^^^^^^^^^^^^^^^^^^^^^^^^^^^^^^^^^^^^^^^^^^^^^^^^^^^^^^^^^^^^^^^^^^^^^^^^^^^^^^^^^^^^^^^^^^^^^^^^^^^^^^^^^^^^^^^^^^^^^^^^^^^^^^^^^^^^^^^^^^^^^^^^^^^^^^^^^^^^^^^^^^^^^^^^^^^^^^^^^^^^^^^^^^^^^^^^^^^^^^^^^^^^^^^^^^^^^^^^^^^^^^^^^^^^^^^^^^^^^^^^^^^^^^^^^^^^^^^^^^^^^^^^^^^^^^^^^^^^^^^^^^^^^^^^^^^^^^^^^^^^^^^^^^^^^^^^^^^^^^^^^^^^^^^^^^^^^^^^^^^^^^^^^^^^^^^^^^^^^^^^^^^^^^^^^^^^^^^^^^^^^^^^^^^^^^^^^^^^^^^^^^^^^^^^^^^^^^^^^^^^^^^^^^^^^^^^^^^^^^^^^^^^^^^^^^^^^^^^^^^^^^^^^^^^^^^^^^^^^^^^^^^^^^^^^^^^^^^^^^^^^^^^^^^^^^^^^^^^^^^^^^^^^^^^^^^^^^^^^^^^^^^^^^^^^^^^^^^^^^^^^^^^^^^^^^^^^^^^^^^^^^^^^^^^^^^^^^^^^^^^^^^^^^^^^^^^^^^^^^^^^^^^^^^^^^^^^^^^^^^^^^^^^^^^^^^^^^^^^^^^^^^^^^^^^^^^^^^^^^^^^^^^^^^^^^^^^^^^^^^^^^^^^^^^^^^^^^^^^^^^^^^^^^^^^^^^^^^^^^^^^^^^^^^^^^^^^^^^^^^^^^^^^^^^^^^^^^^^^^^^^^^^^^^^^^^^^^^^^^^^^^^^^^^^^^^^^^^
/usr/local/lib/python3.12/site-packages/casatasks/private/task_simobserve.py:749: in simobserve
    discard = util.statim(modelflat,plot=True,incell=model_cell)
(10 more lines...)
Collapse Failed test_task_simobserve simobserve_noise.testNZ_sdAtm_pwv
< 1 sec
AssertionError: None
test_task_simobserve.py:1467: in testNZ_sdAtm_pwv
    simobserve(project=self.project,skymodel=self.skymodel,
/usr/local/lib/python3.12/site-packages/casatasks/simobserve.py:350: in __call__
    task_result = _simobserve_t( _pc.document['project'], _pc.document['skymodel'], _pc.document['inbright'], _pc.document['indirection'], _pc.document['incell'], _pc.document['incenter'], _pc.document['inwidth'], _pc.document['complist'], _pc.document['compwidth'], _pc.document['comp_nchan'], _pc.document['setpointings'], _pc.document['ptgfile'], _pc.document['integration'], _pc.document['direction'], _pc.document['mapsize'], _pc.document['maptype'], _pc.document['pointingspacing'], _pc.document['caldirection'], _pc.document['calflux'], _pc.document['obsmode'], _pc.document['refdate'], _pc.document['hourangle'], _pc.document['totaltime'], _pc.document['antennalist'], _pc.document['sdantlist'], _pc.document['sdant'], _pc.document['outframe'], _pc.document['thermalnoise'], _pc.document['user_pwv'], _pc.document['t_ground'], _pc.document['t_sky'], _pc.document['tau0'], _pc.document['seed'], _pc.document['leakage'], _pc.document['graphics'], _pc.document['verbose'], _pc.document['overwrite'] )
                  ^^^^^^^^^^^^^^^^^^^^^^^^^^^^^^^^^^^^^^^^^^^^^^^^^^^^^^^^^^^^^^^^^^^^^^^^^^^^^^^^^^^^^^^^^^^^^^^^^^^^^^^^^^^^^^^^^^^^^^^^^^^^^^^^^^^^^^^^^^^^^^^^^^^^^^^^^^^^^^^^^^^^^^^^^^^^^^^^^^^^^^^^^^^^^^^^^^^^^^^^^^^^^^^^^^^^^^^^^^^^^^^^^^^^^^^^^^^^^^^^^^^^^^^^^^^^^^^^^^^^^^^^^^^^^^^^^^^^^^^^^^^^^^^^^^^^^^^^^^^^^^^^^^^^^^^^^^^^^^^^^^^^^^^^^^^^^^^^^^^^^^^^^^^^^^^^^^^^^^^^^^^^^^^^^^^^^^^^^^^^^^^^^^^^^^^^^^^^^^^^^^^^^^^^^^^^^^^^^^^^^^^^^^^^^^^^^^^^^^^^^^^^^^^^^^^^^^^^^^^^^^^^^^^^^^^^^^^^^^^^^^^^^^^^^^^^^^^^^^^^^^^^^^^^^^^^^^^^^^^^^^^^^^^^^^^^^^^^^^^^^^^^^^^^^^^^^^^^^^^^^^^^^^^^^^^^^^^^^^^^^^^^^^^^^^^^^^^^^^^^^^^^^^^^^^^^^^^^^^^^^^^^^^^^^^^^^^^^^^^^^^^^^^^^^^^^^^^^^^^^^^^^^^^^^^^^^^^^^^^^^^^^^^^^^^^^^^^^^^^^^^^^^^^^^^^^^^^^^^^^^^^^^^^^^^^^^^^^^^^^^^^^^^^^^^^^^^^^^^^^^^^^^^^^^^^^^^^^^^^^^^^^^^^^^^^^^^^^^^^^^^^^^^^^^^^^^^^^^^^^^^^^^^^^^^^^^^^^^^^^^^^^^^^^^^^^^^^^^^^^^^^^^^^^^^^^^^^^^^^^^^^^^^^^^^^^^^^^^^^^^^^^^^^^^^^^^^^^^^^^^^^^^^^^^^^^^^^^^^^^^^^^^^^^^^^^^^^^^^^^^^^^^^^^^^^^^^^^^^^^^^^^^^^
/usr/local/lib/python3.12/site-packages/casatasks/private/task_simobserve.py:749: in simobserve
    discard = util.statim(modelflat,plot=True,incell=model_cell)
(10 more lines...)
Collapse Failed test_task_simobserve simobserve_noise.testNZ_sdAtm_tint
< 1 sec
AssertionError: None
test_task_simobserve.py:1527: in testNZ_sdAtm_tint
    simobserve(project=self.project,skymodel=self.inimage,
/usr/local/lib/python3.12/site-packages/casatasks/simobserve.py:350: in __call__
    task_result = _simobserve_t( _pc.document['project'], _pc.document['skymodel'], _pc.document['inbright'], _pc.document['indirection'], _pc.document['incell'], _pc.document['incenter'], _pc.document['inwidth'], _pc.document['complist'], _pc.document['compwidth'], _pc.document['comp_nchan'], _pc.document['setpointings'], _pc.document['ptgfile'], _pc.document['integration'], _pc.document['direction'], _pc.document['mapsize'], _pc.document['maptype'], _pc.document['pointingspacing'], _pc.document['caldirection'], _pc.document['calflux'], _pc.document['obsmode'], _pc.document['refdate'], _pc.document['hourangle'], _pc.document['totaltime'], _pc.document['antennalist'], _pc.document['sdantlist'], _pc.document['sdant'], _pc.document['outframe'], _pc.document['thermalnoise'], _pc.document['user_pwv'], _pc.document['t_ground'], _pc.document['t_sky'], _pc.document['tau0'], _pc.document['seed'], _pc.document['leakage'], _pc.document['graphics'], _pc.document['verbose'], _pc.document['overwrite'] )
                  ^^^^^^^^^^^^^^^^^^^^^^^^^^^^^^^^^^^^^^^^^^^^^^^^^^^^^^^^^^^^^^^^^^^^^^^^^^^^^^^^^^^^^^^^^^^^^^^^^^^^^^^^^^^^^^^^^^^^^^^^^^^^^^^^^^^^^^^^^^^^^^^^^^^^^^^^^^^^^^^^^^^^^^^^^^^^^^^^^^^^^^^^^^^^^^^^^^^^^^^^^^^^^^^^^^^^^^^^^^^^^^^^^^^^^^^^^^^^^^^^^^^^^^^^^^^^^^^^^^^^^^^^^^^^^^^^^^^^^^^^^^^^^^^^^^^^^^^^^^^^^^^^^^^^^^^^^^^^^^^^^^^^^^^^^^^^^^^^^^^^^^^^^^^^^^^^^^^^^^^^^^^^^^^^^^^^^^^^^^^^^^^^^^^^^^^^^^^^^^^^^^^^^^^^^^^^^^^^^^^^^^^^^^^^^^^^^^^^^^^^^^^^^^^^^^^^^^^^^^^^^^^^^^^^^^^^^^^^^^^^^^^^^^^^^^^^^^^^^^^^^^^^^^^^^^^^^^^^^^^^^^^^^^^^^^^^^^^^^^^^^^^^^^^^^^^^^^^^^^^^^^^^^^^^^^^^^^^^^^^^^^^^^^^^^^^^^^^^^^^^^^^^^^^^^^^^^^^^^^^^^^^^^^^^^^^^^^^^^^^^^^^^^^^^^^^^^^^^^^^^^^^^^^^^^^^^^^^^^^^^^^^^^^^^^^^^^^^^^^^^^^^^^^^^^^^^^^^^^^^^^^^^^^^^^^^^^^^^^^^^^^^^^^^^^^^^^^^^^^^^^^^^^^^^^^^^^^^^^^^^^^^^^^^^^^^^^^^^^^^^^^^^^^^^^^^^^^^^^^^^^^^^^^^^^^^^^^^^^^^^^^^^^^^^^^^^^^^^^^^^^^^^^^^^^^^^^^^^^^^^^^^^^^^^^^^^^^^^^^^^^^^^^^^^^^^^^^^^^^^^^^^^^^^^^^^^^^^^^^^^^^^^^^^^^^^^^^^^^^^^^^^^^^^^^^^^^^^^^^^^^^^^^^^
/usr/local/lib/python3.12/site-packages/casatasks/private/task_simobserve.py:749: in simobserve
    discard = util.statim(modelflat,plot=True,incell=model_cell)
(10 more lines...)
Collapse Failed test_task_simobserve simobserve_noise.testNZ_sdMan
< 1 sec
AssertionError: None
test_task_simobserve.py:1257: in testNZ_sdMan
    simobserve(project=self.project,skymodel=self.skymodel,
/usr/local/lib/python3.12/site-packages/casatasks/simobserve.py:350: in __call__
    task_result = _simobserve_t( _pc.document['project'], _pc.document['skymodel'], _pc.document['inbright'], _pc.document['indirection'], _pc.document['incell'], _pc.document['incenter'], _pc.document['inwidth'], _pc.document['complist'], _pc.document['compwidth'], _pc.document['comp_nchan'], _pc.document['setpointings'], _pc.document['ptgfile'], _pc.document['integration'], _pc.document['direction'], _pc.document['mapsize'], _pc.document['maptype'], _pc.document['pointingspacing'], _pc.document['caldirection'], _pc.document['calflux'], _pc.document['obsmode'], _pc.document['refdate'], _pc.document['hourangle'], _pc.document['totaltime'], _pc.document['antennalist'], _pc.document['sdantlist'], _pc.document['sdant'], _pc.document['outframe'], _pc.document['thermalnoise'], _pc.document['user_pwv'], _pc.document['t_ground'], _pc.document['t_sky'], _pc.document['tau0'], _pc.document['seed'], _pc.document['leakage'], _pc.document['graphics'], _pc.document['verbose'], _pc.document['overwrite'] )
                  ^^^^^^^^^^^^^^^^^^^^^^^^^^^^^^^^^^^^^^^^^^^^^^^^^^^^^^^^^^^^^^^^^^^^^^^^^^^^^^^^^^^^^^^^^^^^^^^^^^^^^^^^^^^^^^^^^^^^^^^^^^^^^^^^^^^^^^^^^^^^^^^^^^^^^^^^^^^^^^^^^^^^^^^^^^^^^^^^^^^^^^^^^^^^^^^^^^^^^^^^^^^^^^^^^^^^^^^^^^^^^^^^^^^^^^^^^^^^^^^^^^^^^^^^^^^^^^^^^^^^^^^^^^^^^^^^^^^^^^^^^^^^^^^^^^^^^^^^^^^^^^^^^^^^^^^^^^^^^^^^^^^^^^^^^^^^^^^^^^^^^^^^^^^^^^^^^^^^^^^^^^^^^^^^^^^^^^^^^^^^^^^^^^^^^^^^^^^^^^^^^^^^^^^^^^^^^^^^^^^^^^^^^^^^^^^^^^^^^^^^^^^^^^^^^^^^^^^^^^^^^^^^^^^^^^^^^^^^^^^^^^^^^^^^^^^^^^^^^^^^^^^^^^^^^^^^^^^^^^^^^^^^^^^^^^^^^^^^^^^^^^^^^^^^^^^^^^^^^^^^^^^^^^^^^^^^^^^^^^^^^^^^^^^^^^^^^^^^^^^^^^^^^^^^^^^^^^^^^^^^^^^^^^^^^^^^^^^^^^^^^^^^^^^^^^^^^^^^^^^^^^^^^^^^^^^^^^^^^^^^^^^^^^^^^^^^^^^^^^^^^^^^^^^^^^^^^^^^^^^^^^^^^^^^^^^^^^^^^^^^^^^^^^^^^^^^^^^^^^^^^^^^^^^^^^^^^^^^^^^^^^^^^^^^^^^^^^^^^^^^^^^^^^^^^^^^^^^^^^^^^^^^^^^^^^^^^^^^^^^^^^^^^^^^^^^^^^^^^^^^^^^^^^^^^^^^^^^^^^^^^^^^^^^^^^^^^^^^^^^^^^^^^^^^^^^^^^^^^^^^^^^^^^^^^^^^^^^^^^^^^^^^^^^^^^^^^^^^^^^^^^^^^^^^^^^^^^^^^^^^^^^^^^^
/usr/local/lib/python3.12/site-packages/casatasks/private/task_simobserve.py:749: in simobserve
    discard = util.statim(modelflat,plot=True,incell=model_cell)
(10 more lines...)
Collapse Failed test_task_simobserve simobserve_noise.testNZ_sdMan_dnu
< 1 sec
AssertionError: None
test_task_simobserve.py:1313: in testNZ_sdMan_dnu
    simobserve(project=self.project,skymodel=self.inimage,
/usr/local/lib/python3.12/site-packages/casatasks/simobserve.py:350: in __call__
    task_result = _simobserve_t( _pc.document['project'], _pc.document['skymodel'], _pc.document['inbright'], _pc.document['indirection'], _pc.document['incell'], _pc.document['incenter'], _pc.document['inwidth'], _pc.document['complist'], _pc.document['compwidth'], _pc.document['comp_nchan'], _pc.document['setpointings'], _pc.document['ptgfile'], _pc.document['integration'], _pc.document['direction'], _pc.document['mapsize'], _pc.document['maptype'], _pc.document['pointingspacing'], _pc.document['caldirection'], _pc.document['calflux'], _pc.document['obsmode'], _pc.document['refdate'], _pc.document['hourangle'], _pc.document['totaltime'], _pc.document['antennalist'], _pc.document['sdantlist'], _pc.document['sdant'], _pc.document['outframe'], _pc.document['thermalnoise'], _pc.document['user_pwv'], _pc.document['t_ground'], _pc.document['t_sky'], _pc.document['tau0'], _pc.document['seed'], _pc.document['leakage'], _pc.document['graphics'], _pc.document['verbose'], _pc.document['overwrite'] )
                  ^^^^^^^^^^^^^^^^^^^^^^^^^^^^^^^^^^^^^^^^^^^^^^^^^^^^^^^^^^^^^^^^^^^^^^^^^^^^^^^^^^^^^^^^^^^^^^^^^^^^^^^^^^^^^^^^^^^^^^^^^^^^^^^^^^^^^^^^^^^^^^^^^^^^^^^^^^^^^^^^^^^^^^^^^^^^^^^^^^^^^^^^^^^^^^^^^^^^^^^^^^^^^^^^^^^^^^^^^^^^^^^^^^^^^^^^^^^^^^^^^^^^^^^^^^^^^^^^^^^^^^^^^^^^^^^^^^^^^^^^^^^^^^^^^^^^^^^^^^^^^^^^^^^^^^^^^^^^^^^^^^^^^^^^^^^^^^^^^^^^^^^^^^^^^^^^^^^^^^^^^^^^^^^^^^^^^^^^^^^^^^^^^^^^^^^^^^^^^^^^^^^^^^^^^^^^^^^^^^^^^^^^^^^^^^^^^^^^^^^^^^^^^^^^^^^^^^^^^^^^^^^^^^^^^^^^^^^^^^^^^^^^^^^^^^^^^^^^^^^^^^^^^^^^^^^^^^^^^^^^^^^^^^^^^^^^^^^^^^^^^^^^^^^^^^^^^^^^^^^^^^^^^^^^^^^^^^^^^^^^^^^^^^^^^^^^^^^^^^^^^^^^^^^^^^^^^^^^^^^^^^^^^^^^^^^^^^^^^^^^^^^^^^^^^^^^^^^^^^^^^^^^^^^^^^^^^^^^^^^^^^^^^^^^^^^^^^^^^^^^^^^^^^^^^^^^^^^^^^^^^^^^^^^^^^^^^^^^^^^^^^^^^^^^^^^^^^^^^^^^^^^^^^^^^^^^^^^^^^^^^^^^^^^^^^^^^^^^^^^^^^^^^^^^^^^^^^^^^^^^^^^^^^^^^^^^^^^^^^^^^^^^^^^^^^^^^^^^^^^^^^^^^^^^^^^^^^^^^^^^^^^^^^^^^^^^^^^^^^^^^^^^^^^^^^^^^^^^^^^^^^^^^^^^^^^^^^^^^^^^^^^^^^^^^^^^^^^^^^^^^^^^^^^^^^^^^^^^^^^^^^^^^^^
/usr/local/lib/python3.12/site-packages/casatasks/private/task_simobserve.py:749: in simobserve
    discard = util.statim(modelflat,plot=True,incell=model_cell)
(10 more lines...)
Collapse Failed test_task_simobserve simobserve_noise.testNZ_sdMan_el
< 1 sec
AssertionError: None
test_task_simobserve.py:1374: in testNZ_sdMan_el
    simobserve(project=self.project,skymodel=self.inimage,
/usr/local/lib/python3.12/site-packages/casatasks/simobserve.py:350: in __call__
    task_result = _simobserve_t( _pc.document['project'], _pc.document['skymodel'], _pc.document['inbright'], _pc.document['indirection'], _pc.document['incell'], _pc.document['incenter'], _pc.document['inwidth'], _pc.document['complist'], _pc.document['compwidth'], _pc.document['comp_nchan'], _pc.document['setpointings'], _pc.document['ptgfile'], _pc.document['integration'], _pc.document['direction'], _pc.document['mapsize'], _pc.document['maptype'], _pc.document['pointingspacing'], _pc.document['caldirection'], _pc.document['calflux'], _pc.document['obsmode'], _pc.document['refdate'], _pc.document['hourangle'], _pc.document['totaltime'], _pc.document['antennalist'], _pc.document['sdantlist'], _pc.document['sdant'], _pc.document['outframe'], _pc.document['thermalnoise'], _pc.document['user_pwv'], _pc.document['t_ground'], _pc.document['t_sky'], _pc.document['tau0'], _pc.document['seed'], _pc.document['leakage'], _pc.document['graphics'], _pc.document['verbose'], _pc.document['overwrite'] )
                  ^^^^^^^^^^^^^^^^^^^^^^^^^^^^^^^^^^^^^^^^^^^^^^^^^^^^^^^^^^^^^^^^^^^^^^^^^^^^^^^^^^^^^^^^^^^^^^^^^^^^^^^^^^^^^^^^^^^^^^^^^^^^^^^^^^^^^^^^^^^^^^^^^^^^^^^^^^^^^^^^^^^^^^^^^^^^^^^^^^^^^^^^^^^^^^^^^^^^^^^^^^^^^^^^^^^^^^^^^^^^^^^^^^^^^^^^^^^^^^^^^^^^^^^^^^^^^^^^^^^^^^^^^^^^^^^^^^^^^^^^^^^^^^^^^^^^^^^^^^^^^^^^^^^^^^^^^^^^^^^^^^^^^^^^^^^^^^^^^^^^^^^^^^^^^^^^^^^^^^^^^^^^^^^^^^^^^^^^^^^^^^^^^^^^^^^^^^^^^^^^^^^^^^^^^^^^^^^^^^^^^^^^^^^^^^^^^^^^^^^^^^^^^^^^^^^^^^^^^^^^^^^^^^^^^^^^^^^^^^^^^^^^^^^^^^^^^^^^^^^^^^^^^^^^^^^^^^^^^^^^^^^^^^^^^^^^^^^^^^^^^^^^^^^^^^^^^^^^^^^^^^^^^^^^^^^^^^^^^^^^^^^^^^^^^^^^^^^^^^^^^^^^^^^^^^^^^^^^^^^^^^^^^^^^^^^^^^^^^^^^^^^^^^^^^^^^^^^^^^^^^^^^^^^^^^^^^^^^^^^^^^^^^^^^^^^^^^^^^^^^^^^^^^^^^^^^^^^^^^^^^^^^^^^^^^^^^^^^^^^^^^^^^^^^^^^^^^^^^^^^^^^^^^^^^^^^^^^^^^^^^^^^^^^^^^^^^^^^^^^^^^^^^^^^^^^^^^^^^^^^^^^^^^^^^^^^^^^^^^^^^^^^^^^^^^^^^^^^^^^^^^^^^^^^^^^^^^^^^^^^^^^^^^^^^^^^^^^^^^^^^^^^^^^^^^^^^^^^^^^^^^^^^^^^^^^^^^^^^^^^^^^^^^^^^^^^^^^^^^^^^^^^^^^^^^^^^^^^^^^^^^^^^^^
/usr/local/lib/python3.12/site-packages/casatasks/private/task_simobserve.py:749: in simobserve
    discard = util.statim(modelflat,plot=True,incell=model_cell)
(10 more lines...)
Collapse Failed test_task_simobserve simobserve_noise.testNZ_sdMan_tau
< 1 sec
AssertionError: None
test_task_simobserve.py:1285: in testNZ_sdMan_tau
    simobserve(project=self.project,skymodel=self.skymodel,
/usr/local/lib/python3.12/site-packages/casatasks/simobserve.py:350: in __call__
    task_result = _simobserve_t( _pc.document['project'], _pc.document['skymodel'], _pc.document['inbright'], _pc.document['indirection'], _pc.document['incell'], _pc.document['incenter'], _pc.document['inwidth'], _pc.document['complist'], _pc.document['compwidth'], _pc.document['comp_nchan'], _pc.document['setpointings'], _pc.document['ptgfile'], _pc.document['integration'], _pc.document['direction'], _pc.document['mapsize'], _pc.document['maptype'], _pc.document['pointingspacing'], _pc.document['caldirection'], _pc.document['calflux'], _pc.document['obsmode'], _pc.document['refdate'], _pc.document['hourangle'], _pc.document['totaltime'], _pc.document['antennalist'], _pc.document['sdantlist'], _pc.document['sdant'], _pc.document['outframe'], _pc.document['thermalnoise'], _pc.document['user_pwv'], _pc.document['t_ground'], _pc.document['t_sky'], _pc.document['tau0'], _pc.document['seed'], _pc.document['leakage'], _pc.document['graphics'], _pc.document['verbose'], _pc.document['overwrite'] )
                  ^^^^^^^^^^^^^^^^^^^^^^^^^^^^^^^^^^^^^^^^^^^^^^^^^^^^^^^^^^^^^^^^^^^^^^^^^^^^^^^^^^^^^^^^^^^^^^^^^^^^^^^^^^^^^^^^^^^^^^^^^^^^^^^^^^^^^^^^^^^^^^^^^^^^^^^^^^^^^^^^^^^^^^^^^^^^^^^^^^^^^^^^^^^^^^^^^^^^^^^^^^^^^^^^^^^^^^^^^^^^^^^^^^^^^^^^^^^^^^^^^^^^^^^^^^^^^^^^^^^^^^^^^^^^^^^^^^^^^^^^^^^^^^^^^^^^^^^^^^^^^^^^^^^^^^^^^^^^^^^^^^^^^^^^^^^^^^^^^^^^^^^^^^^^^^^^^^^^^^^^^^^^^^^^^^^^^^^^^^^^^^^^^^^^^^^^^^^^^^^^^^^^^^^^^^^^^^^^^^^^^^^^^^^^^^^^^^^^^^^^^^^^^^^^^^^^^^^^^^^^^^^^^^^^^^^^^^^^^^^^^^^^^^^^^^^^^^^^^^^^^^^^^^^^^^^^^^^^^^^^^^^^^^^^^^^^^^^^^^^^^^^^^^^^^^^^^^^^^^^^^^^^^^^^^^^^^^^^^^^^^^^^^^^^^^^^^^^^^^^^^^^^^^^^^^^^^^^^^^^^^^^^^^^^^^^^^^^^^^^^^^^^^^^^^^^^^^^^^^^^^^^^^^^^^^^^^^^^^^^^^^^^^^^^^^^^^^^^^^^^^^^^^^^^^^^^^^^^^^^^^^^^^^^^^^^^^^^^^^^^^^^^^^^^^^^^^^^^^^^^^^^^^^^^^^^^^^^^^^^^^^^^^^^^^^^^^^^^^^^^^^^^^^^^^^^^^^^^^^^^^^^^^^^^^^^^^^^^^^^^^^^^^^^^^^^^^^^^^^^^^^^^^^^^^^^^^^^^^^^^^^^^^^^^^^^^^^^^^^^^^^^^^^^^^^^^^^^^^^^^^^^^^^^^^^^^^^^^^^^^^^^^^^^^^^^^^^^^^^^^^^^^^^^^^^^^^^^^^^^^^^^^^^^
/usr/local/lib/python3.12/site-packages/casatasks/private/task_simobserve.py:749: in simobserve
    discard = util.statim(modelflat,plot=True,incell=model_cell)
(10 more lines...)
Collapse Failed test_task_simobserve simobserve_noise.testNZ_sdMan_tint
< 1 sec
AssertionError: None
test_task_simobserve.py:1344: in testNZ_sdMan_tint
    simobserve(project=self.project,skymodel=self.inimage,
/usr/local/lib/python3.12/site-packages/casatasks/simobserve.py:350: in __call__
    task_result = _simobserve_t( _pc.document['project'], _pc.document['skymodel'], _pc.document['inbright'], _pc.document['indirection'], _pc.document['incell'], _pc.document['incenter'], _pc.document['inwidth'], _pc.document['complist'], _pc.document['compwidth'], _pc.document['comp_nchan'], _pc.document['setpointings'], _pc.document['ptgfile'], _pc.document['integration'], _pc.document['direction'], _pc.document['mapsize'], _pc.document['maptype'], _pc.document['pointingspacing'], _pc.document['caldirection'], _pc.document['calflux'], _pc.document['obsmode'], _pc.document['refdate'], _pc.document['hourangle'], _pc.document['totaltime'], _pc.document['antennalist'], _pc.document['sdantlist'], _pc.document['sdant'], _pc.document['outframe'], _pc.document['thermalnoise'], _pc.document['user_pwv'], _pc.document['t_ground'], _pc.document['t_sky'], _pc.document['tau0'], _pc.document['seed'], _pc.document['leakage'], _pc.document['graphics'], _pc.document['verbose'], _pc.document['overwrite'] )
                  ^^^^^^^^^^^^^^^^^^^^^^^^^^^^^^^^^^^^^^^^^^^^^^^^^^^^^^^^^^^^^^^^^^^^^^^^^^^^^^^^^^^^^^^^^^^^^^^^^^^^^^^^^^^^^^^^^^^^^^^^^^^^^^^^^^^^^^^^^^^^^^^^^^^^^^^^^^^^^^^^^^^^^^^^^^^^^^^^^^^^^^^^^^^^^^^^^^^^^^^^^^^^^^^^^^^^^^^^^^^^^^^^^^^^^^^^^^^^^^^^^^^^^^^^^^^^^^^^^^^^^^^^^^^^^^^^^^^^^^^^^^^^^^^^^^^^^^^^^^^^^^^^^^^^^^^^^^^^^^^^^^^^^^^^^^^^^^^^^^^^^^^^^^^^^^^^^^^^^^^^^^^^^^^^^^^^^^^^^^^^^^^^^^^^^^^^^^^^^^^^^^^^^^^^^^^^^^^^^^^^^^^^^^^^^^^^^^^^^^^^^^^^^^^^^^^^^^^^^^^^^^^^^^^^^^^^^^^^^^^^^^^^^^^^^^^^^^^^^^^^^^^^^^^^^^^^^^^^^^^^^^^^^^^^^^^^^^^^^^^^^^^^^^^^^^^^^^^^^^^^^^^^^^^^^^^^^^^^^^^^^^^^^^^^^^^^^^^^^^^^^^^^^^^^^^^^^^^^^^^^^^^^^^^^^^^^^^^^^^^^^^^^^^^^^^^^^^^^^^^^^^^^^^^^^^^^^^^^^^^^^^^^^^^^^^^^^^^^^^^^^^^^^^^^^^^^^^^^^^^^^^^^^^^^^^^^^^^^^^^^^^^^^^^^^^^^^^^^^^^^^^^^^^^^^^^^^^^^^^^^^^^^^^^^^^^^^^^^^^^^^^^^^^^^^^^^^^^^^^^^^^^^^^^^^^^^^^^^^^^^^^^^^^^^^^^^^^^^^^^^^^^^^^^^^^^^^^^^^^^^^^^^^^^^^^^^^^^^^^^^^^^^^^^^^^^^^^^^^^^^^^^^^^^^^^^^^^^^^^^^^^^^^^^^^^^^^^^^^^^^^^^^^^^^^^^^^^^^^^^^^^^^^^^
/usr/local/lib/python3.12/site-packages/casatasks/private/task_simobserve.py:749: in simobserve
    discard = util.statim(modelflat,plot=True,incell=model_cell)
(10 more lines...)
Collapse Failed test_task_simobserve simobserve_sky.testSky_almaptg
4 secs
AssertionError: None
test_task_simobserve.py:317: in testSky_almaptg
    simobserve(project=self.project,skymodel=skymodel,
/usr/local/lib/python3.12/site-packages/casatasks/simobserve.py:350: in __call__
    task_result = _simobserve_t( _pc.document['project'], _pc.document['skymodel'], _pc.document['inbright'], _pc.document['indirection'], _pc.document['incell'], _pc.document['incenter'], _pc.document['inwidth'], _pc.document['complist'], _pc.document['compwidth'], _pc.document['comp_nchan'], _pc.document['setpointings'], _pc.document['ptgfile'], _pc.document['integration'], _pc.document['direction'], _pc.document['mapsize'], _pc.document['maptype'], _pc.document['pointingspacing'], _pc.document['caldirection'], _pc.document['calflux'], _pc.document['obsmode'], _pc.document['refdate'], _pc.document['hourangle'], _pc.document['totaltime'], _pc.document['antennalist'], _pc.document['sdantlist'], _pc.document['sdant'], _pc.document['outframe'], _pc.document['thermalnoise'], _pc.document['user_pwv'], _pc.document['t_ground'], _pc.document['t_sky'], _pc.document['tau0'], _pc.document['seed'], _pc.document['leakage'], _pc.document['graphics'], _pc.document['verbose'], _pc.document['overwrite'] )
                  ^^^^^^^^^^^^^^^^^^^^^^^^^^^^^^^^^^^^^^^^^^^^^^^^^^^^^^^^^^^^^^^^^^^^^^^^^^^^^^^^^^^^^^^^^^^^^^^^^^^^^^^^^^^^^^^^^^^^^^^^^^^^^^^^^^^^^^^^^^^^^^^^^^^^^^^^^^^^^^^^^^^^^^^^^^^^^^^^^^^^^^^^^^^^^^^^^^^^^^^^^^^^^^^^^^^^^^^^^^^^^^^^^^^^^^^^^^^^^^^^^^^^^^^^^^^^^^^^^^^^^^^^^^^^^^^^^^^^^^^^^^^^^^^^^^^^^^^^^^^^^^^^^^^^^^^^^^^^^^^^^^^^^^^^^^^^^^^^^^^^^^^^^^^^^^^^^^^^^^^^^^^^^^^^^^^^^^^^^^^^^^^^^^^^^^^^^^^^^^^^^^^^^^^^^^^^^^^^^^^^^^^^^^^^^^^^^^^^^^^^^^^^^^^^^^^^^^^^^^^^^^^^^^^^^^^^^^^^^^^^^^^^^^^^^^^^^^^^^^^^^^^^^^^^^^^^^^^^^^^^^^^^^^^^^^^^^^^^^^^^^^^^^^^^^^^^^^^^^^^^^^^^^^^^^^^^^^^^^^^^^^^^^^^^^^^^^^^^^^^^^^^^^^^^^^^^^^^^^^^^^^^^^^^^^^^^^^^^^^^^^^^^^^^^^^^^^^^^^^^^^^^^^^^^^^^^^^^^^^^^^^^^^^^^^^^^^^^^^^^^^^^^^^^^^^^^^^^^^^^^^^^^^^^^^^^^^^^^^^^^^^^^^^^^^^^^^^^^^^^^^^^^^^^^^^^^^^^^^^^^^^^^^^^^^^^^^^^^^^^^^^^^^^^^^^^^^^^^^^^^^^^^^^^^^^^^^^^^^^^^^^^^^^^^^^^^^^^^^^^^^^^^^^^^^^^^^^^^^^^^^^^^^^^^^^^^^^^^^^^^^^^^^^^^^^^^^^^^^^^^^^^^^^^^^^^^^^^^^^^^^^^^^^^^^^^^^^^^^^^^^^^^^^^^^^^^^^^^^^^^^^^^^^^
/usr/local/lib/python3.12/site-packages/casatasks/private/task_simobserve.py:749: in simobserve
    discard = util.statim(modelflat,plot=True,incell=model_cell)
(10 more lines...)
Collapse Failed test_task_simobserve simobserve_sky.testSky_hexptg
4 secs
AssertionError: None
test_task_simobserve.py:339: in testSky_hexptg
    simobserve(project=self.project,skymodel=skymodel,
/usr/local/lib/python3.12/site-packages/casatasks/simobserve.py:350: in __call__
    task_result = _simobserve_t( _pc.document['project'], _pc.document['skymodel'], _pc.document['inbright'], _pc.document['indirection'], _pc.document['incell'], _pc.document['incenter'], _pc.document['inwidth'], _pc.document['complist'], _pc.document['compwidth'], _pc.document['comp_nchan'], _pc.document['setpointings'], _pc.document['ptgfile'], _pc.document['integration'], _pc.document['direction'], _pc.document['mapsize'], _pc.document['maptype'], _pc.document['pointingspacing'], _pc.document['caldirection'], _pc.document['calflux'], _pc.document['obsmode'], _pc.document['refdate'], _pc.document['hourangle'], _pc.document['totaltime'], _pc.document['antennalist'], _pc.document['sdantlist'], _pc.document['sdant'], _pc.document['outframe'], _pc.document['thermalnoise'], _pc.document['user_pwv'], _pc.document['t_ground'], _pc.document['t_sky'], _pc.document['tau0'], _pc.document['seed'], _pc.document['leakage'], _pc.document['graphics'], _pc.document['verbose'], _pc.document['overwrite'] )
                  ^^^^^^^^^^^^^^^^^^^^^^^^^^^^^^^^^^^^^^^^^^^^^^^^^^^^^^^^^^^^^^^^^^^^^^^^^^^^^^^^^^^^^^^^^^^^^^^^^^^^^^^^^^^^^^^^^^^^^^^^^^^^^^^^^^^^^^^^^^^^^^^^^^^^^^^^^^^^^^^^^^^^^^^^^^^^^^^^^^^^^^^^^^^^^^^^^^^^^^^^^^^^^^^^^^^^^^^^^^^^^^^^^^^^^^^^^^^^^^^^^^^^^^^^^^^^^^^^^^^^^^^^^^^^^^^^^^^^^^^^^^^^^^^^^^^^^^^^^^^^^^^^^^^^^^^^^^^^^^^^^^^^^^^^^^^^^^^^^^^^^^^^^^^^^^^^^^^^^^^^^^^^^^^^^^^^^^^^^^^^^^^^^^^^^^^^^^^^^^^^^^^^^^^^^^^^^^^^^^^^^^^^^^^^^^^^^^^^^^^^^^^^^^^^^^^^^^^^^^^^^^^^^^^^^^^^^^^^^^^^^^^^^^^^^^^^^^^^^^^^^^^^^^^^^^^^^^^^^^^^^^^^^^^^^^^^^^^^^^^^^^^^^^^^^^^^^^^^^^^^^^^^^^^^^^^^^^^^^^^^^^^^^^^^^^^^^^^^^^^^^^^^^^^^^^^^^^^^^^^^^^^^^^^^^^^^^^^^^^^^^^^^^^^^^^^^^^^^^^^^^^^^^^^^^^^^^^^^^^^^^^^^^^^^^^^^^^^^^^^^^^^^^^^^^^^^^^^^^^^^^^^^^^^^^^^^^^^^^^^^^^^^^^^^^^^^^^^^^^^^^^^^^^^^^^^^^^^^^^^^^^^^^^^^^^^^^^^^^^^^^^^^^^^^^^^^^^^^^^^^^^^^^^^^^^^^^^^^^^^^^^^^^^^^^^^^^^^^^^^^^^^^^^^^^^^^^^^^^^^^^^^^^^^^^^^^^^^^^^^^^^^^^^^^^^^^^^^^^^^^^^^^^^^^^^^^^^^^^^^^^^^^^^^^^^^^^^^^^^^^^^^^^^^^^^^^^^^^^^^^^^^^^^^
/usr/local/lib/python3.12/site-packages/casatasks/private/task_simobserve.py:749: in simobserve
    discard = util.statim(modelflat,plot=True,incell=model_cell)
(10 more lines...)
Collapse Failed test_task_simobserve simobserve_sky.testSky_intAll
4 secs
AssertionError: None
test_task_simobserve.py:507: in testSky_intAll
    simobserve(project=self.project,skymodel=skymodel,
/usr/local/lib/python3.12/site-packages/casatasks/simobserve.py:350: in __call__
    task_result = _simobserve_t( _pc.document['project'], _pc.document['skymodel'], _pc.document['inbright'], _pc.document['indirection'], _pc.document['incell'], _pc.document['incenter'], _pc.document['inwidth'], _pc.document['complist'], _pc.document['compwidth'], _pc.document['comp_nchan'], _pc.document['setpointings'], _pc.document['ptgfile'], _pc.document['integration'], _pc.document['direction'], _pc.document['mapsize'], _pc.document['maptype'], _pc.document['pointingspacing'], _pc.document['caldirection'], _pc.document['calflux'], _pc.document['obsmode'], _pc.document['refdate'], _pc.document['hourangle'], _pc.document['totaltime'], _pc.document['antennalist'], _pc.document['sdantlist'], _pc.document['sdant'], _pc.document['outframe'], _pc.document['thermalnoise'], _pc.document['user_pwv'], _pc.document['t_ground'], _pc.document['t_sky'], _pc.document['tau0'], _pc.document['seed'], _pc.document['leakage'], _pc.document['graphics'], _pc.document['verbose'], _pc.document['overwrite'] )
                  ^^^^^^^^^^^^^^^^^^^^^^^^^^^^^^^^^^^^^^^^^^^^^^^^^^^^^^^^^^^^^^^^^^^^^^^^^^^^^^^^^^^^^^^^^^^^^^^^^^^^^^^^^^^^^^^^^^^^^^^^^^^^^^^^^^^^^^^^^^^^^^^^^^^^^^^^^^^^^^^^^^^^^^^^^^^^^^^^^^^^^^^^^^^^^^^^^^^^^^^^^^^^^^^^^^^^^^^^^^^^^^^^^^^^^^^^^^^^^^^^^^^^^^^^^^^^^^^^^^^^^^^^^^^^^^^^^^^^^^^^^^^^^^^^^^^^^^^^^^^^^^^^^^^^^^^^^^^^^^^^^^^^^^^^^^^^^^^^^^^^^^^^^^^^^^^^^^^^^^^^^^^^^^^^^^^^^^^^^^^^^^^^^^^^^^^^^^^^^^^^^^^^^^^^^^^^^^^^^^^^^^^^^^^^^^^^^^^^^^^^^^^^^^^^^^^^^^^^^^^^^^^^^^^^^^^^^^^^^^^^^^^^^^^^^^^^^^^^^^^^^^^^^^^^^^^^^^^^^^^^^^^^^^^^^^^^^^^^^^^^^^^^^^^^^^^^^^^^^^^^^^^^^^^^^^^^^^^^^^^^^^^^^^^^^^^^^^^^^^^^^^^^^^^^^^^^^^^^^^^^^^^^^^^^^^^^^^^^^^^^^^^^^^^^^^^^^^^^^^^^^^^^^^^^^^^^^^^^^^^^^^^^^^^^^^^^^^^^^^^^^^^^^^^^^^^^^^^^^^^^^^^^^^^^^^^^^^^^^^^^^^^^^^^^^^^^^^^^^^^^^^^^^^^^^^^^^^^^^^^^^^^^^^^^^^^^^^^^^^^^^^^^^^^^^^^^^^^^^^^^^^^^^^^^^^^^^^^^^^^^^^^^^^^^^^^^^^^^^^^^^^^^^^^^^^^^^^^^^^^^^^^^^^^^^^^^^^^^^^^^^^^^^^^^^^^^^^^^^^^^^^^^^^^^^^^^^^^^^^^^^^^^^^^^^^^^^^^^^^^^^^^^^^^^^^^^^^^^^^^^^^^^^^^
/usr/local/lib/python3.12/site-packages/casatasks/private/task_simobserve.py:749: in simobserve
    discard = util.statim(modelflat,plot=True,incell=model_cell)
(10 more lines...)
Collapse Failed test_task_simobserve simobserve_sky.testSky_intObs
4 secs
AssertionError: None
test_task_simobserve.py:407: in testSky_intObs
    simobserve(project=self.project,skymodel=skymodel,
/usr/local/lib/python3.12/site-packages/casatasks/simobserve.py:350: in __call__
    task_result = _simobserve_t( _pc.document['project'], _pc.document['skymodel'], _pc.document['inbright'], _pc.document['indirection'], _pc.document['incell'], _pc.document['incenter'], _pc.document['inwidth'], _pc.document['complist'], _pc.document['compwidth'], _pc.document['comp_nchan'], _pc.document['setpointings'], _pc.document['ptgfile'], _pc.document['integration'], _pc.document['direction'], _pc.document['mapsize'], _pc.document['maptype'], _pc.document['pointingspacing'], _pc.document['caldirection'], _pc.document['calflux'], _pc.document['obsmode'], _pc.document['refdate'], _pc.document['hourangle'], _pc.document['totaltime'], _pc.document['antennalist'], _pc.document['sdantlist'], _pc.document['sdant'], _pc.document['outframe'], _pc.document['thermalnoise'], _pc.document['user_pwv'], _pc.document['t_ground'], _pc.document['t_sky'], _pc.document['tau0'], _pc.document['seed'], _pc.document['leakage'], _pc.document['graphics'], _pc.document['verbose'], _pc.document['overwrite'] )
                  ^^^^^^^^^^^^^^^^^^^^^^^^^^^^^^^^^^^^^^^^^^^^^^^^^^^^^^^^^^^^^^^^^^^^^^^^^^^^^^^^^^^^^^^^^^^^^^^^^^^^^^^^^^^^^^^^^^^^^^^^^^^^^^^^^^^^^^^^^^^^^^^^^^^^^^^^^^^^^^^^^^^^^^^^^^^^^^^^^^^^^^^^^^^^^^^^^^^^^^^^^^^^^^^^^^^^^^^^^^^^^^^^^^^^^^^^^^^^^^^^^^^^^^^^^^^^^^^^^^^^^^^^^^^^^^^^^^^^^^^^^^^^^^^^^^^^^^^^^^^^^^^^^^^^^^^^^^^^^^^^^^^^^^^^^^^^^^^^^^^^^^^^^^^^^^^^^^^^^^^^^^^^^^^^^^^^^^^^^^^^^^^^^^^^^^^^^^^^^^^^^^^^^^^^^^^^^^^^^^^^^^^^^^^^^^^^^^^^^^^^^^^^^^^^^^^^^^^^^^^^^^^^^^^^^^^^^^^^^^^^^^^^^^^^^^^^^^^^^^^^^^^^^^^^^^^^^^^^^^^^^^^^^^^^^^^^^^^^^^^^^^^^^^^^^^^^^^^^^^^^^^^^^^^^^^^^^^^^^^^^^^^^^^^^^^^^^^^^^^^^^^^^^^^^^^^^^^^^^^^^^^^^^^^^^^^^^^^^^^^^^^^^^^^^^^^^^^^^^^^^^^^^^^^^^^^^^^^^^^^^^^^^^^^^^^^^^^^^^^^^^^^^^^^^^^^^^^^^^^^^^^^^^^^^^^^^^^^^^^^^^^^^^^^^^^^^^^^^^^^^^^^^^^^^^^^^^^^^^^^^^^^^^^^^^^^^^^^^^^^^^^^^^^^^^^^^^^^^^^^^^^^^^^^^^^^^^^^^^^^^^^^^^^^^^^^^^^^^^^^^^^^^^^^^^^^^^^^^^^^^^^^^^^^^^^^^^^^^^^^^^^^^^^^^^^^^^^^^^^^^^^^^^^^^^^^^^^^^^^^^^^^^^^^^^^^^^^^^^^^^^^^^^^^^^^^^^^^^^^^^^^^^^^^
/usr/local/lib/python3.12/site-packages/casatasks/private/task_simobserve.py:749: in simobserve
    discard = util.statim(modelflat,plot=True,incell=model_cell)
(10 more lines...)
Collapse Failed test_task_simobserve simobserve_sky.testSky_intObs_namedAntlist
3 secs
AssertionError: None
test_task_simobserve.py:430: in testSky_intObs_namedAntlist
    simobserve(project=self.project,skymodel=skymodel,
/usr/local/lib/python3.12/site-packages/casatasks/simobserve.py:350: in __call__
    task_result = _simobserve_t( _pc.document['project'], _pc.document['skymodel'], _pc.document['inbright'], _pc.document['indirection'], _pc.document['incell'], _pc.document['incenter'], _pc.document['inwidth'], _pc.document['complist'], _pc.document['compwidth'], _pc.document['comp_nchan'], _pc.document['setpointings'], _pc.document['ptgfile'], _pc.document['integration'], _pc.document['direction'], _pc.document['mapsize'], _pc.document['maptype'], _pc.document['pointingspacing'], _pc.document['caldirection'], _pc.document['calflux'], _pc.document['obsmode'], _pc.document['refdate'], _pc.document['hourangle'], _pc.document['totaltime'], _pc.document['antennalist'], _pc.document['sdantlist'], _pc.document['sdant'], _pc.document['outframe'], _pc.document['thermalnoise'], _pc.document['user_pwv'], _pc.document['t_ground'], _pc.document['t_sky'], _pc.document['tau0'], _pc.document['seed'], _pc.document['leakage'], _pc.document['graphics'], _pc.document['verbose'], _pc.document['overwrite'] )
                  ^^^^^^^^^^^^^^^^^^^^^^^^^^^^^^^^^^^^^^^^^^^^^^^^^^^^^^^^^^^^^^^^^^^^^^^^^^^^^^^^^^^^^^^^^^^^^^^^^^^^^^^^^^^^^^^^^^^^^^^^^^^^^^^^^^^^^^^^^^^^^^^^^^^^^^^^^^^^^^^^^^^^^^^^^^^^^^^^^^^^^^^^^^^^^^^^^^^^^^^^^^^^^^^^^^^^^^^^^^^^^^^^^^^^^^^^^^^^^^^^^^^^^^^^^^^^^^^^^^^^^^^^^^^^^^^^^^^^^^^^^^^^^^^^^^^^^^^^^^^^^^^^^^^^^^^^^^^^^^^^^^^^^^^^^^^^^^^^^^^^^^^^^^^^^^^^^^^^^^^^^^^^^^^^^^^^^^^^^^^^^^^^^^^^^^^^^^^^^^^^^^^^^^^^^^^^^^^^^^^^^^^^^^^^^^^^^^^^^^^^^^^^^^^^^^^^^^^^^^^^^^^^^^^^^^^^^^^^^^^^^^^^^^^^^^^^^^^^^^^^^^^^^^^^^^^^^^^^^^^^^^^^^^^^^^^^^^^^^^^^^^^^^^^^^^^^^^^^^^^^^^^^^^^^^^^^^^^^^^^^^^^^^^^^^^^^^^^^^^^^^^^^^^^^^^^^^^^^^^^^^^^^^^^^^^^^^^^^^^^^^^^^^^^^^^^^^^^^^^^^^^^^^^^^^^^^^^^^^^^^^^^^^^^^^^^^^^^^^^^^^^^^^^^^^^^^^^^^^^^^^^^^^^^^^^^^^^^^^^^^^^^^^^^^^^^^^^^^^^^^^^^^^^^^^^^^^^^^^^^^^^^^^^^^^^^^^^^^^^^^^^^^^^^^^^^^^^^^^^^^^^^^^^^^^^^^^^^^^^^^^^^^^^^^^^^^^^^^^^^^^^^^^^^^^^^^^^^^^^^^^^^^^^^^^^^^^^^^^^^^^^^^^^^^^^^^^^^^^^^^^^^^^^^^^^^^^^^^^^^^^^^^^^^^^^^^^^^^^^^^^^^^^^^^^^^^^^^^^^^^^^^^^^^
/usr/local/lib/python3.12/site-packages/casatasks/private/task_simobserve.py:749: in simobserve
    discard = util.statim(modelflat,plot=True,incell=model_cell)
(10 more lines...)
Collapse Failed test_task_simobserve simobserve_sky.testSky_sdAll
3 secs
AssertionError: None
test_task_simobserve.py:475: in testSky_sdAll
    simobserve(project=self.project,skymodel=skymodel,
/usr/local/lib/python3.12/site-packages/casatasks/simobserve.py:350: in __call__
    task_result = _simobserve_t( _pc.document['project'], _pc.document['skymodel'], _pc.document['inbright'], _pc.document['indirection'], _pc.document['incell'], _pc.document['incenter'], _pc.document['inwidth'], _pc.document['complist'], _pc.document['compwidth'], _pc.document['comp_nchan'], _pc.document['setpointings'], _pc.document['ptgfile'], _pc.document['integration'], _pc.document['direction'], _pc.document['mapsize'], _pc.document['maptype'], _pc.document['pointingspacing'], _pc.document['caldirection'], _pc.document['calflux'], _pc.document['obsmode'], _pc.document['refdate'], _pc.document['hourangle'], _pc.document['totaltime'], _pc.document['antennalist'], _pc.document['sdantlist'], _pc.document['sdant'], _pc.document['outframe'], _pc.document['thermalnoise'], _pc.document['user_pwv'], _pc.document['t_ground'], _pc.document['t_sky'], _pc.document['tau0'], _pc.document['seed'], _pc.document['leakage'], _pc.document['graphics'], _pc.document['verbose'], _pc.document['overwrite'] )
                  ^^^^^^^^^^^^^^^^^^^^^^^^^^^^^^^^^^^^^^^^^^^^^^^^^^^^^^^^^^^^^^^^^^^^^^^^^^^^^^^^^^^^^^^^^^^^^^^^^^^^^^^^^^^^^^^^^^^^^^^^^^^^^^^^^^^^^^^^^^^^^^^^^^^^^^^^^^^^^^^^^^^^^^^^^^^^^^^^^^^^^^^^^^^^^^^^^^^^^^^^^^^^^^^^^^^^^^^^^^^^^^^^^^^^^^^^^^^^^^^^^^^^^^^^^^^^^^^^^^^^^^^^^^^^^^^^^^^^^^^^^^^^^^^^^^^^^^^^^^^^^^^^^^^^^^^^^^^^^^^^^^^^^^^^^^^^^^^^^^^^^^^^^^^^^^^^^^^^^^^^^^^^^^^^^^^^^^^^^^^^^^^^^^^^^^^^^^^^^^^^^^^^^^^^^^^^^^^^^^^^^^^^^^^^^^^^^^^^^^^^^^^^^^^^^^^^^^^^^^^^^^^^^^^^^^^^^^^^^^^^^^^^^^^^^^^^^^^^^^^^^^^^^^^^^^^^^^^^^^^^^^^^^^^^^^^^^^^^^^^^^^^^^^^^^^^^^^^^^^^^^^^^^^^^^^^^^^^^^^^^^^^^^^^^^^^^^^^^^^^^^^^^^^^^^^^^^^^^^^^^^^^^^^^^^^^^^^^^^^^^^^^^^^^^^^^^^^^^^^^^^^^^^^^^^^^^^^^^^^^^^^^^^^^^^^^^^^^^^^^^^^^^^^^^^^^^^^^^^^^^^^^^^^^^^^^^^^^^^^^^^^^^^^^^^^^^^^^^^^^^^^^^^^^^^^^^^^^^^^^^^^^^^^^^^^^^^^^^^^^^^^^^^^^^^^^^^^^^^^^^^^^^^^^^^^^^^^^^^^^^^^^^^^^^^^^^^^^^^^^^^^^^^^^^^^^^^^^^^^^^^^^^^^^^^^^^^^^^^^^^^^^^^^^^^^^^^^^^^^^^^^^^^^^^^^^^^^^^^^^^^^^^^^^^^^^^^^^^^^^^^^^^^^^^^^^^^^^^^^^^^^^^^^^
/usr/local/lib/python3.12/site-packages/casatasks/private/task_simobserve.py:749: in simobserve
    discard = util.statim(modelflat,plot=True,incell=model_cell)
(10 more lines...)
Collapse Failed test_task_simobserve simobserve_sky.testSky_sdObs
3 secs
AssertionError: None
test_task_simobserve.py:384: in testSky_sdObs
    simobserve(project=self.project,skymodel=skymodel,
/usr/local/lib/python3.12/site-packages/casatasks/simobserve.py:350: in __call__
    task_result = _simobserve_t( _pc.document['project'], _pc.document['skymodel'], _pc.document['inbright'], _pc.document['indirection'], _pc.document['incell'], _pc.document['incenter'], _pc.document['inwidth'], _pc.document['complist'], _pc.document['compwidth'], _pc.document['comp_nchan'], _pc.document['setpointings'], _pc.document['ptgfile'], _pc.document['integration'], _pc.document['direction'], _pc.document['mapsize'], _pc.document['maptype'], _pc.document['pointingspacing'], _pc.document['caldirection'], _pc.document['calflux'], _pc.document['obsmode'], _pc.document['refdate'], _pc.document['hourangle'], _pc.document['totaltime'], _pc.document['antennalist'], _pc.document['sdantlist'], _pc.document['sdant'], _pc.document['outframe'], _pc.document['thermalnoise'], _pc.document['user_pwv'], _pc.document['t_ground'], _pc.document['t_sky'], _pc.document['tau0'], _pc.document['seed'], _pc.document['leakage'], _pc.document['graphics'], _pc.document['verbose'], _pc.document['overwrite'] )
                  ^^^^^^^^^^^^^^^^^^^^^^^^^^^^^^^^^^^^^^^^^^^^^^^^^^^^^^^^^^^^^^^^^^^^^^^^^^^^^^^^^^^^^^^^^^^^^^^^^^^^^^^^^^^^^^^^^^^^^^^^^^^^^^^^^^^^^^^^^^^^^^^^^^^^^^^^^^^^^^^^^^^^^^^^^^^^^^^^^^^^^^^^^^^^^^^^^^^^^^^^^^^^^^^^^^^^^^^^^^^^^^^^^^^^^^^^^^^^^^^^^^^^^^^^^^^^^^^^^^^^^^^^^^^^^^^^^^^^^^^^^^^^^^^^^^^^^^^^^^^^^^^^^^^^^^^^^^^^^^^^^^^^^^^^^^^^^^^^^^^^^^^^^^^^^^^^^^^^^^^^^^^^^^^^^^^^^^^^^^^^^^^^^^^^^^^^^^^^^^^^^^^^^^^^^^^^^^^^^^^^^^^^^^^^^^^^^^^^^^^^^^^^^^^^^^^^^^^^^^^^^^^^^^^^^^^^^^^^^^^^^^^^^^^^^^^^^^^^^^^^^^^^^^^^^^^^^^^^^^^^^^^^^^^^^^^^^^^^^^^^^^^^^^^^^^^^^^^^^^^^^^^^^^^^^^^^^^^^^^^^^^^^^^^^^^^^^^^^^^^^^^^^^^^^^^^^^^^^^^^^^^^^^^^^^^^^^^^^^^^^^^^^^^^^^^^^^^^^^^^^^^^^^^^^^^^^^^^^^^^^^^^^^^^^^^^^^^^^^^^^^^^^^^^^^^^^^^^^^^^^^^^^^^^^^^^^^^^^^^^^^^^^^^^^^^^^^^^^^^^^^^^^^^^^^^^^^^^^^^^^^^^^^^^^^^^^^^^^^^^^^^^^^^^^^^^^^^^^^^^^^^^^^^^^^^^^^^^^^^^^^^^^^^^^^^^^^^^^^^^^^^^^^^^^^^^^^^^^^^^^^^^^^^^^^^^^^^^^^^^^^^^^^^^^^^^^^^^^^^^^^^^^^^^^^^^^^^^^^^^^^^^^^^^^^^^^^^^^^^^^^^^^^^^^^^^^^^^^^^^^^^^^^^^
/usr/local/lib/python3.12/site-packages/casatasks/private/task_simobserve.py:749: in simobserve
    discard = util.statim(modelflat,plot=True,incell=model_cell)
(10 more lines...)
Collapse Failed test_task_simobserve simobserve_sky.testSky_skymodel
3 secs
AssertionError: None
test_task_simobserve.py:295: in testSky_skymodel
    simobserve(project=self.project,skymodel=skymodel,
/usr/local/lib/python3.12/site-packages/casatasks/simobserve.py:350: in __call__
    task_result = _simobserve_t( _pc.document['project'], _pc.document['skymodel'], _pc.document['inbright'], _pc.document['indirection'], _pc.document['incell'], _pc.document['incenter'], _pc.document['inwidth'], _pc.document['complist'], _pc.document['compwidth'], _pc.document['comp_nchan'], _pc.document['setpointings'], _pc.document['ptgfile'], _pc.document['integration'], _pc.document['direction'], _pc.document['mapsize'], _pc.document['maptype'], _pc.document['pointingspacing'], _pc.document['caldirection'], _pc.document['calflux'], _pc.document['obsmode'], _pc.document['refdate'], _pc.document['hourangle'], _pc.document['totaltime'], _pc.document['antennalist'], _pc.document['sdantlist'], _pc.document['sdant'], _pc.document['outframe'], _pc.document['thermalnoise'], _pc.document['user_pwv'], _pc.document['t_ground'], _pc.document['t_sky'], _pc.document['tau0'], _pc.document['seed'], _pc.document['leakage'], _pc.document['graphics'], _pc.document['verbose'], _pc.document['overwrite'] )
                  ^^^^^^^^^^^^^^^^^^^^^^^^^^^^^^^^^^^^^^^^^^^^^^^^^^^^^^^^^^^^^^^^^^^^^^^^^^^^^^^^^^^^^^^^^^^^^^^^^^^^^^^^^^^^^^^^^^^^^^^^^^^^^^^^^^^^^^^^^^^^^^^^^^^^^^^^^^^^^^^^^^^^^^^^^^^^^^^^^^^^^^^^^^^^^^^^^^^^^^^^^^^^^^^^^^^^^^^^^^^^^^^^^^^^^^^^^^^^^^^^^^^^^^^^^^^^^^^^^^^^^^^^^^^^^^^^^^^^^^^^^^^^^^^^^^^^^^^^^^^^^^^^^^^^^^^^^^^^^^^^^^^^^^^^^^^^^^^^^^^^^^^^^^^^^^^^^^^^^^^^^^^^^^^^^^^^^^^^^^^^^^^^^^^^^^^^^^^^^^^^^^^^^^^^^^^^^^^^^^^^^^^^^^^^^^^^^^^^^^^^^^^^^^^^^^^^^^^^^^^^^^^^^^^^^^^^^^^^^^^^^^^^^^^^^^^^^^^^^^^^^^^^^^^^^^^^^^^^^^^^^^^^^^^^^^^^^^^^^^^^^^^^^^^^^^^^^^^^^^^^^^^^^^^^^^^^^^^^^^^^^^^^^^^^^^^^^^^^^^^^^^^^^^^^^^^^^^^^^^^^^^^^^^^^^^^^^^^^^^^^^^^^^^^^^^^^^^^^^^^^^^^^^^^^^^^^^^^^^^^^^^^^^^^^^^^^^^^^^^^^^^^^^^^^^^^^^^^^^^^^^^^^^^^^^^^^^^^^^^^^^^^^^^^^^^^^^^^^^^^^^^^^^^^^^^^^^^^^^^^^^^^^^^^^^^^^^^^^^^^^^^^^^^^^^^^^^^^^^^^^^^^^^^^^^^^^^^^^^^^^^^^^^^^^^^^^^^^^^^^^^^^^^^^^^^^^^^^^^^^^^^^^^^^^^^^^^^^^^^^^^^^^^^^^^^^^^^^^^^^^^^^^^^^^^^^^^^^^^^^^^^^^^^^^^^^^^^^^^^^^^^^^^^^^^^^^^^^^^^^^^^^^^^^
/usr/local/lib/python3.12/site-packages/casatasks/private/task_simobserve.py:749: in simobserve
    discard = util.statim(modelflat,plot=True,incell=model_cell)
(10 more lines...)
Collapse Failed test_task_simobserve simobserve_sky.testSky_sqptg
4 secs
AssertionError: None
test_task_simobserve.py:361: in testSky_sqptg
    simobserve(project=self.project,skymodel=skymodel,
/usr/local/lib/python3.12/site-packages/casatasks/simobserve.py:350: in __call__
    task_result = _simobserve_t( _pc.document['project'], _pc.document['skymodel'], _pc.document['inbright'], _pc.document['indirection'], _pc.document['incell'], _pc.document['incenter'], _pc.document['inwidth'], _pc.document['complist'], _pc.document['compwidth'], _pc.document['comp_nchan'], _pc.document['setpointings'], _pc.document['ptgfile'], _pc.document['integration'], _pc.document['direction'], _pc.document['mapsize'], _pc.document['maptype'], _pc.document['pointingspacing'], _pc.document['caldirection'], _pc.document['calflux'], _pc.document['obsmode'], _pc.document['refdate'], _pc.document['hourangle'], _pc.document['totaltime'], _pc.document['antennalist'], _pc.document['sdantlist'], _pc.document['sdant'], _pc.document['outframe'], _pc.document['thermalnoise'], _pc.document['user_pwv'], _pc.document['t_ground'], _pc.document['t_sky'], _pc.document['tau0'], _pc.document['seed'], _pc.document['leakage'], _pc.document['graphics'], _pc.document['verbose'], _pc.document['overwrite'] )
                  ^^^^^^^^^^^^^^^^^^^^^^^^^^^^^^^^^^^^^^^^^^^^^^^^^^^^^^^^^^^^^^^^^^^^^^^^^^^^^^^^^^^^^^^^^^^^^^^^^^^^^^^^^^^^^^^^^^^^^^^^^^^^^^^^^^^^^^^^^^^^^^^^^^^^^^^^^^^^^^^^^^^^^^^^^^^^^^^^^^^^^^^^^^^^^^^^^^^^^^^^^^^^^^^^^^^^^^^^^^^^^^^^^^^^^^^^^^^^^^^^^^^^^^^^^^^^^^^^^^^^^^^^^^^^^^^^^^^^^^^^^^^^^^^^^^^^^^^^^^^^^^^^^^^^^^^^^^^^^^^^^^^^^^^^^^^^^^^^^^^^^^^^^^^^^^^^^^^^^^^^^^^^^^^^^^^^^^^^^^^^^^^^^^^^^^^^^^^^^^^^^^^^^^^^^^^^^^^^^^^^^^^^^^^^^^^^^^^^^^^^^^^^^^^^^^^^^^^^^^^^^^^^^^^^^^^^^^^^^^^^^^^^^^^^^^^^^^^^^^^^^^^^^^^^^^^^^^^^^^^^^^^^^^^^^^^^^^^^^^^^^^^^^^^^^^^^^^^^^^^^^^^^^^^^^^^^^^^^^^^^^^^^^^^^^^^^^^^^^^^^^^^^^^^^^^^^^^^^^^^^^^^^^^^^^^^^^^^^^^^^^^^^^^^^^^^^^^^^^^^^^^^^^^^^^^^^^^^^^^^^^^^^^^^^^^^^^^^^^^^^^^^^^^^^^^^^^^^^^^^^^^^^^^^^^^^^^^^^^^^^^^^^^^^^^^^^^^^^^^^^^^^^^^^^^^^^^^^^^^^^^^^^^^^^^^^^^^^^^^^^^^^^^^^^^^^^^^^^^^^^^^^^^^^^^^^^^^^^^^^^^^^^^^^^^^^^^^^^^^^^^^^^^^^^^^^^^^^^^^^^^^^^^^^^^^^^^^^^^^^^^^^^^^^^^^^^^^^^^^^^^^^^^^^^^^^^^^^^^^^^^^^^^^^^^^^^^^^^^^^^^^^^^^^^^^^^^^^^^^^^^^^^^^^
/usr/local/lib/python3.12/site-packages/casatasks/private/task_simobserve.py:749: in simobserve
    discard = util.statim(modelflat,plot=True,incell=model_cell)
(10 more lines...)
Collapse Failed test_task_simobserve simobserve_skycomp.testSC_almaptg
7 secs
AssertionError: None
test_task_simobserve.py:967: in testSC_almaptg
    simobserve(project=self.project,skymodel=skymodel,
/usr/local/lib/python3.12/site-packages/casatasks/simobserve.py:350: in __call__
    task_result = _simobserve_t( _pc.document['project'], _pc.document['skymodel'], _pc.document['inbright'], _pc.document['indirection'], _pc.document['incell'], _pc.document['incenter'], _pc.document['inwidth'], _pc.document['complist'], _pc.document['compwidth'], _pc.document['comp_nchan'], _pc.document['setpointings'], _pc.document['ptgfile'], _pc.document['integration'], _pc.document['direction'], _pc.document['mapsize'], _pc.document['maptype'], _pc.document['pointingspacing'], _pc.document['caldirection'], _pc.document['calflux'], _pc.document['obsmode'], _pc.document['refdate'], _pc.document['hourangle'], _pc.document['totaltime'], _pc.document['antennalist'], _pc.document['sdantlist'], _pc.document['sdant'], _pc.document['outframe'], _pc.document['thermalnoise'], _pc.document['user_pwv'], _pc.document['t_ground'], _pc.document['t_sky'], _pc.document['tau0'], _pc.document['seed'], _pc.document['leakage'], _pc.document['graphics'], _pc.document['verbose'], _pc.document['overwrite'] )
                  ^^^^^^^^^^^^^^^^^^^^^^^^^^^^^^^^^^^^^^^^^^^^^^^^^^^^^^^^^^^^^^^^^^^^^^^^^^^^^^^^^^^^^^^^^^^^^^^^^^^^^^^^^^^^^^^^^^^^^^^^^^^^^^^^^^^^^^^^^^^^^^^^^^^^^^^^^^^^^^^^^^^^^^^^^^^^^^^^^^^^^^^^^^^^^^^^^^^^^^^^^^^^^^^^^^^^^^^^^^^^^^^^^^^^^^^^^^^^^^^^^^^^^^^^^^^^^^^^^^^^^^^^^^^^^^^^^^^^^^^^^^^^^^^^^^^^^^^^^^^^^^^^^^^^^^^^^^^^^^^^^^^^^^^^^^^^^^^^^^^^^^^^^^^^^^^^^^^^^^^^^^^^^^^^^^^^^^^^^^^^^^^^^^^^^^^^^^^^^^^^^^^^^^^^^^^^^^^^^^^^^^^^^^^^^^^^^^^^^^^^^^^^^^^^^^^^^^^^^^^^^^^^^^^^^^^^^^^^^^^^^^^^^^^^^^^^^^^^^^^^^^^^^^^^^^^^^^^^^^^^^^^^^^^^^^^^^^^^^^^^^^^^^^^^^^^^^^^^^^^^^^^^^^^^^^^^^^^^^^^^^^^^^^^^^^^^^^^^^^^^^^^^^^^^^^^^^^^^^^^^^^^^^^^^^^^^^^^^^^^^^^^^^^^^^^^^^^^^^^^^^^^^^^^^^^^^^^^^^^^^^^^^^^^^^^^^^^^^^^^^^^^^^^^^^^^^^^^^^^^^^^^^^^^^^^^^^^^^^^^^^^^^^^^^^^^^^^^^^^^^^^^^^^^^^^^^^^^^^^^^^^^^^^^^^^^^^^^^^^^^^^^^^^^^^^^^^^^^^^^^^^^^^^^^^^^^^^^^^^^^^^^^^^^^^^^^^^^^^^^^^^^^^^^^^^^^^^^^^^^^^^^^^^^^^^^^^^^^^^^^^^^^^^^^^^^^^^^^^^^^^^^^^^^^^^^^^^^^^^^^^^^^^^^^^^^^^^^^^^^^^^^^^^^^^^^^^^^^^^^^^^^^^^^
/usr/local/lib/python3.12/site-packages/casatasks/private/task_simobserve.py:749: in simobserve
    discard = util.statim(modelflat,plot=True,incell=model_cell)
(10 more lines...)
Collapse Failed test_task_simobserve simobserve_skycomp.testSC_hexptg
7 secs
AssertionError: None
test_task_simobserve.py:994: in testSC_hexptg
    simobserve(project=self.project,skymodel=skymodel,
/usr/local/lib/python3.12/site-packages/casatasks/simobserve.py:350: in __call__
    task_result = _simobserve_t( _pc.document['project'], _pc.document['skymodel'], _pc.document['inbright'], _pc.document['indirection'], _pc.document['incell'], _pc.document['incenter'], _pc.document['inwidth'], _pc.document['complist'], _pc.document['compwidth'], _pc.document['comp_nchan'], _pc.document['setpointings'], _pc.document['ptgfile'], _pc.document['integration'], _pc.document['direction'], _pc.document['mapsize'], _pc.document['maptype'], _pc.document['pointingspacing'], _pc.document['caldirection'], _pc.document['calflux'], _pc.document['obsmode'], _pc.document['refdate'], _pc.document['hourangle'], _pc.document['totaltime'], _pc.document['antennalist'], _pc.document['sdantlist'], _pc.document['sdant'], _pc.document['outframe'], _pc.document['thermalnoise'], _pc.document['user_pwv'], _pc.document['t_ground'], _pc.document['t_sky'], _pc.document['tau0'], _pc.document['seed'], _pc.document['leakage'], _pc.document['graphics'], _pc.document['verbose'], _pc.document['overwrite'] )
                  ^^^^^^^^^^^^^^^^^^^^^^^^^^^^^^^^^^^^^^^^^^^^^^^^^^^^^^^^^^^^^^^^^^^^^^^^^^^^^^^^^^^^^^^^^^^^^^^^^^^^^^^^^^^^^^^^^^^^^^^^^^^^^^^^^^^^^^^^^^^^^^^^^^^^^^^^^^^^^^^^^^^^^^^^^^^^^^^^^^^^^^^^^^^^^^^^^^^^^^^^^^^^^^^^^^^^^^^^^^^^^^^^^^^^^^^^^^^^^^^^^^^^^^^^^^^^^^^^^^^^^^^^^^^^^^^^^^^^^^^^^^^^^^^^^^^^^^^^^^^^^^^^^^^^^^^^^^^^^^^^^^^^^^^^^^^^^^^^^^^^^^^^^^^^^^^^^^^^^^^^^^^^^^^^^^^^^^^^^^^^^^^^^^^^^^^^^^^^^^^^^^^^^^^^^^^^^^^^^^^^^^^^^^^^^^^^^^^^^^^^^^^^^^^^^^^^^^^^^^^^^^^^^^^^^^^^^^^^^^^^^^^^^^^^^^^^^^^^^^^^^^^^^^^^^^^^^^^^^^^^^^^^^^^^^^^^^^^^^^^^^^^^^^^^^^^^^^^^^^^^^^^^^^^^^^^^^^^^^^^^^^^^^^^^^^^^^^^^^^^^^^^^^^^^^^^^^^^^^^^^^^^^^^^^^^^^^^^^^^^^^^^^^^^^^^^^^^^^^^^^^^^^^^^^^^^^^^^^^^^^^^^^^^^^^^^^^^^^^^^^^^^^^^^^^^^^^^^^^^^^^^^^^^^^^^^^^^^^^^^^^^^^^^^^^^^^^^^^^^^^^^^^^^^^^^^^^^^^^^^^^^^^^^^^^^^^^^^^^^^^^^^^^^^^^^^^^^^^^^^^^^^^^^^^^^^^^^^^^^^^^^^^^^^^^^^^^^^^^^^^^^^^^^^^^^^^^^^^^^^^^^^^^^^^^^^^^^^^^^^^^^^^^^^^^^^^^^^^^^^^^^^^^^^^^^^^^^^^^^^^^^^^^^^^^^^^^^^^^^^^^^^^^^^^^^^^^^^^^^^^^^^^^^^
/usr/local/lib/python3.12/site-packages/casatasks/private/task_simobserve.py:749: in simobserve
    discard = util.statim(modelflat,plot=True,incell=model_cell)
(10 more lines...)
Collapse Failed test_task_simobserve simobserve_skycomp.testSC_intAll
7 secs
AssertionError: None
test_task_simobserve.py:1151: in testSC_intAll
    simobserve(project=self.project,skymodel=skymodel,
/usr/local/lib/python3.12/site-packages/casatasks/simobserve.py:350: in __call__
    task_result = _simobserve_t( _pc.document['project'], _pc.document['skymodel'], _pc.document['inbright'], _pc.document['indirection'], _pc.document['incell'], _pc.document['incenter'], _pc.document['inwidth'], _pc.document['complist'], _pc.document['compwidth'], _pc.document['comp_nchan'], _pc.document['setpointings'], _pc.document['ptgfile'], _pc.document['integration'], _pc.document['direction'], _pc.document['mapsize'], _pc.document['maptype'], _pc.document['pointingspacing'], _pc.document['caldirection'], _pc.document['calflux'], _pc.document['obsmode'], _pc.document['refdate'], _pc.document['hourangle'], _pc.document['totaltime'], _pc.document['antennalist'], _pc.document['sdantlist'], _pc.document['sdant'], _pc.document['outframe'], _pc.document['thermalnoise'], _pc.document['user_pwv'], _pc.document['t_ground'], _pc.document['t_sky'], _pc.document['tau0'], _pc.document['seed'], _pc.document['leakage'], _pc.document['graphics'], _pc.document['verbose'], _pc.document['overwrite'] )
                  ^^^^^^^^^^^^^^^^^^^^^^^^^^^^^^^^^^^^^^^^^^^^^^^^^^^^^^^^^^^^^^^^^^^^^^^^^^^^^^^^^^^^^^^^^^^^^^^^^^^^^^^^^^^^^^^^^^^^^^^^^^^^^^^^^^^^^^^^^^^^^^^^^^^^^^^^^^^^^^^^^^^^^^^^^^^^^^^^^^^^^^^^^^^^^^^^^^^^^^^^^^^^^^^^^^^^^^^^^^^^^^^^^^^^^^^^^^^^^^^^^^^^^^^^^^^^^^^^^^^^^^^^^^^^^^^^^^^^^^^^^^^^^^^^^^^^^^^^^^^^^^^^^^^^^^^^^^^^^^^^^^^^^^^^^^^^^^^^^^^^^^^^^^^^^^^^^^^^^^^^^^^^^^^^^^^^^^^^^^^^^^^^^^^^^^^^^^^^^^^^^^^^^^^^^^^^^^^^^^^^^^^^^^^^^^^^^^^^^^^^^^^^^^^^^^^^^^^^^^^^^^^^^^^^^^^^^^^^^^^^^^^^^^^^^^^^^^^^^^^^^^^^^^^^^^^^^^^^^^^^^^^^^^^^^^^^^^^^^^^^^^^^^^^^^^^^^^^^^^^^^^^^^^^^^^^^^^^^^^^^^^^^^^^^^^^^^^^^^^^^^^^^^^^^^^^^^^^^^^^^^^^^^^^^^^^^^^^^^^^^^^^^^^^^^^^^^^^^^^^^^^^^^^^^^^^^^^^^^^^^^^^^^^^^^^^^^^^^^^^^^^^^^^^^^^^^^^^^^^^^^^^^^^^^^^^^^^^^^^^^^^^^^^^^^^^^^^^^^^^^^^^^^^^^^^^^^^^^^^^^^^^^^^^^^^^^^^^^^^^^^^^^^^^^^^^^^^^^^^^^^^^^^^^^^^^^^^^^^^^^^^^^^^^^^^^^^^^^^^^^^^^^^^^^^^^^^^^^^^^^^^^^^^^^^^^^^^^^^^^^^^^^^^^^^^^^^^^^^^^^^^^^^^^^^^^^^^^^^^^^^^^^^^^^^^^^^^^^^^^^^^^^^^^^^^^^^^^^^^^^^^^^^^^
/usr/local/lib/python3.12/site-packages/casatasks/private/task_simobserve.py:749: in simobserve
    discard = util.statim(modelflat,plot=True,incell=model_cell)
(10 more lines...)
Collapse Failed test_task_simobserve simobserve_skycomp.testSC_intObs
6 secs
AssertionError: None
test_task_simobserve.py:1077: in testSC_intObs
    simobserve(project=self.project,skymodel=skymodel,
/usr/local/lib/python3.12/site-packages/casatasks/simobserve.py:350: in __call__
    task_result = _simobserve_t( _pc.document['project'], _pc.document['skymodel'], _pc.document['inbright'], _pc.document['indirection'], _pc.document['incell'], _pc.document['incenter'], _pc.document['inwidth'], _pc.document['complist'], _pc.document['compwidth'], _pc.document['comp_nchan'], _pc.document['setpointings'], _pc.document['ptgfile'], _pc.document['integration'], _pc.document['direction'], _pc.document['mapsize'], _pc.document['maptype'], _pc.document['pointingspacing'], _pc.document['caldirection'], _pc.document['calflux'], _pc.document['obsmode'], _pc.document['refdate'], _pc.document['hourangle'], _pc.document['totaltime'], _pc.document['antennalist'], _pc.document['sdantlist'], _pc.document['sdant'], _pc.document['outframe'], _pc.document['thermalnoise'], _pc.document['user_pwv'], _pc.document['t_ground'], _pc.document['t_sky'], _pc.document['tau0'], _pc.document['seed'], _pc.document['leakage'], _pc.document['graphics'], _pc.document['verbose'], _pc.document['overwrite'] )
                  ^^^^^^^^^^^^^^^^^^^^^^^^^^^^^^^^^^^^^^^^^^^^^^^^^^^^^^^^^^^^^^^^^^^^^^^^^^^^^^^^^^^^^^^^^^^^^^^^^^^^^^^^^^^^^^^^^^^^^^^^^^^^^^^^^^^^^^^^^^^^^^^^^^^^^^^^^^^^^^^^^^^^^^^^^^^^^^^^^^^^^^^^^^^^^^^^^^^^^^^^^^^^^^^^^^^^^^^^^^^^^^^^^^^^^^^^^^^^^^^^^^^^^^^^^^^^^^^^^^^^^^^^^^^^^^^^^^^^^^^^^^^^^^^^^^^^^^^^^^^^^^^^^^^^^^^^^^^^^^^^^^^^^^^^^^^^^^^^^^^^^^^^^^^^^^^^^^^^^^^^^^^^^^^^^^^^^^^^^^^^^^^^^^^^^^^^^^^^^^^^^^^^^^^^^^^^^^^^^^^^^^^^^^^^^^^^^^^^^^^^^^^^^^^^^^^^^^^^^^^^^^^^^^^^^^^^^^^^^^^^^^^^^^^^^^^^^^^^^^^^^^^^^^^^^^^^^^^^^^^^^^^^^^^^^^^^^^^^^^^^^^^^^^^^^^^^^^^^^^^^^^^^^^^^^^^^^^^^^^^^^^^^^^^^^^^^^^^^^^^^^^^^^^^^^^^^^^^^^^^^^^^^^^^^^^^^^^^^^^^^^^^^^^^^^^^^^^^^^^^^^^^^^^^^^^^^^^^^^^^^^^^^^^^^^^^^^^^^^^^^^^^^^^^^^^^^^^^^^^^^^^^^^^^^^^^^^^^^^^^^^^^^^^^^^^^^^^^^^^^^^^^^^^^^^^^^^^^^^^^^^^^^^^^^^^^^^^^^^^^^^^^^^^^^^^^^^^^^^^^^^^^^^^^^^^^^^^^^^^^^^^^^^^^^^^^^^^^^^^^^^^^^^^^^^^^^^^^^^^^^^^^^^^^^^^^^^^^^^^^^^^^^^^^^^^^^^^^^^^^^^^^^^^^^^^^^^^^^^^^^^^^^^^^^^^^^^^^^^^^^^^^^^^^^^^^^^^^^^^^^^^^^^^^
/usr/local/lib/python3.12/site-packages/casatasks/private/task_simobserve.py:749: in simobserve
    discard = util.statim(modelflat,plot=True,incell=model_cell)
(10 more lines...)
Collapse Failed test_task_simobserve simobserve_skycomp.testSC_skymodel
7 secs
AssertionError: None
test_task_simobserve.py:941: in testSC_skymodel
    simobserve(project=self.project,skymodel=skymodel,
/usr/local/lib/python3.12/site-packages/casatasks/simobserve.py:350: in __call__
    task_result = _simobserve_t( _pc.document['project'], _pc.document['skymodel'], _pc.document['inbright'], _pc.document['indirection'], _pc.document['incell'], _pc.document['incenter'], _pc.document['inwidth'], _pc.document['complist'], _pc.document['compwidth'], _pc.document['comp_nchan'], _pc.document['setpointings'], _pc.document['ptgfile'], _pc.document['integration'], _pc.document['direction'], _pc.document['mapsize'], _pc.document['maptype'], _pc.document['pointingspacing'], _pc.document['caldirection'], _pc.document['calflux'], _pc.document['obsmode'], _pc.document['refdate'], _pc.document['hourangle'], _pc.document['totaltime'], _pc.document['antennalist'], _pc.document['sdantlist'], _pc.document['sdant'], _pc.document['outframe'], _pc.document['thermalnoise'], _pc.document['user_pwv'], _pc.document['t_ground'], _pc.document['t_sky'], _pc.document['tau0'], _pc.document['seed'], _pc.document['leakage'], _pc.document['graphics'], _pc.document['verbose'], _pc.document['overwrite'] )
                  ^^^^^^^^^^^^^^^^^^^^^^^^^^^^^^^^^^^^^^^^^^^^^^^^^^^^^^^^^^^^^^^^^^^^^^^^^^^^^^^^^^^^^^^^^^^^^^^^^^^^^^^^^^^^^^^^^^^^^^^^^^^^^^^^^^^^^^^^^^^^^^^^^^^^^^^^^^^^^^^^^^^^^^^^^^^^^^^^^^^^^^^^^^^^^^^^^^^^^^^^^^^^^^^^^^^^^^^^^^^^^^^^^^^^^^^^^^^^^^^^^^^^^^^^^^^^^^^^^^^^^^^^^^^^^^^^^^^^^^^^^^^^^^^^^^^^^^^^^^^^^^^^^^^^^^^^^^^^^^^^^^^^^^^^^^^^^^^^^^^^^^^^^^^^^^^^^^^^^^^^^^^^^^^^^^^^^^^^^^^^^^^^^^^^^^^^^^^^^^^^^^^^^^^^^^^^^^^^^^^^^^^^^^^^^^^^^^^^^^^^^^^^^^^^^^^^^^^^^^^^^^^^^^^^^^^^^^^^^^^^^^^^^^^^^^^^^^^^^^^^^^^^^^^^^^^^^^^^^^^^^^^^^^^^^^^^^^^^^^^^^^^^^^^^^^^^^^^^^^^^^^^^^^^^^^^^^^^^^^^^^^^^^^^^^^^^^^^^^^^^^^^^^^^^^^^^^^^^^^^^^^^^^^^^^^^^^^^^^^^^^^^^^^^^^^^^^^^^^^^^^^^^^^^^^^^^^^^^^^^^^^^^^^^^^^^^^^^^^^^^^^^^^^^^^^^^^^^^^^^^^^^^^^^^^^^^^^^^^^^^^^^^^^^^^^^^^^^^^^^^^^^^^^^^^^^^^^^^^^^^^^^^^^^^^^^^^^^^^^^^^^^^^^^^^^^^^^^^^^^^^^^^^^^^^^^^^^^^^^^^^^^^^^^^^^^^^^^^^^^^^^^^^^^^^^^^^^^^^^^^^^^^^^^^^^^^^^^^^^^^^^^^^^^^^^^^^^^^^^^^^^^^^^^^^^^^^^^^^^^^^^^^^^^^^^^^^^^^^^^^^^^^^^^^^^^^^^^^^^^^^^^^^^^
/usr/local/lib/python3.12/site-packages/casatasks/private/task_simobserve.py:749: in simobserve
    discard = util.statim(modelflat,plot=True,incell=model_cell)
(10 more lines...)
Collapse Failed test_task_simobserve simobserve_skycomp.testSC_sqptg
7 secs
AssertionError: None
test_task_simobserve.py:1021: in testSC_sqptg
    simobserve(project=self.project,skymodel=skymodel,
/usr/local/lib/python3.12/site-packages/casatasks/simobserve.py:350: in __call__
    task_result = _simobserve_t( _pc.document['project'], _pc.document['skymodel'], _pc.document['inbright'], _pc.document['indirection'], _pc.document['incell'], _pc.document['incenter'], _pc.document['inwidth'], _pc.document['complist'], _pc.document['compwidth'], _pc.document['comp_nchan'], _pc.document['setpointings'], _pc.document['ptgfile'], _pc.document['integration'], _pc.document['direction'], _pc.document['mapsize'], _pc.document['maptype'], _pc.document['pointingspacing'], _pc.document['caldirection'], _pc.document['calflux'], _pc.document['obsmode'], _pc.document['refdate'], _pc.document['hourangle'], _pc.document['totaltime'], _pc.document['antennalist'], _pc.document['sdantlist'], _pc.document['sdant'], _pc.document['outframe'], _pc.document['thermalnoise'], _pc.document['user_pwv'], _pc.document['t_ground'], _pc.document['t_sky'], _pc.document['tau0'], _pc.document['seed'], _pc.document['leakage'], _pc.document['graphics'], _pc.document['verbose'], _pc.document['overwrite'] )
                  ^^^^^^^^^^^^^^^^^^^^^^^^^^^^^^^^^^^^^^^^^^^^^^^^^^^^^^^^^^^^^^^^^^^^^^^^^^^^^^^^^^^^^^^^^^^^^^^^^^^^^^^^^^^^^^^^^^^^^^^^^^^^^^^^^^^^^^^^^^^^^^^^^^^^^^^^^^^^^^^^^^^^^^^^^^^^^^^^^^^^^^^^^^^^^^^^^^^^^^^^^^^^^^^^^^^^^^^^^^^^^^^^^^^^^^^^^^^^^^^^^^^^^^^^^^^^^^^^^^^^^^^^^^^^^^^^^^^^^^^^^^^^^^^^^^^^^^^^^^^^^^^^^^^^^^^^^^^^^^^^^^^^^^^^^^^^^^^^^^^^^^^^^^^^^^^^^^^^^^^^^^^^^^^^^^^^^^^^^^^^^^^^^^^^^^^^^^^^^^^^^^^^^^^^^^^^^^^^^^^^^^^^^^^^^^^^^^^^^^^^^^^^^^^^^^^^^^^^^^^^^^^^^^^^^^^^^^^^^^^^^^^^^^^^^^^^^^^^^^^^^^^^^^^^^^^^^^^^^^^^^^^^^^^^^^^^^^^^^^^^^^^^^^^^^^^^^^^^^^^^^^^^^^^^^^^^^^^^^^^^^^^^^^^^^^^^^^^^^^^^^^^^^^^^^^^^^^^^^^^^^^^^^^^^^^^^^^^^^^^^^^^^^^^^^^^^^^^^^^^^^^^^^^^^^^^^^^^^^^^^^^^^^^^^^^^^^^^^^^^^^^^^^^^^^^^^^^^^^^^^^^^^^^^^^^^^^^^^^^^^^^^^^^^^^^^^^^^^^^^^^^^^^^^^^^^^^^^^^^^^^^^^^^^^^^^^^^^^^^^^^^^^^^^^^^^^^^^^^^^^^^^^^^^^^^^^^^^^^^^^^^^^^^^^^^^^^^^^^^^^^^^^^^^^^^^^^^^^^^^^^^^^^^^^^^^^^^^^^^^^^^^^^^^^^^^^^^^^^^^^^^^^^^^^^^^^^^^^^^^^^^^^^^^^^^^^^^^^^^^^^^^^^^^^^^^^^^^^^^^^^^^^^^^
/usr/local/lib/python3.12/site-packages/casatasks/private/task_simobserve.py:749: in simobserve
    discard = util.statim(modelflat,plot=True,incell=model_cell)
(10 more lines...)
Collapse Failed test_task_tclean test_widefield.test_widefield_mvc_squint_awp2
33 secs
RuntimeError: Error in making PSF : One or more  of the cube section failed in de/gridding. Return values for the sections: [0]
test_task_tclean.py:4188: in test_widefield_mvc_squint_awp2
    tclean(vis=msname, imagename=self.img+'.awp2',  imsize=2000, cell='1.6arcsec',field='',
/usr/local/lib/python3.12/site-packages/casatasks/tclean.py:1860: in __call__
    task_result = _tclean_t( _pc.document['vis'], _pc.document['selectdata'], _pc.document['field'], _pc.document['spw'], _pc.document['timerange'], _pc.document['uvrange'], _pc.document['antenna'], _pc.document['scan'], _pc.document['observation'], _pc.document['intent'], _pc.document['datacolumn'], _pc.document['imagename'], _pc.document['imsize'], _pc.document['cell'], _pc.document['phasecenter'], _pc.document['stokes'], _pc.document['projection'], _pc.document['startmodel'], _pc.document['specmode'], _pc.document['reffreq'], _pc.document['nchan'], _pc.document['start'], _pc.document['width'], _pc.document['outframe'], _pc.document['veltype'], _pc.document['restfreq'], _pc.document['interpolation'], _pc.document['perchanweightdensity'], _pc.document['gridder'], _pc.document['facets'], _pc.document['psfphasecenter'], _pc.document['wprojplanes'], _pc.document['vptable'], _pc.document['mosweight'], _pc.document['aterm'], _pc.document['psterm'], _pc.document['wbawp'], _pc.document['conjbeams'], _pc.document['cfcache'], _pc.document['usepointing'], _pc.document['computepastep'], _pc.document['rotatepastep'], _pc.document['pointingoffsetsigdev'], _pc.document['pblimit'], _pc.document['normtype'], _pc.document['deconvolver'], _pc.document['scales'], _pc.document['nterms'], _pc.document['smallscalebias'], _pc.document['fusedthreshold'], _pc.document['largestscale'], _pc.document['restoration'], _pc.document['restoringbeam'], _pc.document['pbcor'], _pc.document['outlierfile'], _pc.document['weighting'], _pc.document['robust'], _pc.document['noise'], _pc.document['npixels'], _pc.document['uvtaper'], _pc.document['niter'], _pc.document['gain'], _pc.document['threshold'], _pc.document['nsigma'], _pc.document['cycleniter'], _pc.document['cyclefactor'], _pc.document['minpsffraction'], _pc.document['maxpsffraction'], _pc.document['interactive'], _pc.document['nmajor'], _pc.document['fullsummary'], _pc.document['usemask'], _pc.document['mask'], _pc.document['pbmask'], _pc.document['sidelobethreshold'], _pc.document['noisethreshold'], _pc.document['lownoisethreshold'], _pc.document['negativethreshold'], _pc.document['smoothfactor'], _pc.document['minbeamfrac'], _pc.document['cutthreshold'], _pc.document['growiterations'], _pc.document['dogrowprune'], _pc.document['minpercentchange'], _pc.document['verbose'], _pc.document['fastnoise'], _pc.document['restart'], _pc.document['savemodel'], _pc.document['calcres'], _pc.document['calcpsf'], _pc.document['psfcutoff'], _pc.document['parallel'] )
                  ^^^^^^^^^^^^^^^^^^^^^^^^^^^^^^^^^^^^^^^^^^^^^^^^^^^^^^^^^^^^^^^^^^^^^^^^^^^^^^^^^^^^^^^^^^^^^^^^^^^^^^^^^^^^^^^^^^^^^^^^^^^^^^^^^^^^^^^^^^^^^^^^^^^^^^^^^^^^^^^^^^^^^^^^^^^^^^^^^^^^^^^^^^^^^^^^^^^^^^^^^^^^^^^^^^^^^^^^^^^^^^^^^^^^^^^^^^^^^^^^^^^^^^^^^^^^^^^^^^^^^^^^^^^^^^^^^^^^^^^^^^^^^^^^^^^^^^^^^^^^^^^^^^^^^^^^^^^^^^^^^^^^^^^^^^^^^^^^^^^^^^^^^^^^^^^^^^^^^^^^^^^^^^^^^^^^^^^^^^^^^^^^^^^^^^^^^^^^^^^^^^^^^^^^^^^^^^^^^^^^^^^^^^^^^^^^^^^^^^^^^^^^^^^^^^^^^^^^^^^^^^^^^^^^^^^^^^^^^^^^^^^^^^^^^^^^^^^^^^^^^^^^^^^^^^^^^^^^^^^^^^^^^^^^^^^^^^^^^^^^^^^^^^^^^^^^^^^^^^^^^^^^^^^^^^^^^^^^^^^^^^^^^^^^^^^^^^^^^^^^^^^^^^^^^^^^^^^^^^^^^^^^^^^^^^^^^^^^^^^^^^^^^^^^^^^^^^^^^^^^^^^^^^^^^^^^^^^^^^^^^^^^^^^^^^^^^^^^^^^^^^^^^^^^^^^^^^^^^^^^^^^^^^^^^^^^^^^^^^^^^^^^^^^^^^^^^^^^^^^^^^^^^^^^^^^^^^^^^^^^^^^^^^^^^^^^^^^^^^^^^^^^^^^^^^^^^^^^^^^^^^^^^^^^^^^^^^^^^^^^^^^^^^^^^^^^^^^^^^^^^^^^^^^^^^^^^^^^^^^^^^^^^^^^^^^^^^^^^^^^^^^^^^^^^^^^^^^^^^^^^^^^^^^^^^^^^^^^^^^^^^^^^^^^^^^^^^^^^^^^^^^^^^^^^^^^^^^^^^^^^^^^^^^^^^^^^^^^^^^^^^^^^^^^^^^^^^^^^^^^^^^^^^^^^^^^^^^^^^^^^^^^^^^^^^^^^^^^^^^^^^^^^^^^^^^^^^^^^^^^^^^^^^^^^^^^^^^^^^^^^^^^^^^^^^^^^^^^^^^^^^^^^^^^^^^^^^^^^^^^^^^^^^^^^^^^^^^^^^^^^^^^^^^^^^^^^^^^^^^^^^^^^^^^^^^^^^^^^^^^^^^^^^^^^^^^^^^^^^^^^^^^^^^^^^^^^^^^^^^^^^^^^^^^^^^^^^^^^^^^^^^^^^^^^^^^^^^^^^^^^^^^^^^^^^^^^^^^^^^^^^^^^^^^^^^^^^^^^^^^^^^^^^^^^^^^^^^^^^^^^^^^^^^^^^^^^^^^^^^^^^^^^^^^^^^^^^^^^^^^^^^^^^^^^^^^^^^^^^^^^^^^^^^^^^^^^^^^^^^^^^^^^^^^^^^^^^^^^^^^^^^^^^^^^^^^^^^^^^^^^^^^^^^^^^^^^^^^^^^^^^^^^^^^^^^^^^^^^^^^^^^^^^^^^^^^^^^^^^^^^^^^^^^^^^^^^^^^^^^^^^^^^^^^^^^^^^^^^^^^^^^^^^^^^^^^^^^^^^^^^^^^^^^^^^^^^^^^^^^^^^^^^^^^^^^^^^^^^^^^^^^^^^^^^^^^^^^^^^^^^^^^^^^^^^^^^^^^^^^^^^^^^^^^^^^^^^^^^^^^^^^^^^^^^^^^^^^^^^^^^^^^^^^^^^^^^^^^^^^^^^^^^^^^^^^^^^^^^^^^^^^^^^^^^^^^^^^^^^^^^^^^^^^^^^^^^^^^^^^^^^^^^^^^^^^^^^^^^^^^^^^^^^^^^^^^^^^^^^^^^^^^^^^^^^^^^^^^^^^^^^^^^^^^^^^^^^^^^^^^^^^^^^^^^^^^^^^^^^^^^^^^^^^^^^^^^^^^^^^^^^^^^^^^^^^^^^^^^^^^^^^^^^^^^^^^^^^^^^^^^^^^^^^^^^^^^^^^^^^^^^^^^^^^^^^^^^^^^^^^^^^^^^^^^^^^^^^^^^^^^^^^^^^^^^^^^^^^^^^^^^^^^^^^^^^^^^^^^^^^^^^^^^^^^^^^^^^^^^^^^^^^^^^^^^^^^^^^^^^^^^^^^^^^^^^^^^^^^^^^^^^^^^^^^^^^^^^^^^^^^^^^^^^^^^^^^^^^^^^^^^^^^^^^^^^^^^^^^^^^^^^^^^^^^^^^^^^^^^^^^^^^^^^^^^^^^^^^^^^^^^^^^^^^^^^^^^^^^^^^^^^^^^^^^^^^^^^^^^^^^^^^^^^^^^^^^^^^^^^^^^^^^^^^^^^^^^^^^^^^^^^^^^^^^^^^^^^^^^^^^^^^^^^^^^^^^^^^^^^^^^^^^^^^^^^^^^^^^^^^^^^^^^^^^^^^^^^^^^^^^^^^^^^^^^^^^^^^^^^^^^^^^^^^^^^^^^^^^^^^^^^^^^^^^^^^^^^^^^^^^^^^^^^^^^^^^^^^^^^^^^^^^^^^^^^^^^^^^^^^^^^^^^^^^^^^^^^^^^^^^^^^^^^^^^^^^^^^^^^^
/usr/local/lib/python3.12/site-packages/casatasks/private/task_tclean.py:519: in tclean
    imager.makePSF()
(14 more lines...)
Collapse Failed test_task_tsdimaging sdimaging_test_autocoord.test402
< 1 sec
TypeError: %d format: a real number is required, not numpy.ndarray
test_task_tsdimaging.py:1565: in test402
    self.run_test(self.task_param, outshape, dirax)
test_task_tsdimaging.py:1541: in run_test
    res = tsdimaging(**task_param)
          ^^^^^^^^^^^^^^^^^^^^^^^^
/usr/local/lib/python3.12/site-packages/casatasks/tsdimaging.py:420: in __call__
    task_result = _tsdimaging_t( _pc.document['infiles'], _pc.document['outfile'], _pc.document['overwrite'], _pc.document['field'], _pc.document['spw'], _pc.document['antenna'], _pc.document['scan'], _pc.document['intent'], _pc.document['timerange'], _pc.document['outframe'], _pc.document['mode'], _pc.document['nchan'], _pc.document['start'], _pc.document['width'], _pc.document['veltype'], _pc.document['specmode'], _pc.document['interpolation'], _pc.document['pointingcolumn'], _pc.document['convertfirst'], _pc.document['projection'], _pc.document['imsize'], _pc.document['cell'], _pc.document['phasecenter'], _pc.document['stokes'], _pc.document['gridfunction'], _pc.document['convsupport'], _pc.document['truncate'], _pc.document['gwidth'], _pc.document['jwidth'], _pc.document['clipminmax'], _pc.document['minweight'], _pc.document['brightnessunit'], _pc.document['restfreq'] )
(12 more lines...)
Collapse Failed test_task_tsdimaging sdimaging_test_autocoord.test405
< 1 sec
TypeError: %d format: a real number is required, not numpy.ndarray
test_task_tsdimaging.py:1588: in test405
    self.run_test(self.task_param, outshape, dirax)
test_task_tsdimaging.py:1541: in run_test
    res = tsdimaging(**task_param)
          ^^^^^^^^^^^^^^^^^^^^^^^^
/usr/local/lib/python3.12/site-packages/casatasks/tsdimaging.py:420: in __call__
    task_result = _tsdimaging_t( _pc.document['infiles'], _pc.document['outfile'], _pc.document['overwrite'], _pc.document['field'], _pc.document['spw'], _pc.document['antenna'], _pc.document['scan'], _pc.document['intent'], _pc.document['timerange'], _pc.document['outframe'], _pc.document['mode'], _pc.document['nchan'], _pc.document['start'], _pc.document['width'], _pc.document['veltype'], _pc.document['specmode'], _pc.document['interpolation'], _pc.document['pointingcolumn'], _pc.document['convertfirst'], _pc.document['projection'], _pc.document['imsize'], _pc.document['cell'], _pc.document['phasecenter'], _pc.document['stokes'], _pc.document['gridfunction'], _pc.document['convsupport'], _pc.document['truncate'], _pc.document['gwidth'], _pc.document['jwidth'], _pc.document['clipminmax'], _pc.document['minweight'], _pc.document['brightnessunit'], _pc.document['restfreq'] )
(12 more lines...)
Collapse Failed test_task_tsdimaging sdimaging_test_mapextent.test_azel_pointing
< 1 sec
TypeError: %d format: a real number is required, not numpy.ndarray
test_task_tsdimaging.py:3419: in test_azel_pointing
    self.run_test(infiles=self.infiles_azel)
test_task_tsdimaging.py:3369: in run_test
    status = tsdimaging(**self.param)
             ^^^^^^^^^^^^^^^^^^^^^^^^
/usr/local/lib/python3.12/site-packages/casatasks/tsdimaging.py:420: in __call__
    task_result = _tsdimaging_t( _pc.document['infiles'], _pc.document['outfile'], _pc.document['overwrite'], _pc.document['field'], _pc.document['spw'], _pc.document['antenna'], _pc.document['scan'], _pc.document['intent'], _pc.document['timerange'], _pc.document['outframe'], _pc.document['mode'], _pc.document['nchan'], _pc.document['start'], _pc.document['width'], _pc.document['veltype'], _pc.document['specmode'], _pc.document['interpolation'], _pc.document['pointingcolumn'], _pc.document['convertfirst'], _pc.document['projection'], _pc.document['imsize'], _pc.document['cell'], _pc.document['phasecenter'], _pc.document['stokes'], _pc.document['gridfunction'], _pc.document['convsupport'], _pc.document['truncate'], _pc.document['gwidth'], _pc.document['jwidth'], _pc.document['clipminmax'], _pc.document['minweight'], _pc.document['brightnessunit'], _pc.document['restfreq'] )
(12 more lines...)
Collapse Failed test_task_tsdimaging sdimaging_test_mapextent.test_ephemeris
2 secs
TypeError: %d format: a real number is required, not numpy.ndarray
test_task_tsdimaging.py:3444: in test_ephemeris
    self.run_test(infiles=self.infiles_ephem, phasecenter='URANUS',
test_task_tsdimaging.py:3369: in run_test
    status = tsdimaging(**self.param)
             ^^^^^^^^^^^^^^^^^^^^^^^^
/usr/local/lib/python3.12/site-packages/casatasks/tsdimaging.py:420: in __call__
    task_result = _tsdimaging_t( _pc.document['infiles'], _pc.document['outfile'], _pc.document['overwrite'], _pc.document['field'], _pc.document['spw'], _pc.document['antenna'], _pc.document['scan'], _pc.document['intent'], _pc.document['timerange'], _pc.document['outframe'], _pc.document['mode'], _pc.document['nchan'], _pc.document['start'], _pc.document['width'], _pc.document['veltype'], _pc.document['specmode'], _pc.document['interpolation'], _pc.document['pointingcolumn'], _pc.document['convertfirst'], _pc.document['projection'], _pc.document['imsize'], _pc.document['cell'], _pc.document['phasecenter'], _pc.document['stokes'], _pc.document['gridfunction'], _pc.document['convsupport'], _pc.document['truncate'], _pc.document['gwidth'], _pc.document['jwidth'], _pc.document['clipminmax'], _pc.document['minweight'], _pc.document['brightnessunit'], _pc.document['restfreq'] )
(12 more lines...)
Collapse Failed test_task_tsdimaging sdimaging_test_polflag.test_i
< 1 sec
TypeError: %d format: a real number is required, not numpy.ndarray
test_task_tsdimaging.py:2987: in test_i
    self.run_test(self.task_param, refstats, out_shape, atol=1.e-5)
test_task_tsdimaging.py:2966: in run_test
    self.res = tsdimaging(**task_param)
               ^^^^^^^^^^^^^^^^^^^^^^^^
/usr/local/lib/python3.12/site-packages/casatasks/tsdimaging.py:420: in __call__
    task_result = _tsdimaging_t( _pc.document['infiles'], _pc.document['outfile'], _pc.document['overwrite'], _pc.document['field'], _pc.document['spw'], _pc.document['antenna'], _pc.document['scan'], _pc.document['intent'], _pc.document['timerange'], _pc.document['outframe'], _pc.document['mode'], _pc.document['nchan'], _pc.document['start'], _pc.document['width'], _pc.document['veltype'], _pc.document['specmode'], _pc.document['interpolation'], _pc.document['pointingcolumn'], _pc.document['convertfirst'], _pc.document['projection'], _pc.document['imsize'], _pc.document['cell'], _pc.document['phasecenter'], _pc.document['stokes'], _pc.document['gridfunction'], _pc.document['convsupport'], _pc.document['truncate'], _pc.document['gwidth'], _pc.document['jwidth'], _pc.document['clipminmax'], _pc.document['minweight'], _pc.document['brightnessunit'], _pc.document['restfreq'] )
(12 more lines...)
Collapse Failed test_task_tsdimaging sdimaging_test_polflag.test_pseudo_i
< 1 sec
TypeError: %d format: a real number is required, not numpy.ndarray
test_task_tsdimaging.py:2996: in test_pseudo_i
    self.run_test(self.task_param, refstats, out_shape, atol=1.e-5)
test_task_tsdimaging.py:2966: in run_test
    self.res = tsdimaging(**task_param)
               ^^^^^^^^^^^^^^^^^^^^^^^^
/usr/local/lib/python3.12/site-packages/casatasks/tsdimaging.py:420: in __call__
    task_result = _tsdimaging_t( _pc.document['infiles'], _pc.document['outfile'], _pc.document['overwrite'], _pc.document['field'], _pc.document['spw'], _pc.document['antenna'], _pc.document['scan'], _pc.document['intent'], _pc.document['timerange'], _pc.document['outframe'], _pc.document['mode'], _pc.document['nchan'], _pc.document['start'], _pc.document['width'], _pc.document['veltype'], _pc.document['specmode'], _pc.document['interpolation'], _pc.document['pointingcolumn'], _pc.document['convertfirst'], _pc.document['projection'], _pc.document['imsize'], _pc.document['cell'], _pc.document['phasecenter'], _pc.document['stokes'], _pc.document['gridfunction'], _pc.document['convsupport'], _pc.document['truncate'], _pc.document['gwidth'], _pc.document['jwidth'], _pc.document['clipminmax'], _pc.document['minweight'], _pc.document['brightnessunit'], _pc.document['restfreq'] )
(12 more lines...)
Collapse Failed test_task_tsdimaging sdimaging_test_polflag.test_xx
< 1 sec
TypeError: %d format: a real number is required, not numpy.ndarray
test_task_tsdimaging.py:3008: in test_xx
    self.run_test(self.task_param, refstats, out_shape, atol=1.e-5)
test_task_tsdimaging.py:2966: in run_test
    self.res = tsdimaging(**task_param)
               ^^^^^^^^^^^^^^^^^^^^^^^^
/usr/local/lib/python3.12/site-packages/casatasks/tsdimaging.py:420: in __call__
    task_result = _tsdimaging_t( _pc.document['infiles'], _pc.document['outfile'], _pc.document['overwrite'], _pc.document['field'], _pc.document['spw'], _pc.document['antenna'], _pc.document['scan'], _pc.document['intent'], _pc.document['timerange'], _pc.document['outframe'], _pc.document['mode'], _pc.document['nchan'], _pc.document['start'], _pc.document['width'], _pc.document['veltype'], _pc.document['specmode'], _pc.document['interpolation'], _pc.document['pointingcolumn'], _pc.document['convertfirst'], _pc.document['projection'], _pc.document['imsize'], _pc.document['cell'], _pc.document['phasecenter'], _pc.document['stokes'], _pc.document['gridfunction'], _pc.document['convsupport'], _pc.document['truncate'], _pc.document['gwidth'], _pc.document['jwidth'], _pc.document['clipminmax'], _pc.document['minweight'], _pc.document['brightnessunit'], _pc.document['restfreq'] )
(12 more lines...)
Collapse Failed test_task_tsdimaging sdimaging_test_polflag.test_xxyy
< 1 sec
TypeError: %d format: a real number is required, not numpy.ndarray
test_task_tsdimaging.py:3032: in test_xxyy
    self.run_test(self.task_param, refstats, out_shape, atol=1.e-5)
test_task_tsdimaging.py:2966: in run_test
    self.res = tsdimaging(**task_param)
               ^^^^^^^^^^^^^^^^^^^^^^^^
/usr/local/lib/python3.12/site-packages/casatasks/tsdimaging.py:420: in __call__
    task_result = _tsdimaging_t( _pc.document['infiles'], _pc.document['outfile'], _pc.document['overwrite'], _pc.document['field'], _pc.document['spw'], _pc.document['antenna'], _pc.document['scan'], _pc.document['intent'], _pc.document['timerange'], _pc.document['outframe'], _pc.document['mode'], _pc.document['nchan'], _pc.document['start'], _pc.document['width'], _pc.document['veltype'], _pc.document['specmode'], _pc.document['interpolation'], _pc.document['pointingcolumn'], _pc.document['convertfirst'], _pc.document['projection'], _pc.document['imsize'], _pc.document['cell'], _pc.document['phasecenter'], _pc.document['stokes'], _pc.document['gridfunction'], _pc.document['convsupport'], _pc.document['truncate'], _pc.document['gwidth'], _pc.document['jwidth'], _pc.document['clipminmax'], _pc.document['minweight'], _pc.document['brightnessunit'], _pc.document['restfreq'] )
(12 more lines...)
Collapse Failed test_task_tsdimaging sdimaging_test_polflag.test_yy
< 1 sec
TypeError: %d format: a real number is required, not numpy.ndarray
test_task_tsdimaging.py:3020: in test_yy
    self.run_test(self.task_param, refstats, out_shape, atol=1.e-5)
test_task_tsdimaging.py:2966: in run_test
    self.res = tsdimaging(**task_param)
               ^^^^^^^^^^^^^^^^^^^^^^^^
/usr/local/lib/python3.12/site-packages/casatasks/tsdimaging.py:420: in __call__
    task_result = _tsdimaging_t( _pc.document['infiles'], _pc.document['outfile'], _pc.document['overwrite'], _pc.document['field'], _pc.document['spw'], _pc.document['antenna'], _pc.document['scan'], _pc.document['intent'], _pc.document['timerange'], _pc.document['outframe'], _pc.document['mode'], _pc.document['nchan'], _pc.document['start'], _pc.document['width'], _pc.document['veltype'], _pc.document['specmode'], _pc.document['interpolation'], _pc.document['pointingcolumn'], _pc.document['convertfirst'], _pc.document['projection'], _pc.document['imsize'], _pc.document['cell'], _pc.document['phasecenter'], _pc.document['stokes'], _pc.document['gridfunction'], _pc.document['convsupport'], _pc.document['truncate'], _pc.document['gwidth'], _pc.document['jwidth'], _pc.document['clipminmax'], _pc.document['minweight'], _pc.document['brightnessunit'], _pc.document['restfreq'] )
(12 more lines...)