Tools and Tasks tests for Python 3.12

Build: #296 failed Child of CASASPECS-MASTERBUILDCASALITH-304

Test results

  • 12 tests in total
  • 12 tests failed
  • 12 failures are new
  • < 1 second taken in total.
New test failures 12
Status Test View job Duration
Collapse Failed pytest internal
Test Tools ARM Macos 15 Py3.12 < 1 sec
internal error
Traceback (most recent call last):
  File "/Users/casaci/bamboohome/xml-data/build-dir/CASASPECS-MASTERTESTPY312-TTOARM15PY312/casa6testenv/lib/python3.12/site-packages/_pytest/main.py", line 333, in wrap_session
    session.exitstatus = doit(config, session) or 0
                         ^^^^^^^^^^^^^^^^^^^^^
  File "/Users/casaci/bamboohome/xml-data/build-dir/CASASPECS-MASTERTESTPY312-TTOARM15PY312/casa6testenv/lib/python3.12/site-packages/_pytest/main.py", line 387, in _main
    config.hook.pytest_runtestloop(session=session)
  File "/Users/casaci/bamboohome/xml-data/build-dir/CASASPECS-MASTERTESTPY312-TTOARM15PY312/casa6testenv/lib/python3.12/site-packages/pluggy/_caller.py", line 197, in __call__
(57 more lines...)
Collapse Failed pytest internal
Test Tools Many Linux 2.34 Rocky 9.5 Py3.12 < 1 sec
internal error
Traceback (most recent call last):
  File "/home/casatest/venv/lib/python3.12/site-packages/_pytest/main.py", line 333, in wrap_session
    session.exitstatus = doit(config, session) or 0
                         ^^^^^^^^^^^^^^^^^^^^^
  File "/home/casatest/venv/lib/python3.12/site-packages/_pytest/main.py", line 387, in _main
    config.hook.pytest_runtestloop(session=session)
  File "/home/casatest/venv/lib/python3.12/site-packages/pluggy/_caller.py", line 197, in __call__
(57 more lines...)
Collapse Failed pytest internal
Test Tasks ARM Macos 15 Py3.12 < 1 sec
internal error
Traceback (most recent call last):
  File "/Users/casaci/bamboohome/xml-data/build-dir/CASASPECS-MASTERTESTPY312-TTARMM15PY312/casa6testenv/lib/python3.12/site-packages/_pytest/main.py", line 333, in wrap_session
    session.exitstatus = doit(config, session) or 0
                         ^^^^^^^^^^^^^^^^^^^^^
  File "/Users/casaci/bamboohome/xml-data/build-dir/CASASPECS-MASTERTESTPY312-TTARMM15PY312/casa6testenv/lib/python3.12/site-packages/_pytest/main.py", line 387, in _main
    config.hook.pytest_runtestloop(session=session)
  File "/Users/casaci/bamboohome/xml-data/build-dir/CASASPECS-MASTERTESTPY312-TTARMM15PY312/casa6testenv/lib/python3.12/site-packages/pluggy/_caller.py", line 197, in __call__
(57 more lines...)
Collapse Failed pytest internal
Test Tools Many Linux 2.28 Ubuntu 24.04 Py3.12 < 1 sec
internal error
Traceback (most recent call last):
  File "/home/casatest/venv/lib/python3.12/site-packages/_pytest/main.py", line 333, in wrap_session
    session.exitstatus = doit(config, session) or 0
                         ^^^^^^^^^^^^^^^^^^^^^
  File "/home/casatest/venv/lib/python3.12/site-packages/_pytest/main.py", line 387, in _main
    config.hook.pytest_runtestloop(session=session)
  File "/home/casatest/venv/lib/python3.12/site-packages/pluggy/_caller.py", line 197, in __call__
(57 more lines...)
Collapse Failed pytest internal
Test Tasks Many Linux 2.28 Rocky 9.5 Py3.12 < 1 sec
internal error
Traceback (most recent call last):
  File "/home/casatest/venv/lib/python3.12/site-packages/_pytest/main.py", line 333, in wrap_session
    session.exitstatus = doit(config, session) or 0
                         ^^^^^^^^^^^^^^^^^^^^^
  File "/home/casatest/venv/lib/python3.12/site-packages/_pytest/main.py", line 387, in _main
    config.hook.pytest_runtestloop(session=session)
  File "/home/casatest/venv/lib/python3.12/site-packages/pluggy/_caller.py", line 197, in __call__
(57 more lines...)
Collapse Failed pytest internal
Test Tasks Many Linux 2.28 Rocky 8.10 Py3.12 < 1 sec
internal error
Traceback (most recent call last):
  File "/home/casatest/venv/lib/python3.12/site-packages/_pytest/main.py", line 333, in wrap_session
    session.exitstatus = doit(config, session) or 0
                         ^^^^^^^^^^^^^^^^^^^^^
  File "/home/casatest/venv/lib/python3.12/site-packages/_pytest/main.py", line 387, in _main
    config.hook.pytest_runtestloop(session=session)
  File "/home/casatest/venv/lib/python3.12/site-packages/pluggy/_caller.py", line 197, in __call__
(57 more lines...)
Collapse Failed pytest internal
Test Tasks ARM macOS 26 Py3.12 < 1 sec
internal error
Traceback (most recent call last):
  File "/Users/casaci/bamboohome/xml-data/build-dir/CASASPECS-MASTERTESTPY312-TTARMM26PY312/casa6testenv/lib/python3.12/site-packages/_pytest/main.py", line 333, in wrap_session
    session.exitstatus = doit(config, session) or 0
                         ^^^^^^^^^^^^^^^^^^^^^
  File "/Users/casaci/bamboohome/xml-data/build-dir/CASASPECS-MASTERTESTPY312-TTARMM26PY312/casa6testenv/lib/python3.12/site-packages/_pytest/main.py", line 387, in _main
    config.hook.pytest_runtestloop(session=session)
  File "/Users/casaci/bamboohome/xml-data/build-dir/CASASPECS-MASTERTESTPY312-TTARMM26PY312/casa6testenv/lib/python3.12/site-packages/pluggy/_caller.py", line 197, in __call__
(57 more lines...)
Collapse Failed pytest internal
Test Tools Many Linux 2.28 Rocky 9.5 Py3.12 < 1 sec
internal error
Traceback (most recent call last):
  File "/home/casatest/venv/lib/python3.12/site-packages/_pytest/main.py", line 333, in wrap_session
    session.exitstatus = doit(config, session) or 0
                         ^^^^^^^^^^^^^^^^^^^^^
  File "/home/casatest/venv/lib/python3.12/site-packages/_pytest/main.py", line 387, in _main
    config.hook.pytest_runtestloop(session=session)
  File "/home/casatest/venv/lib/python3.12/site-packages/pluggy/_caller.py", line 197, in __call__
(57 more lines...)
Collapse Failed pytest internal
Test Tasks Many Linux 2.34 Rocky 9.5 Py3.12 < 1 sec
internal error
Traceback (most recent call last):
  File "/home/casatest/venv/lib/python3.12/site-packages/_pytest/main.py", line 333, in wrap_session
    session.exitstatus = doit(config, session) or 0
                         ^^^^^^^^^^^^^^^^^^^^^
  File "/home/casatest/venv/lib/python3.12/site-packages/_pytest/main.py", line 387, in _main
    config.hook.pytest_runtestloop(session=session)
  File "/home/casatest/venv/lib/python3.12/site-packages/pluggy/_caller.py", line 197, in __call__
(57 more lines...)
Collapse Failed pytest internal
Test Tools ARM macOS 26 Py3.12 < 1 sec
internal error
Traceback (most recent call last):
  File "/Users/casaci/bamboohome/xml-data/build-dir/CASASPECS-MASTERTESTPY312-TTOARM26PY312/casa6testenv/lib/python3.12/site-packages/_pytest/main.py", line 333, in wrap_session
    session.exitstatus = doit(config, session) or 0
                         ^^^^^^^^^^^^^^^^^^^^^
  File "/Users/casaci/bamboohome/xml-data/build-dir/CASASPECS-MASTERTESTPY312-TTOARM26PY312/casa6testenv/lib/python3.12/site-packages/_pytest/main.py", line 387, in _main
    config.hook.pytest_runtestloop(session=session)
  File "/Users/casaci/bamboohome/xml-data/build-dir/CASASPECS-MASTERTESTPY312-TTOARM26PY312/casa6testenv/lib/python3.12/site-packages/pluggy/_caller.py", line 197, in __call__
(57 more lines...)
Collapse Failed pytest internal
Test Tasks Many Linux 2.28 Ubuntu 24.04 Py3.12 < 1 sec
internal error
Traceback (most recent call last):
  File "/home/casatest/venv/lib/python3.12/site-packages/_pytest/main.py", line 333, in wrap_session
    session.exitstatus = doit(config, session) or 0
                         ^^^^^^^^^^^^^^^^^^^^^
  File "/home/casatest/venv/lib/python3.12/site-packages/_pytest/main.py", line 387, in _main
    config.hook.pytest_runtestloop(session=session)
  File "/home/casatest/venv/lib/python3.12/site-packages/pluggy/_caller.py", line 197, in __call__
(57 more lines...)
Collapse Failed pytest internal
Test Tools Many Linux 2.28 Rocky 8.10 Py3.12 < 1 sec
internal error
Traceback (most recent call last):
  File "/home/casatest/venv/lib/python3.12/site-packages/_pytest/main.py", line 333, in wrap_session
    session.exitstatus = doit(config, session) or 0
                         ^^^^^^^^^^^^^^^^^^^^^
  File "/home/casatest/venv/lib/python3.12/site-packages/_pytest/main.py", line 387, in _main
    config.hook.pytest_runtestloop(session=session)
  File "/home/casatest/venv/lib/python3.12/site-packages/pluggy/_caller.py", line 197, in __call__
(57 more lines...)