Build: #181 failed
Job: Test Tasks Many Linux 2.28 Rocky 8.10 Py3.12 failed
Test results
- 3,714 tests in total
- 2 tests failed
- 138 tests were quarantined / skipped
- 333 minutes taken in total.
Build 181 has the following 2 errors:There were no new test failures since the previous build.
| Status | Test | Failing since | Duration | |
|---|---|---|---|---|
|
test_task_tclean
test_widefield.test_widefield_awphpg_mtmfs_via_cube
|
Failing since build #180 (Child of CASASPECS-MASTERBUILDCASALITHGPU-195) | 23 secs | ||
AssertionError: False is not true
test_task_tclean.py:4514: in test_widefield_awphpg_mtmfs_via_cube
self.assertTrue(self.check_final(report))
E AssertionError: False is not true
|
||||
|
test_task_tclean
test_wproject.test_wterm_awphpg
|
Failing since build #180 (Child of CASASPECS-MASTERBUILDCASALITHGPU-195) | 39 secs | ||
AssertionError: False is not true
test_task_tclean.py:4254: in test_wterm_awphpg
self.assertTrue(self.check_final(report))
E AssertionError: False is not true
|
||||