Build: #1 failed Child of CASASPECS-DBC26-1

Build result summary

Details

Completed
Queue duration
1 second
Duration
332 minutes
Labels
None
Revisions
CASA6
5eeda5065df919482d1751fbf313937e8c35d34c 5eeda5065df919482d1751fbf313937e8c35d34c
OPEN-CASA-PKG
4b9064f16a8d185b162391c3ef324299625bd94b 4b9064f16a8d185b162391c3ef324299625bd94b
Total tests
3042

Tests

Responsible

No one has taken responsibility for this failure

Tests

New test failures 9
Status Test View job Duration
Collapse Failed test_task_deconvolve SomeClass.test_task_deconvolve History
Test Tasks ARM Macos 14 Py3.10 < 1 sec
Abort trap: 6
Abort trap: 6
Collapse Failed test_task_tclean test_widefield.test_widefield_awphpg_mfs History
Test Tasks ARM Macos 14 Py3.10 < 1 sec
RuntimeError: 2024-11-01 19:30:45	SEVERE	SynthesisImagerVi2::defineImage (file /Users/casaci/bamboohome/xml-data/build-dir/CASASPECS-DBC26-BPO14AP310/casa6/casatools/src/code/synthesis/ImagerObjects/SynthesisImagerVi2.cc, line 595)	Error in setting up FTMachine(): Code has not been built with gpu libraries
test_task_tclean.py:3883: in test_widefield_awphpg_mfs
    ret = tclean(vis=self.msfile,spw='1',field='*',imagename=self.img,imsize=512,cell='10.0arcsec',phasecenter="J2000 19:59:28.500 +40.44.01.50",
../../../../casa6testenv/lib/python3.10/site-packages/casatasks/tclean.py:1838: in __call__
    task_result = _tclean_t( _pc.document['vis'], _pc.document['selectdata'], _pc.document['field'], _pc.document['spw'], _pc.document['timerange'], _pc.document['uvrange'], _pc.document['antenna'], _pc.document['scan'], _pc.document['observation'], _pc.document['intent'], _pc.document['datacolumn'], _pc.document['imagename'], _pc.document['imsize'], _pc.document['cell'], _pc.document['phasecenter'], _pc.document['stokes'], _pc.document['projection'], _pc.document['startmodel'], _pc.document['specmode'], _pc.document['reffreq'], _pc.document['nchan'], _pc.document['start'], _pc.document['width'], _pc.document['outframe'], _pc.document['veltype'], _pc.document['restfreq'], _pc.document['interpolation'], _pc.document['perchanweightdensity'], _pc.document['gridder'], _pc.document['facets'], _pc.document['psfphasecenter'], _pc.document['wprojplanes'], _pc.document['vptable'], _pc.document['mosweight'], _pc.document['aterm'], _pc.document['psterm'], _pc.document['wbawp'], _pc.document['conjbeams'], _pc.document['cfcache'], _pc.document['usepointing'], _pc.document['computepastep'], _pc.document['rotatepastep'], _pc.document['pointingoffsetsigdev'], _pc.document['pblimit'], _pc.document['normtype'], _pc.document['deconvolver'], _pc.document['scales'], _pc.document['nterms'], _pc.document['smallscalebias'], _pc.document['fusedthreshold'], _pc.document['largestscale'], _pc.document['restoration'], _pc.document['restoringbeam'], _pc.document['pbcor'], _pc.document['outlierfile'], _pc.document['weighting'], _pc.document['robust'], _pc.document['noise'], _pc.document['npixels'], _pc.document['uvtaper'], _pc.document['niter'], _pc.document['gain'], _pc.document['threshold'], _pc.document['nsigma'], _pc.document['cycleniter'], _pc.document['cyclefactor'], _pc.document['minpsffraction'], _pc.document['maxpsffraction'], _pc.document['interactive'], _pc.document['nmajor'], _pc.document['fullsummary'], _pc.document['usemask'], _pc.document['mask'], _pc.document['pbmask'], _pc.document['sidelobethreshold'], _pc.document['noisethreshold'], _pc.document['lownoisethreshold'], _pc.document['negativethreshold'], _pc.document['smoothfactor'], _pc.document['minbeamfrac'], _pc.document['cutthreshold'], _pc.document['growiterations'], _pc.document['dogrowprune'], _pc.document['minpercentchange'], _pc.document['verbose'], _pc.document['fastnoise'], _pc.document['restart'], _pc.document['savemodel'], _pc.document['calcres'], _pc.document['calcpsf'], _pc.document['psfcutoff'], _pc.document['parallel'] )
../../../../casa6testenv/lib/python3.10/site-packages/casatasks/private/task_tclean.py:448: in tclean
    imager.initializeImagers()
../../../../casa6testenv/lib/python3.10/site-packages/casatasks/private/imagerhelpers/imager_base.py:133: in initializeImagers
(6 more lines...)
Collapse Failed test_task_tclean test_widefield.test_widefield_awphpg_mtmfs_via_cube History
Test Tasks ARM Macos 14 Py3.10 < 1 sec
RuntimeError: 2024-11-01 19:30:45	SEVERE	SynthesisImagerVi2::defineImage (file /Users/casaci/bamboohome/xml-data/build-dir/CASASPECS-DBC26-BPO14AP310/casa6/casatools/src/code/synthesis/ImagerObjects/SynthesisImagerVi2.cc, line 595)	Error in setting up FTMachine(): Code has not been built with gpu libraries
test_task_tclean.py:4016: in test_widefield_awphpg_mtmfs_via_cube
    ret = tclean(vis=self.msfile,field='*',imagename=self.img,imsize=512,cell='10.0arcsec',phasecenter="J2000 19:59:28.500 +40.44.01.50",
../../../../casa6testenv/lib/python3.10/site-packages/casatasks/tclean.py:1838: in __call__
    task_result = _tclean_t( _pc.document['vis'], _pc.document['selectdata'], _pc.document['field'], _pc.document['spw'], _pc.document['timerange'], _pc.document['uvrange'], _pc.document['antenna'], _pc.document['scan'], _pc.document['observation'], _pc.document['intent'], _pc.document['datacolumn'], _pc.document['imagename'], _pc.document['imsize'], _pc.document['cell'], _pc.document['phasecenter'], _pc.document['stokes'], _pc.document['projection'], _pc.document['startmodel'], _pc.document['specmode'], _pc.document['reffreq'], _pc.document['nchan'], _pc.document['start'], _pc.document['width'], _pc.document['outframe'], _pc.document['veltype'], _pc.document['restfreq'], _pc.document['interpolation'], _pc.document['perchanweightdensity'], _pc.document['gridder'], _pc.document['facets'], _pc.document['psfphasecenter'], _pc.document['wprojplanes'], _pc.document['vptable'], _pc.document['mosweight'], _pc.document['aterm'], _pc.document['psterm'], _pc.document['wbawp'], _pc.document['conjbeams'], _pc.document['cfcache'], _pc.document['usepointing'], _pc.document['computepastep'], _pc.document['rotatepastep'], _pc.document['pointingoffsetsigdev'], _pc.document['pblimit'], _pc.document['normtype'], _pc.document['deconvolver'], _pc.document['scales'], _pc.document['nterms'], _pc.document['smallscalebias'], _pc.document['fusedthreshold'], _pc.document['largestscale'], _pc.document['restoration'], _pc.document['restoringbeam'], _pc.document['pbcor'], _pc.document['outlierfile'], _pc.document['weighting'], _pc.document['robust'], _pc.document['noise'], _pc.document['npixels'], _pc.document['uvtaper'], _pc.document['niter'], _pc.document['gain'], _pc.document['threshold'], _pc.document['nsigma'], _pc.document['cycleniter'], _pc.document['cyclefactor'], _pc.document['minpsffraction'], _pc.document['maxpsffraction'], _pc.document['interactive'], _pc.document['nmajor'], _pc.document['fullsummary'], _pc.document['usemask'], _pc.document['mask'], _pc.document['pbmask'], _pc.document['sidelobethreshold'], _pc.document['noisethreshold'], _pc.document['lownoisethreshold'], _pc.document['negativethreshold'], _pc.document['smoothfactor'], _pc.document['minbeamfrac'], _pc.document['cutthreshold'], _pc.document['growiterations'], _pc.document['dogrowprune'], _pc.document['minpercentchange'], _pc.document['verbose'], _pc.document['fastnoise'], _pc.document['restart'], _pc.document['savemodel'], _pc.document['calcres'], _pc.document['calcpsf'], _pc.document['psfcutoff'], _pc.document['parallel'] )
../../../../casa6testenv/lib/python3.10/site-packages/casatasks/private/task_tclean.py:448: in tclean
    imager.initializeImagers()
../../../../casa6testenv/lib/python3.10/site-packages/casatasks/private/imagerhelpers/imager_base.py:133: in initializeImagers
(6 more lines...)
Collapse Failed test_task_tclean test_widefield.test_widefield_awphpg_cube History
Test Tasks ARM Macos 14 Py3.10 < 1 sec
RuntimeError: 2024-11-01 19:30:45	SEVERE	SynthesisImagerVi2::defineImage (file /Users/casaci/bamboohome/xml-data/build-dir/CASASPECS-DBC26-BPO14AP310/casa6/casatools/src/code/synthesis/ImagerObjects/SynthesisImagerVi2.cc, line 595)	Error in setting up FTMachine(): Code has not been built with gpu libraries
test_task_tclean.py:3927: in test_widefield_awphpg_cube
    ret = tclean(vis=self.msfile,field='*',imagename=self.img,imsize=512,cell='10.0arcsec',phasecenter="J2000 19:59:28.500 +40.44.01.50",
../../../../casa6testenv/lib/python3.10/site-packages/casatasks/tclean.py:1838: in __call__
    task_result = _tclean_t( _pc.document['vis'], _pc.document['selectdata'], _pc.document['field'], _pc.document['spw'], _pc.document['timerange'], _pc.document['uvrange'], _pc.document['antenna'], _pc.document['scan'], _pc.document['observation'], _pc.document['intent'], _pc.document['datacolumn'], _pc.document['imagename'], _pc.document['imsize'], _pc.document['cell'], _pc.document['phasecenter'], _pc.document['stokes'], _pc.document['projection'], _pc.document['startmodel'], _pc.document['specmode'], _pc.document['reffreq'], _pc.document['nchan'], _pc.document['start'], _pc.document['width'], _pc.document['outframe'], _pc.document['veltype'], _pc.document['restfreq'], _pc.document['interpolation'], _pc.document['perchanweightdensity'], _pc.document['gridder'], _pc.document['facets'], _pc.document['psfphasecenter'], _pc.document['wprojplanes'], _pc.document['vptable'], _pc.document['mosweight'], _pc.document['aterm'], _pc.document['psterm'], _pc.document['wbawp'], _pc.document['conjbeams'], _pc.document['cfcache'], _pc.document['usepointing'], _pc.document['computepastep'], _pc.document['rotatepastep'], _pc.document['pointingoffsetsigdev'], _pc.document['pblimit'], _pc.document['normtype'], _pc.document['deconvolver'], _pc.document['scales'], _pc.document['nterms'], _pc.document['smallscalebias'], _pc.document['fusedthreshold'], _pc.document['largestscale'], _pc.document['restoration'], _pc.document['restoringbeam'], _pc.document['pbcor'], _pc.document['outlierfile'], _pc.document['weighting'], _pc.document['robust'], _pc.document['noise'], _pc.document['npixels'], _pc.document['uvtaper'], _pc.document['niter'], _pc.document['gain'], _pc.document['threshold'], _pc.document['nsigma'], _pc.document['cycleniter'], _pc.document['cyclefactor'], _pc.document['minpsffraction'], _pc.document['maxpsffraction'], _pc.document['interactive'], _pc.document['nmajor'], _pc.document['fullsummary'], _pc.document['usemask'], _pc.document['mask'], _pc.document['pbmask'], _pc.document['sidelobethreshold'], _pc.document['noisethreshold'], _pc.document['lownoisethreshold'], _pc.document['negativethreshold'], _pc.document['smoothfactor'], _pc.document['minbeamfrac'], _pc.document['cutthreshold'], _pc.document['growiterations'], _pc.document['dogrowprune'], _pc.document['minpercentchange'], _pc.document['verbose'], _pc.document['fastnoise'], _pc.document['restart'], _pc.document['savemodel'], _pc.document['calcres'], _pc.document['calcpsf'], _pc.document['psfcutoff'], _pc.document['parallel'] )
../../../../casa6testenv/lib/python3.10/site-packages/casatasks/private/task_tclean.py:448: in tclean
    imager.initializeImagers()
../../../../casa6testenv/lib/python3.10/site-packages/casatasks/private/imagerhelpers/imager_base.py:133: in initializeImagers
(6 more lines...)
Collapse Failed test_task_tclean test_widefield.test_widefield_awphpg_mfs History
Test Tasks Many Linux 2.28 Py3.10 < 1 sec
RuntimeError: 2024-11-01 22:38:27	SEVERE	SynthesisImagerVi2::defineImage (file /source/casa6/casatools/src/code/synthesis/ImagerObjects/SynthesisImagerVi2.cc, line 595)	Error in setting up FTMachine(): Code has not been built with gpu libraries
test_task_tclean.py:3883: in test_widefield_awphpg_mfs
    ret = tclean(vis=self.msfile,spw='1',field='*',imagename=self.img,imsize=512,cell='10.0arcsec',phasecenter="J2000 19:59:28.500 +40.44.01.50",
../../../../venv/lib/python3.10/site-packages/casatasks/tclean.py:1838: in __call__
    task_result = _tclean_t( _pc.document['vis'], _pc.document['selectdata'], _pc.document['field'], _pc.document['spw'], _pc.document['timerange'], _pc.document['uvrange'], _pc.document['antenna'], _pc.document['scan'], _pc.document['observation'], _pc.document['intent'], _pc.document['datacolumn'], _pc.document['imagename'], _pc.document['imsize'], _pc.document['cell'], _pc.document['phasecenter'], _pc.document['stokes'], _pc.document['projection'], _pc.document['startmodel'], _pc.document['specmode'], _pc.document['reffreq'], _pc.document['nchan'], _pc.document['start'], _pc.document['width'], _pc.document['outframe'], _pc.document['veltype'], _pc.document['restfreq'], _pc.document['interpolation'], _pc.document['perchanweightdensity'], _pc.document['gridder'], _pc.document['facets'], _pc.document['psfphasecenter'], _pc.document['wprojplanes'], _pc.document['vptable'], _pc.document['mosweight'], _pc.document['aterm'], _pc.document['psterm'], _pc.document['wbawp'], _pc.document['conjbeams'], _pc.document['cfcache'], _pc.document['usepointing'], _pc.document['computepastep'], _pc.document['rotatepastep'], _pc.document['pointingoffsetsigdev'], _pc.document['pblimit'], _pc.document['normtype'], _pc.document['deconvolver'], _pc.document['scales'], _pc.document['nterms'], _pc.document['smallscalebias'], _pc.document['fusedthreshold'], _pc.document['largestscale'], _pc.document['restoration'], _pc.document['restoringbeam'], _pc.document['pbcor'], _pc.document['outlierfile'], _pc.document['weighting'], _pc.document['robust'], _pc.document['noise'], _pc.document['npixels'], _pc.document['uvtaper'], _pc.document['niter'], _pc.document['gain'], _pc.document['threshold'], _pc.document['nsigma'], _pc.document['cycleniter'], _pc.document['cyclefactor'], _pc.document['minpsffraction'], _pc.document['maxpsffraction'], _pc.document['interactive'], _pc.document['nmajor'], _pc.document['fullsummary'], _pc.document['usemask'], _pc.document['mask'], _pc.document['pbmask'], _pc.document['sidelobethreshold'], _pc.document['noisethreshold'], _pc.document['lownoisethreshold'], _pc.document['negativethreshold'], _pc.document['smoothfactor'], _pc.document['minbeamfrac'], _pc.document['cutthreshold'], _pc.document['growiterations'], _pc.document['dogrowprune'], _pc.document['minpercentchange'], _pc.document['verbose'], _pc.document['fastnoise'], _pc.document['restart'], _pc.document['savemodel'], _pc.document['calcres'], _pc.document['calcpsf'], _pc.document['psfcutoff'], _pc.document['parallel'] )
../../../../venv/lib/python3.10/site-packages/casatasks/private/task_tclean.py:448: in tclean
    imager.initializeImagers()
../../../../venv/lib/python3.10/site-packages/casatasks/private/imagerhelpers/imager_base.py:133: in initializeImagers
(6 more lines...)
Collapse Failed test_task_tclean test_widefield.test_widefield_awphpg_mtmfs_via_cube History
Test Tasks Many Linux 2.28 Py3.10 < 1 sec
RuntimeError: 2024-11-01 22:38:28	SEVERE	SynthesisImagerVi2::defineImage (file /source/casa6/casatools/src/code/synthesis/ImagerObjects/SynthesisImagerVi2.cc, line 595)	Error in setting up FTMachine(): Code has not been built with gpu libraries
test_task_tclean.py:4016: in test_widefield_awphpg_mtmfs_via_cube
    ret = tclean(vis=self.msfile,field='*',imagename=self.img,imsize=512,cell='10.0arcsec',phasecenter="J2000 19:59:28.500 +40.44.01.50",
../../../../venv/lib/python3.10/site-packages/casatasks/tclean.py:1838: in __call__
    task_result = _tclean_t( _pc.document['vis'], _pc.document['selectdata'], _pc.document['field'], _pc.document['spw'], _pc.document['timerange'], _pc.document['uvrange'], _pc.document['antenna'], _pc.document['scan'], _pc.document['observation'], _pc.document['intent'], _pc.document['datacolumn'], _pc.document['imagename'], _pc.document['imsize'], _pc.document['cell'], _pc.document['phasecenter'], _pc.document['stokes'], _pc.document['projection'], _pc.document['startmodel'], _pc.document['specmode'], _pc.document['reffreq'], _pc.document['nchan'], _pc.document['start'], _pc.document['width'], _pc.document['outframe'], _pc.document['veltype'], _pc.document['restfreq'], _pc.document['interpolation'], _pc.document['perchanweightdensity'], _pc.document['gridder'], _pc.document['facets'], _pc.document['psfphasecenter'], _pc.document['wprojplanes'], _pc.document['vptable'], _pc.document['mosweight'], _pc.document['aterm'], _pc.document['psterm'], _pc.document['wbawp'], _pc.document['conjbeams'], _pc.document['cfcache'], _pc.document['usepointing'], _pc.document['computepastep'], _pc.document['rotatepastep'], _pc.document['pointingoffsetsigdev'], _pc.document['pblimit'], _pc.document['normtype'], _pc.document['deconvolver'], _pc.document['scales'], _pc.document['nterms'], _pc.document['smallscalebias'], _pc.document['fusedthreshold'], _pc.document['largestscale'], _pc.document['restoration'], _pc.document['restoringbeam'], _pc.document['pbcor'], _pc.document['outlierfile'], _pc.document['weighting'], _pc.document['robust'], _pc.document['noise'], _pc.document['npixels'], _pc.document['uvtaper'], _pc.document['niter'], _pc.document['gain'], _pc.document['threshold'], _pc.document['nsigma'], _pc.document['cycleniter'], _pc.document['cyclefactor'], _pc.document['minpsffraction'], _pc.document['maxpsffraction'], _pc.document['interactive'], _pc.document['nmajor'], _pc.document['fullsummary'], _pc.document['usemask'], _pc.document['mask'], _pc.document['pbmask'], _pc.document['sidelobethreshold'], _pc.document['noisethreshold'], _pc.document['lownoisethreshold'], _pc.document['negativethreshold'], _pc.document['smoothfactor'], _pc.document['minbeamfrac'], _pc.document['cutthreshold'], _pc.document['growiterations'], _pc.document['dogrowprune'], _pc.document['minpercentchange'], _pc.document['verbose'], _pc.document['fastnoise'], _pc.document['restart'], _pc.document['savemodel'], _pc.document['calcres'], _pc.document['calcpsf'], _pc.document['psfcutoff'], _pc.document['parallel'] )
../../../../venv/lib/python3.10/site-packages/casatasks/private/task_tclean.py:448: in tclean
    imager.initializeImagers()
../../../../venv/lib/python3.10/site-packages/casatasks/private/imagerhelpers/imager_base.py:133: in initializeImagers
(6 more lines...)
Collapse Failed test_task_tclean test_widefield.test_widefield_awphpg_cube History
Test Tasks Many Linux 2.28 Py3.10 < 1 sec
RuntimeError: 2024-11-01 22:38:27	SEVERE	SynthesisImagerVi2::defineImage (file /source/casa6/casatools/src/code/synthesis/ImagerObjects/SynthesisImagerVi2.cc, line 595)	Error in setting up FTMachine(): Code has not been built with gpu libraries
test_task_tclean.py:3927: in test_widefield_awphpg_cube
    ret = tclean(vis=self.msfile,field='*',imagename=self.img,imsize=512,cell='10.0arcsec',phasecenter="J2000 19:59:28.500 +40.44.01.50",
../../../../venv/lib/python3.10/site-packages/casatasks/tclean.py:1838: in __call__
    task_result = _tclean_t( _pc.document['vis'], _pc.document['selectdata'], _pc.document['field'], _pc.document['spw'], _pc.document['timerange'], _pc.document['uvrange'], _pc.document['antenna'], _pc.document['scan'], _pc.document['observation'], _pc.document['intent'], _pc.document['datacolumn'], _pc.document['imagename'], _pc.document['imsize'], _pc.document['cell'], _pc.document['phasecenter'], _pc.document['stokes'], _pc.document['projection'], _pc.document['startmodel'], _pc.document['specmode'], _pc.document['reffreq'], _pc.document['nchan'], _pc.document['start'], _pc.document['width'], _pc.document['outframe'], _pc.document['veltype'], _pc.document['restfreq'], _pc.document['interpolation'], _pc.document['perchanweightdensity'], _pc.document['gridder'], _pc.document['facets'], _pc.document['psfphasecenter'], _pc.document['wprojplanes'], _pc.document['vptable'], _pc.document['mosweight'], _pc.document['aterm'], _pc.document['psterm'], _pc.document['wbawp'], _pc.document['conjbeams'], _pc.document['cfcache'], _pc.document['usepointing'], _pc.document['computepastep'], _pc.document['rotatepastep'], _pc.document['pointingoffsetsigdev'], _pc.document['pblimit'], _pc.document['normtype'], _pc.document['deconvolver'], _pc.document['scales'], _pc.document['nterms'], _pc.document['smallscalebias'], _pc.document['fusedthreshold'], _pc.document['largestscale'], _pc.document['restoration'], _pc.document['restoringbeam'], _pc.document['pbcor'], _pc.document['outlierfile'], _pc.document['weighting'], _pc.document['robust'], _pc.document['noise'], _pc.document['npixels'], _pc.document['uvtaper'], _pc.document['niter'], _pc.document['gain'], _pc.document['threshold'], _pc.document['nsigma'], _pc.document['cycleniter'], _pc.document['cyclefactor'], _pc.document['minpsffraction'], _pc.document['maxpsffraction'], _pc.document['interactive'], _pc.document['nmajor'], _pc.document['fullsummary'], _pc.document['usemask'], _pc.document['mask'], _pc.document['pbmask'], _pc.document['sidelobethreshold'], _pc.document['noisethreshold'], _pc.document['lownoisethreshold'], _pc.document['negativethreshold'], _pc.document['smoothfactor'], _pc.document['minbeamfrac'], _pc.document['cutthreshold'], _pc.document['growiterations'], _pc.document['dogrowprune'], _pc.document['minpercentchange'], _pc.document['verbose'], _pc.document['fastnoise'], _pc.document['restart'], _pc.document['savemodel'], _pc.document['calcres'], _pc.document['calcpsf'], _pc.document['psfcutoff'], _pc.document['parallel'] )
../../../../venv/lib/python3.10/site-packages/casatasks/private/task_tclean.py:448: in tclean
    imager.initializeImagers()
../../../../venv/lib/python3.10/site-packages/casatasks/private/imagerhelpers/imager_base.py:133: in initializeImagers
(6 more lines...)
Collapse Failed test_task_tsdimaging sdimaging_test0.test012 History
Test Tasks ARM Macos 14 Py3.10 < 1 sec
AssertionError: -1 == -1 : Unexpected exception was thrown: 2024-11-01 19:47:34	SEVERE	tsdimaging::SynthesisImagerVi2::defineImage (file /Users/casaci/bamboohome/xml-data/build-dir/CASASPECS-DBC26-BPO14AP310/casa6/casatools/src/code/synthesis/ImagerObjects/SynthesisImagerVi2.cc, line 595)	Error in building Coordinate System and Image Shape : Internal Error : Image shape is invalid : [1,0,1,40]
test_task_tsdimaging.py:755: in test012
    self.run_exception_case(self.task_param, cpp_err_msg)
test_task_tsdimaging.py:610: in run_exception_case
    self.assertNotEqual(pos, -1,
E   AssertionError: -1 == -1 : Unexpected exception was thrown: 2024-11-01 19:47:34	SEVERE	tsdimaging::SynthesisImagerVi2::defineImage (file /Users/casaci/bamboohome/xml-data/build-dir/CASASPECS-DBC26-BPO14AP310/casa6/casatools/src/code/synthesis/ImagerObjects/SynthesisImagerVi2.cc, line 595)	Error in building Coordinate System and Image Shape : Internal Error : Image shape is invalid : [1,0,1,40]
Collapse Failed test_task_tsdimaging sdimaging_test0.test012 History
Test Tasks Many Linux 2.28 Py3.10 < 1 sec
AssertionError: -1 == -1 : Unexpected exception was thrown: 2024-11-02 00:13:29	SEVERE	tsdimaging::SynthesisImagerVi2::defineImage (file /source/casa6/casatools/src/code/synthesis/ImagerObjects/SynthesisImagerVi2.cc, line 595)	Error in building Coordinate System and Image Shape : Internal Error : Image shape is invalid : [1,0,1,40]
test_task_tsdimaging.py:755: in test012
    self.run_exception_case(self.task_param, cpp_err_msg)
test_task_tsdimaging.py:610: in run_exception_case
    self.assertNotEqual(pos, -1,
E   AssertionError: -1 == -1 : Unexpected exception was thrown: 2024-11-02 00:13:29	SEVERE	tsdimaging::SynthesisImagerVi2::defineImage (file /source/casa6/casatools/src/code/synthesis/ImagerObjects/SynthesisImagerVi2.cc, line 595)	Error in building Coordinate System and Image Shape : Internal Error : Image shape is invalid : [1,0,1,40]