Build: #4 failed Child of CASASPECS-DEVBUILDCASALITHGPU8-5

Build result summary

Details

Completed
Queue duration
21 minutes
Duration
384 minutes
Labels
None
Revisions
CASA6
f7f6555bbfcd4333687df9b2857d14809c6d3c01
OPEN-CASA-PKG
e5285e68467f01199807a1f1a978aec8a4781be7
Total tests
4489

Responsible

  • Kumar Golap Kumar Golap Automatically assigned
  • Ville Suoranta Ville Suoranta Automatically assigned

Code commits

CASA6
Author Commit Message Commit date
Kumar Golap Kumar Golap f7f6555bbfcd4333687df9b2857d14809c6d3c01 Change minimum oversampling to 10 instead of 4 ...reduces flux difference to 2% with mosaic on one data set.
Kumar Golap Kumar Golap 3cc029304e9e8206348ac7d078fc4ae013bf5152 Fixed an issue with rounding to zero and scaling
Kumar Golap Kumar Golap 105c72e66de4f89c41773a110837fb81c17ba0b7 fixed a problem with very tiny small fov

Tests

Existing test failures 3
Status Test Failing since View job Duration
TypeError: only length-1 arrays can be converted to Python scalars
test_task_gencal.py:495: in test_gainCurveVLBA
    self.assertTrue(th.compTables(caltab, vlbacal, ['WEIGHT']))
../../../../venv/lib/python3.12/site-packages/casatestutils/testhelper.py:168: in compTables
    if ((mode=="percentage") and not math.isclose(a[i][j], b[i][j], rel_tol=tolerance)) or ((mode=="absolute") and not math.isclose(a[i][j], b[i][j], abs_tol=tolerance)):
E   TypeError: only length-1 arrays can be converted to Python scalars
AssertionError: False is not true
test_task_tclean.py:4354: in test_widefield_awphpg_mtmfs_via_cube
    self.assertTrue(self.check_final(report))
E   AssertionError: False is not true
AssertionError: False is not true
test_task_tclean.py:4111: in test_wterm_awphpg
    self.assertTrue(self.check_final(report))
E   AssertionError: False is not true