Build: #4 failed

Job: Test Tasks Many Linux 2.28 Python 3.12 L4 failed

Job result summary

Completed
Duration
340 minutes
Agent
cvpost134.cv.nrao.edu
Revision
f7f6555bbfcd4333687df9b2857d14809c6d3c01
Total tests
3790

Tests

  • 3,790 tests in total
  • 3 tests failed
  • 249 tests were quarantined / skipped
  • 319 minutes taken in total.
Existing test failures 3
Status Test Failing since Duration
TypeError: only length-1 arrays can be converted to Python scalars
test_task_gencal.py:495: in test_gainCurveVLBA
    self.assertTrue(th.compTables(caltab, vlbacal, ['WEIGHT']))
../../../../venv/lib/python3.12/site-packages/casatestutils/testhelper.py:168: in compTables
    if ((mode=="percentage") and not math.isclose(a[i][j], b[i][j], rel_tol=tolerance)) or ((mode=="absolute") and not math.isclose(a[i][j], b[i][j], abs_tol=tolerance)):
E   TypeError: only length-1 arrays can be converted to Python scalars
AssertionError: False is not true
test_task_tclean.py:4354: in test_widefield_awphpg_mtmfs_via_cube
    self.assertTrue(self.check_final(report))
E   AssertionError: False is not true
AssertionError: False is not true
test_task_tclean.py:4111: in test_wterm_awphpg
    self.assertTrue(self.check_final(report))
E   AssertionError: False is not true

Error summary

The build generated some errors. See the full build log for more details.

/export/cvpost134-nvme/casa/bamboohome/temp/CASASPECS-DEVTESTGPUPY3124-TTM228PY312-4-ScriptBuildTask-6861550398659711619.sh: line 1: cd: /opt/casa/data/master: No such file or directory
/export/cvpost134-nvme/casa/bamboohome/temp/CASASPECS-DEVTESTGPUPY3124-TTM228PY312-4-ScriptBuildTask-6861550398659711619.sh: line 2: cd: /opt/casa/data/casa-data-req: No such file or directory
/export/cvpost134-nvme/casa/bamboohome/temp/CASASPECS-DEVTESTGPUPY3124-TTM228PY312-4-ScriptBuildTask-6861550398659711619.sh: line 3: cd: /opt/casa/data/casatestdata: No such file or directory
Error response from daemon: No such container: wheel-container-test
Error response from daemon: No such container: wheel-container-test
  % Total    % Received % Xferd  Average Speed   Time    Time     Time  Current
                                 Dload  Upload   Total   Spent    Left  Speed

  0     0    0     0    0     0      0      0 --:--:-- --:--:-- --:--:--     0
100 6002k  100 6002k    0     0  69.7M      0 --:--:-- --:--:-- --:--:-- 69.7M
Switched to a new branch 'CAS-14708'
Switched to a new branch 'CAS-14708'
tar: work: Cannot stat: No such file or directory
tar: Exiting with failure status due to previous errors