Build: #1 failed
Job: Test Tools macOS 15 Py3.12 was successful
Build log
The build generated 53,427 lines of output. The output is too long and has been truncated to the last 1,000 lines. Download or view full build log.
| 30-Sep-2026 11:46:53 | 2026-09-30 15:46:53 INFO Display::processAntennaPair Going to process requested baseline (1,2) |
| 30-Sep-2026 11:46:53 | 2026-09-30 15:46:53 INFO Display::processAntennaPair Going to process requested baseline (1,3) |
| 30-Sep-2026 11:46:53 | 2026-09-30 15:46:53 INFO Display::processAntennaPair Going to process requested baseline (2,3) |
| 30-Sep-2026 11:46:53 | 2026-09-30 15:46:53 INFO Manual::chunkSummary => Data flagged so far 32.8125% (136080/414720) |
| 30-Sep-2026 11:46:53 | 2026-09-30 15:46:53 INFO Display::getChunkInfo FlagAgentDisplay::getChunkInfo Field : 1 , 3C286_A Spw : 10 Scan : 31 : 31 |
| 30-Sep-2026 11:46:53 | 2026-09-30 15:46:53 INFO Display::processAntennaPair Going to process requested baseline (0,1) |
| 30-Sep-2026 11:46:53 | 2026-09-30 15:46:53 INFO Display::processAntennaPair Going to process requested baseline (0,2) |
| 30-Sep-2026 11:46:53 | 2026-09-30 15:46:53 INFO Display::processAntennaPair Going to process requested baseline (0,3) |
| 30-Sep-2026 11:46:53 | 2026-09-30 15:46:53 INFO Display::processAntennaPair Going to process requested baseline (1,2) |
| 30-Sep-2026 11:46:53 | 2026-09-30 15:46:53 INFO Display::processAntennaPair Going to process requested baseline (1,3) |
| 30-Sep-2026 11:46:53 | 2026-09-30 15:46:53 INFO Display::processAntennaPair Going to process requested baseline (2,3) |
| 30-Sep-2026 11:46:53 | 2026-09-30 15:46:53 INFO Display::getChunkInfo FlagAgentDisplay::getChunkInfo Field : 1 , 3C286_A Spw : 11 Scan : 31 : 31 |
| 30-Sep-2026 11:46:53 | 2026-09-30 15:46:53 INFO Display::processAntennaPair Going to process requested baseline (0,1) |
| 30-Sep-2026 11:46:53 | 2026-09-30 15:46:53 INFO Display::processAntennaPair Going to process requested baseline (0,2) |
| 30-Sep-2026 11:46:53 | 2026-09-30 15:46:53 INFO Display::processAntennaPair Going to process requested baseline (0,3) |
| 30-Sep-2026 11:46:53 | 2026-09-30 15:46:53 INFO Display::processAntennaPair Going to process requested baseline (1,2) |
| 30-Sep-2026 11:46:53 | 2026-09-30 15:46:53 INFO Display::processAntennaPair Going to process requested baseline (1,3) |
| 30-Sep-2026 11:46:53 | 2026-09-30 15:46:53 INFO Display::processAntennaPair Going to process requested baseline (2,3) |
| 30-Sep-2026 11:46:53 | 2026-09-30 15:46:53 INFO FlagMSHandler:: Chunk = 29 [progress: 90%], Observation = 0, Array = 0, Scan = 31, Field = 1 (3C286_A), Spw = 12, Channels = 64, Corrs = [ RR RL LR LL ], Total Rows = 540 |
| 30-Sep-2026 11:46:53 | 2026-09-30 15:46:53 INFO Display::getChunkInfo FlagAgentDisplay::getChunkInfo Field : 1 , 3C286_A Spw : 12 Scan : 31 : 31 |
| 30-Sep-2026 11:46:53 | 2026-09-30 15:46:53 INFO Display::processAntennaPair Going to process requested baseline (0,1) |
| 30-Sep-2026 11:46:53 | 2026-09-30 15:46:53 INFO Display::processAntennaPair Going to process requested baseline (0,2) |
| 30-Sep-2026 11:46:53 | 2026-09-30 15:46:53 INFO Display::processAntennaPair Going to process requested baseline (0,3) |
| 30-Sep-2026 11:46:53 | 2026-09-30 15:46:53 INFO Display::processAntennaPair Going to process requested baseline (1,2) |
| 30-Sep-2026 11:46:53 | 2026-09-30 15:46:53 INFO Display::processAntennaPair Going to process requested baseline (1,3) |
| 30-Sep-2026 11:46:53 | 2026-09-30 15:46:53 INFO Display::processAntennaPair Going to process requested baseline (2,3) |
| 30-Sep-2026 11:46:53 | 2026-09-30 15:46:53 INFO Manual::chunkSummary => Data flagged so far 32.8125% (136080/414720) |
| 30-Sep-2026 11:46:53 | 2026-09-30 15:46:53 INFO Display::getChunkInfo FlagAgentDisplay::getChunkInfo Field : 1 , 3C286_A Spw : 13 Scan : 31 : 31 |
| 30-Sep-2026 11:46:53 | 2026-09-30 15:46:53 INFO Display::processAntennaPair Going to process requested baseline (0,1) |
| 30-Sep-2026 11:46:53 | 2026-09-30 15:46:53 INFO Display::processAntennaPair Going to process requested baseline (0,2) |
| 30-Sep-2026 11:46:53 | 2026-09-30 15:46:53 INFO Display::processAntennaPair Going to process requested baseline (0,3) |
| 30-Sep-2026 11:46:53 | 2026-09-30 15:46:53 INFO Display::processAntennaPair Going to process requested baseline (1,2) |
| 30-Sep-2026 11:46:53 | 2026-09-30 15:46:53 INFO Display::processAntennaPair Going to process requested baseline (1,3) |
| 30-Sep-2026 11:46:53 | 2026-09-30 15:46:53 INFO Display::processAntennaPair Going to process requested baseline (2,3) |
| 30-Sep-2026 11:46:53 | 2026-09-30 15:46:53 INFO Display::getChunkInfo FlagAgentDisplay::getChunkInfo Field : 1 , 3C286_A Spw : 14 Scan : 31 : 31 |
| 30-Sep-2026 11:46:53 | 2026-09-30 15:46:53 INFO Display::processAntennaPair Going to process requested baseline (0,1) |
| 30-Sep-2026 11:46:53 | 2026-09-30 15:46:53 INFO Display::processAntennaPair Going to process requested baseline (0,2) |
| 30-Sep-2026 11:46:53 | 2026-09-30 15:46:53 INFO Display::processAntennaPair Going to process requested baseline (0,3) |
| 30-Sep-2026 11:46:53 | 2026-09-30 15:46:53 INFO Display::processAntennaPair Going to process requested baseline (1,2) |
| 30-Sep-2026 11:46:53 | 2026-09-30 15:46:53 INFO Display::processAntennaPair Going to process requested baseline (1,3) |
| 30-Sep-2026 11:46:53 | 2026-09-30 15:46:53 INFO Display::processAntennaPair Going to process requested baseline (2,3) |
| 30-Sep-2026 11:46:53 | 2026-09-30 15:46:53 INFO FlagMSHandler:: Chunk = 32 [progress: 100%], Observation = 0, Array = 0, Scan = 31, Field = 1 (3C286_A), Spw = 15, Channels = 64, Corrs = [ RR RL LR LL ], Total Rows = 540 |
| 30-Sep-2026 11:46:53 | 2026-09-30 15:46:53 INFO Display::getChunkInfo FlagAgentDisplay::getChunkInfo Field : 1 , 3C286_A Spw : 15 Scan : 31 : 31 |
| 30-Sep-2026 11:46:53 | 2026-09-30 15:46:53 INFO Display::processAntennaPair Going to process requested baseline (0,1) |
| 30-Sep-2026 11:46:53 | 2026-09-30 15:46:53 INFO Display::processAntennaPair Going to process requested baseline (0,2) |
| 30-Sep-2026 11:46:53 | 2026-09-30 15:46:53 INFO Display::processAntennaPair Going to process requested baseline (0,3) |
| 30-Sep-2026 11:46:53 | 2026-09-30 15:46:53 INFO Display::processAntennaPair Going to process requested baseline (1,2) |
| 30-Sep-2026 11:46:53 | 2026-09-30 15:46:53 INFO Display::processAntennaPair Going to process requested baseline (1,3) |
| 30-Sep-2026 11:46:53 | 2026-09-30 15:46:53 INFO Display::processAntennaPair Going to process requested baseline (2,3) |
| 30-Sep-2026 11:46:53 | 2026-09-30 15:46:53 INFO Manual::chunkSummary => Data flagged so far 32.8125% (136080/414720) |
| 30-Sep-2026 11:46:53 | 2026-09-30 15:46:53 INFO FlagMSHandler::nextChunk ==================================================================================== |
| 30-Sep-2026 11:46:53 | 2026-09-30 15:46:53 INFO Manual::tableSummary => Percentage of data flagged in table selection: 32.8125% |
| 30-Sep-2026 11:46:53 | 2026-09-30 15:46:53 INFO AgentFlagger::run => Writing flags to the MS |
| 30-Sep-2026 11:46:53 | 2026-09-30 15:46:53 INFO Summary::getResult observation 0 flagged: 1.44346e+06 total: 4.3991e+06 (32.8%) |
| 30-Sep-2026 11:46:53 | 2026-09-30 15:46:53 INFO Summary::getResult spw 15 flagged: 90216 total: 274944 (32.8%) |
| 30-Sep-2026 11:46:53 | 2026-09-30 15:46:53 INFO Summary::getResult spw 13 flagged: 90216 total: 274944 (32.8%) |
| 30-Sep-2026 11:46:53 | 2026-09-30 15:46:53 INFO Summary::getResult spw 12 flagged: 90216 total: 274944 (32.8%) |
| 30-Sep-2026 11:46:53 | 2026-09-30 15:46:53 INFO Summary::getResult spw 11 flagged: 90216 total: 274944 (32.8%) |
| 30-Sep-2026 11:46:53 | 2026-09-30 15:46:53 INFO Summary::getResult spw 14 flagged: 90216 total: 274944 (32.8%) |
| 30-Sep-2026 11:46:53 | 2026-09-30 15:46:53 INFO Summary::getResult spw 2 flagged: 90216 total: 274944 (32.8%) |
| 30-Sep-2026 11:46:53 | 2026-09-30 15:46:53 INFO Summary::getResult spw 9 flagged: 90216 total: 274944 (32.8%) |
| 30-Sep-2026 11:46:53 | 2026-09-30 15:46:53 INFO Summary::getResult spw 6 flagged: 90216 total: 274944 (32.8%) |
| 30-Sep-2026 11:46:53 | 2026-09-30 15:46:53 INFO Summary::getResult spw 7 flagged: 90216 total: 274944 (32.8%) |
| 30-Sep-2026 11:46:53 | 2026-09-30 15:46:53 INFO Summary::getResult spw 1 flagged: 90216 total: 274944 (32.8%) |
| 30-Sep-2026 11:46:53 | 2026-09-30 15:46:53 INFO Summary::getResult spw 5 flagged: 90216 total: 274944 (32.8%) |
| 30-Sep-2026 11:46:53 | 2026-09-30 15:46:53 INFO Summary::getResult spw 10 flagged: 90216 total: 274944 (32.8%) |
| 30-Sep-2026 11:46:53 | 2026-09-30 15:46:53 INFO Summary::getResult spw 8 flagged: 90216 total: 274944 (32.8%) |
| 30-Sep-2026 11:46:53 | 2026-09-30 15:46:53 INFO Summary::getResult spw 4 flagged: 90216 total: 274944 (32.8%) |
| 30-Sep-2026 11:46:53 | 2026-09-30 15:46:53 INFO Summary::getResult spw 3 flagged: 90216 total: 274944 (32.8%) |
| 30-Sep-2026 11:46:53 | 2026-09-30 15:46:53 INFO Summary::getResult spw 0 flagged: 90216 total: 274944 (32.8%) |
| 30-Sep-2026 11:46:53 | 2026-09-30 15:46:53 INFO Summary::getResult array 0 flagged: 1.44346e+06 total: 4.3991e+06 (32.8%) |
| 30-Sep-2026 11:46:53 | 2026-09-30 15:46:53 INFO Summary::getResult antenna ea24 flagged: 721728 total: 2.19955e+06 (32.8%) |
| 30-Sep-2026 11:46:53 | 2026-09-30 15:46:53 INFO Summary::getResult antenna ea19 flagged: 721728 total: 2.19955e+06 (32.8%) |
| 30-Sep-2026 11:46:53 | 2026-09-30 15:46:53 INFO Summary::getResult antenna ea11 flagged: 721728 total: 2.19955e+06 (32.8%) |
| 30-Sep-2026 11:46:53 | 2026-09-30 15:46:53 INFO Summary::getResult antenna ea01 flagged: 721728 total: 2.19955e+06 (32.8%) |
| 30-Sep-2026 11:46:53 | 2026-09-30 15:46:53 INFO Summary::getResult field 3C286_A flagged: 1.44346e+06 total: 4.3991e+06 (32.8%) |
| 30-Sep-2026 11:46:53 | 2026-09-30 15:46:53 INFO Summary::getResult scan 31 flagged: 725760 total: 2.21184e+06 (32.8%) |
| 30-Sep-2026 11:46:53 | 2026-09-30 15:46:53 INFO Summary::getResult scan 30 flagged: 717696 total: 2.18726e+06 (32.8%) |
| 30-Sep-2026 11:46:53 | 2026-09-30 15:46:53 INFO Summary::getResult correlation LL flagged: 360864 total: 1.09978e+06 (32.8%) |
| 30-Sep-2026 11:46:53 | 2026-09-30 15:46:53 INFO Summary::getResult correlation RL flagged: 360864 total: 1.09978e+06 (32.8%) |
| 30-Sep-2026 11:46:53 | 2026-09-30 15:46:53 INFO Summary::getResult correlation LR flagged: 360864 total: 1.09978e+06 (32.8%) |
| 30-Sep-2026 11:46:53 | 2026-09-30 15:46:53 INFO Summary::getResult correlation RR flagged: 360864 total: 1.09978e+06 (32.8%) |
| 30-Sep-2026 11:46:53 | 2026-09-30 15:46:53 INFO Summary::getResult Total Flagged: 1.44346e+06 Total Counts: 4.3991e+06 (32.8%) |
| 30-Sep-2026 11:46:53 | 2026-09-30 15:46:53 INFO Display::displayReports Report Displays are turned OFF |
| 30-Sep-2026 11:46:53 | test_tool_agentflagger.py::test_display::test_display_data_single_channel_selection |
| 30-Sep-2026 11:46:53 | AgentFlagger:: Check nominal behaviour for single spw:chan selection |
| 30-Sep-2026 11:46:53 | The MS is already around, just unflag |
| 30-Sep-2026 11:46:53 | PASSED |
| 30-Sep-2026 11:46:53 | |
| 30-Sep-2026 11:46:53 | 2026-09-30 15:46:53 INFO AgentFlagger::open Table type is Measurement Set |
| 30-Sep-2026 11:46:53 | 2026-09-30 15:46:53 INFO AgentFlagger::initAgents There are initially 1 agents in the list. Agents: unflag |
| 30-Sep-2026 11:46:53 | 2026-09-30 15:46:53 INFO AgentFlagger::initAgents There are 1 valid agents in the list. Agents: unflag |
| 30-Sep-2026 11:46:53 | 2026-09-30 15:46:53 INFO FlagMSHandler:: Chunk = 1 [progress: 6%], Observation = 0, Array = 0, Scan = 1, Field = 0 (r aqr), Spw = 0, Channels = 4, Corrs = [ XX ], Total Rows = 1 |
| 30-Sep-2026 11:46:53 | 2026-09-30 15:46:53 INFO FlagMSHandler:: Chunk = 2 [progress: 13%], Observation = 0, Array = 0, Scan = 1, Field = 0 (r aqr), Spw = 1, Channels = 512, Corrs = [ XX YY ], Total Rows = 1 |
| 30-Sep-2026 11:46:53 | 2026-09-30 15:46:53 INFO Unflag::chunkSummary => Data unflagged so far 100% (1028/1028) |
| 30-Sep-2026 11:46:53 | 2026-09-30 15:46:53 INFO FlagMSHandler:: Chunk = 3 [progress: 20%], Observation = 0, Array = 0, Scan = 1, Field = 0 (r aqr), Spw = 2, Channels = 1, Corrs = [ XX YY ], Total Rows = 1 |
| 30-Sep-2026 11:46:53 | 2026-09-30 15:46:53 INFO Unflag::chunkSummary => Data unflagged so far 100% (2/2) |
| 30-Sep-2026 11:46:53 | 2026-09-30 15:46:53 INFO FlagMSHandler:: Chunk = 5 [progress: 33%], Observation = 0, Array = 0, Scan = 1, Field = 0 (r aqr), Spw = 4, Channels = 1, Corrs = [ XX YY ], Total Rows = 1 |
| 30-Sep-2026 11:46:53 | 2026-09-30 15:46:53 INFO Unflag::chunkSummary => Data unflagged so far 100% (1026/1026) |
| 30-Sep-2026 11:46:53 | 2026-09-30 15:46:53 INFO FlagMSHandler:: Chunk = 6 [progress: 40%], Observation = 0, Array = 0, Scan = 2, Field = 0 (r aqr), Spw = 0, Channels = 4, Corrs = [ XX ], Total Rows = 1 |
| 30-Sep-2026 11:46:53 | 2026-09-30 15:46:53 INFO Unflag::chunkSummary => Data unflagged so far 100% (4/4) |
| 30-Sep-2026 11:46:53 | 2026-09-30 15:46:53 INFO FlagMSHandler:: Chunk = 8 [progress: 53%], Observation = 0, Array = 0, Scan = 2, Field = 0 (r aqr), Spw = 6, Channels = 1, Corrs = [ XX YY ], Total Rows = 1 |
| 30-Sep-2026 11:46:53 | 2026-09-30 15:46:53 INFO Unflag::chunkSummary => Data unflagged so far 100% (2050/2050) |
| 30-Sep-2026 11:46:53 | 2026-09-30 15:46:53 INFO FlagMSHandler:: Chunk = 9 [progress: 60%], Observation = 0, Array = 0, Scan = 2, Field = 0 (r aqr), Spw = 7, Channels = 2048, Corrs = [ XX YY ], Total Rows = 1 |
| 30-Sep-2026 11:46:53 | 2026-09-30 15:46:53 INFO Unflag::chunkSummary => Data unflagged so far 100% (4096/4096) |
| 30-Sep-2026 11:46:53 | 2026-09-30 15:46:53 INFO FlagMSHandler:: Chunk = 11 [progress: 73%], Observation = 0, Array = 0, Scan = 3, Field = 0 (r aqr), Spw = 0, Channels = 4, Corrs = [ XX ], Total Rows = 1 |
| 30-Sep-2026 11:46:53 | 2026-09-30 15:46:53 INFO Unflag::chunkSummary => Data unflagged so far 100% (6/6) |
| 30-Sep-2026 11:46:53 | 2026-09-30 15:46:53 INFO FlagMSHandler:: Chunk = 12 [progress: 80%], Observation = 0, Array = 0, Scan = 3, Field = 0 (r aqr), Spw = 5, Channels = 1024, Corrs = [ XX YY ], Total Rows = 1 |
| 30-Sep-2026 11:46:53 | 2026-09-30 15:46:53 INFO Unflag::chunkSummary => Data unflagged so far 100% (2048/2048) |
| 30-Sep-2026 11:46:53 | 2026-09-30 15:46:53 INFO FlagMSHandler:: Chunk = 14 [progress: 93%], Observation = 0, Array = 0, Scan = 3, Field = 0 (r aqr), Spw = 7, Channels = 2048, Corrs = [ XX YY ], Total Rows = 1 |
| 30-Sep-2026 11:46:53 | 2026-09-30 15:46:53 INFO Unflag::chunkSummary => Data unflagged so far 100% (4098/4098) |
| 30-Sep-2026 11:46:53 | 2026-09-30 15:46:53 INFO FlagMSHandler:: Chunk = 15 [progress: 100%], Observation = 0, Array = 0, Scan = 3, Field = 0 (r aqr), Spw = 8, Channels = 1, Corrs = [ XX YY ], Total Rows = 1 |
| 30-Sep-2026 11:46:53 | 2026-09-30 15:46:53 INFO Unflag::chunkSummary => Data unflagged so far 100% (2/2) |
| 30-Sep-2026 11:46:53 | 2026-09-30 15:46:53 INFO FlagMSHandler::nextChunk ==================================================================================== |
| 30-Sep-2026 11:46:53 | 2026-09-30 15:46:53 INFO Unflag::tableSummary => Percentage of data un-flagged in table selection: 100% |
| 30-Sep-2026 11:46:53 | 2026-09-30 15:46:53 INFO AgentFlagger::run => Writing flags to the MS |
| 30-Sep-2026 11:46:53 | 2026-09-30 15:46:53 INFO AgentFlagger::open Table type is Measurement Set |
| 30-Sep-2026 11:46:53 | 2026-09-30 15:46:53 INFO FlagMSHandler::selectData Selected spw-channels ids are Axis Lengths: [4, 4] (NB: Matrix in Row/Column order) |
| 30-Sep-2026 11:46:53 | 2026-09-30 15:46:53 INFO FlagMSHandler::selectData + [1, 0, 511, 1 |
| 30-Sep-2026 11:46:53 | 2026-09-30 15:46:53 INFO FlagMSHandler::selectData + 2, 0, 0, 1 |
| 30-Sep-2026 11:46:53 | 2026-09-30 15:46:53 INFO FlagMSHandler::selectData + 3, 0, 511, 1 |
| 30-Sep-2026 11:46:53 | 2026-09-30 15:46:53 INFO FlagMSHandler::selectData + 4, 0, 0, 1] |
| 30-Sep-2026 11:46:53 | 2026-09-30 15:46:53 INFO AgentFlagger::initAgents There are initially 3 agents in the list. Agents: manual, summary, display |
| 30-Sep-2026 11:46:53 | 2026-09-30 15:46:53 INFO Manual::setAgentParameters autocorr is 0 |
| 30-Sep-2026 11:46:53 | 2026-09-30 15:46:53 INFO Display::setAgentParameters data column is FLOAT_DATA |
| 30-Sep-2026 11:46:53 | 2026-09-30 15:46:53 INFO Display::setAgentParameters Visibility expression is REAL XX,YY |
| 30-Sep-2026 11:46:53 | 2026-09-30 15:46:53 INFO Display::setAgentParameters pause is 0 |
| 30-Sep-2026 11:46:53 | 2026-09-30 15:46:53 INFO Display::setAgentParameters datadisplay is 1 |
| 30-Sep-2026 11:46:53 | 2026-09-30 15:46:53 INFO Display::setAgentParameters reportdisplay is 0 |
| 30-Sep-2026 11:46:53 | 2026-09-30 15:46:53 INFO Display::setAgentParameters format is screen |
| 30-Sep-2026 11:46:53 | 2026-09-30 15:46:53 INFO AgentFlagger::initAgents There are 3 valid agents in the list. Agents: manual, summary, display |
| 30-Sep-2026 11:46:53 | 2026-09-30 15:46:53 INFO FlagDataHandler::preLoadColumn Setting row blocking to number of rows in selected table: 4 |
| 30-Sep-2026 11:46:53 | 2026-09-30 15:46:53 INFO FlagMSHandler:: Chunk = 1 [progress: 25%], Observation = 0, Array = 0, Scan = 1, Field = 0 (r aqr), Spw = 1, Channels = 512, Corrs = [ XX YY ], Total Rows = 1 |
| 30-Sep-2026 11:46:53 | 2026-09-30 15:46:53 INFO Display::getChunkInfo FlagAgentDisplay::getChunkInfo Field : 0 , r aqr Spw : 1 Scan : 1 : 1 |
| 30-Sep-2026 11:46:53 | 2026-09-30 15:46:53 INFO Display::processAntennaPair Going to process requested baseline (0,0) |
| 30-Sep-2026 11:46:53 | /Users/casaci/bamboohome/xml-data/build-dir/CASASPECS-DEVTESTFULLPY312122-TTAM14P/casa6testenv/bin/python: No module named casaplotserver |
| 30-Sep-2026 11:46:53 | 2026-09-30 15:46:53 INFO Manual::chunkSummary => Data flagged so far 100% (1024/1024) |
| 30-Sep-2026 11:46:53 | 2026-09-30 15:46:53 INFO FlagMSHandler:: Chunk = 2 [progress: 50%], Observation = 0, Array = 0, Scan = 1, Field = 0 (r aqr), Spw = 2, Channels = 1, Corrs = [ XX YY ], Total Rows = 1 |
| 30-Sep-2026 11:46:53 | 2026-09-30 15:46:53 INFO Display::getChunkInfo FlagAgentDisplay::getChunkInfo Field : 0 , r aqr Spw : 2 Scan : 1 : 1 |
| 30-Sep-2026 11:46:53 | 2026-09-30 15:46:53 INFO Display::processAntennaPair Going to process requested baseline (0,0) |
| 30-Sep-2026 11:46:53 | 2026-09-30 15:46:53 INFO Manual::chunkSummary => Data flagged so far 100% (2/2) |
| 30-Sep-2026 11:46:53 | 2026-09-30 15:46:53 INFO FlagMSHandler:: Chunk = 3 [progress: 75%], Observation = 0, Array = 0, Scan = 1, Field = 0 (r aqr), Spw = 3, Channels = 512, Corrs = [ XX YY ], Total Rows = 1 |
| 30-Sep-2026 11:46:53 | 2026-09-30 15:46:53 INFO Display::getChunkInfo FlagAgentDisplay::getChunkInfo Field : 0 , r aqr Spw : 3 Scan : 1 : 1 |
| 30-Sep-2026 11:46:53 | 2026-09-30 15:46:53 INFO Display::processAntennaPair Going to process requested baseline (0,0) |
| 30-Sep-2026 11:46:53 | 2026-09-30 15:46:53 INFO Manual::chunkSummary => Data flagged so far 100% (1024/1024) |
| 30-Sep-2026 11:46:53 | 2026-09-30 15:46:53 INFO FlagMSHandler:: Chunk = 4 [progress: 100%], Observation = 0, Array = 0, Scan = 1, Field = 0 (r aqr), Spw = 4, Channels = 1, Corrs = [ XX YY ], Total Rows = 1 |
| 30-Sep-2026 11:46:53 | 2026-09-30 15:46:53 INFO Display::getChunkInfo FlagAgentDisplay::getChunkInfo Field : 0 , r aqr Spw : 4 Scan : 1 : 1 |
| 30-Sep-2026 11:46:53 | 2026-09-30 15:46:53 INFO Display::processAntennaPair Going to process requested baseline (0,0) |
| 30-Sep-2026 11:46:53 | 2026-09-30 15:46:53 INFO Manual::chunkSummary => Data flagged so far 100% (2/2) |
| 30-Sep-2026 11:46:53 | 2026-09-30 15:46:53 INFO FlagMSHandler::nextChunk ==================================================================================== |
| 30-Sep-2026 11:46:53 | 2026-09-30 15:46:53 INFO Manual::tableSummary => Percentage of data flagged in table selection: 100% |
| 30-Sep-2026 11:46:53 | 2026-09-30 15:46:53 INFO AgentFlagger::run => Writing flags to the MS |
| 30-Sep-2026 11:46:53 | 2026-09-30 15:46:53 INFO Summary::getResult observation 0 flagged: 2052 total: 2052 (100%) |
| 30-Sep-2026 11:46:53 | 2026-09-30 15:46:53 INFO Summary::getResult spw 4 flagged: 2 total: 2 (100%) |
| 30-Sep-2026 11:46:53 | 2026-09-30 15:46:53 INFO Summary::getResult spw 3 flagged: 1024 total: 1024 (100%) |
| 30-Sep-2026 11:46:53 | 2026-09-30 15:46:53 INFO Summary::getResult spw 2 flagged: 2 total: 2 (100%) |
| 30-Sep-2026 11:46:53 | 2026-09-30 15:46:53 INFO Summary::getResult spw 1 flagged: 1024 total: 1024 (100%) |
| 30-Sep-2026 11:46:53 | 2026-09-30 15:46:53 INFO Summary::getResult array 0 flagged: 2052 total: 2052 (100%) |
| 30-Sep-2026 11:46:53 | 2026-09-30 15:46:53 INFO Summary::getResult antenna PM04 flagged: 2052 total: 2052 (100%) |
| 30-Sep-2026 11:46:53 | 2026-09-30 15:46:53 INFO Summary::getResult field r aqr flagged: 2052 total: 2052 (100%) |
| 30-Sep-2026 11:46:53 | 2026-09-30 15:46:53 INFO Summary::getResult scan 1 flagged: 2052 total: 2052 (100%) |
| 30-Sep-2026 11:46:53 | 2026-09-30 15:46:53 INFO Summary::getResult correlation YY flagged: 1026 total: 1026 (100%) |
| 30-Sep-2026 11:46:53 | 2026-09-30 15:46:53 INFO Summary::getResult correlation XX flagged: 1026 total: 1026 (100%) |
| 30-Sep-2026 11:46:53 | 2026-09-30 15:46:53 INFO Summary::getResult Total Flagged: 2052 Total Counts: 2052 (100%) |
| 30-Sep-2026 11:46:53 | 2026-09-30 15:46:53 INFO Display::displayReports Report Displays are turned OFF |
| 30-Sep-2026 11:46:53 | test_tool_agentflagger.py::test_display::test_display_float_data |
| 30-Sep-2026 11:46:53 | AgentFlagger: Select spw, display and flag single-dish MS |
| 30-Sep-2026 11:46:53 | Moving data... |
| 30-Sep-2026 11:46:53 | PASSED |
| 30-Sep-2026 11:46:53 | |
| 30-Sep-2026 11:46:53 | - generated xml file: /Users/casaci/bamboohome/xml-data/build-dir/CASASPECS-DEVTESTFULLPY312122-TTAM14P/casa6/casatestutils/nosedir/xml/test_tool_agentflagger/nose.xml - |
| 30-Sep-2026 11:46:53 | ======================== 35 passed, 1 warning in 8.22s ========================= |
| 30-Sep-2026 11:46:53 | ============================= test session starts ============================== |
| 30-Sep-2026 11:46:53 | platform darwin -- Python 3.12.8, pytest-9.1.1, pluggy-1.6.0 -- /Users/casaci/bamboohome/xml-data/build-dir/CASASPECS-DEVTESTFULLPY312122-TTAM14P/casa6testenv/bin/python |
| 30-Sep-2026 11:46:53 | cachedir: .pytest_cache |
| 30-Sep-2026 11:46:53 | rootdir: /Users/casaci/bamboohome/xml-data/build-dir/CASASPECS-DEVTESTFULLPY312122-TTAM14P/casa6/casatestutils/nosedir/test_tool_image_subimage |
| 30-Sep-2026 11:46:53 | configfile: pytest.ini |
| 30-Sep-2026 11:46:55 | collecting ... collected 5 items |
| 30-Sep-2026 11:46:55 | |
| 30-Sep-2026 11:46:55 | |
| 30-Sep-2026 11:46:55 | 2026-09-30 15:46:56 INFO ImageFactory::createImage Created Temp image of shape [10, 10, 10, 4] with float valued pixels. |
| 30-Sep-2026 11:46:55 | 2026-09-30 15:46:56 INFO image::_casaQuantityFromVar Will use values specified in major, minor, pa to set beam |
| 30-Sep-2026 11:46:55 | 2026-09-30 15:46:56 INFO BeamManipulator::set This image currently has no beams of any kind. Since channel and/or polarization were specified, a set of per plane beams, each equal to the specified beam, will be created. |
| 30-Sep-2026 11:46:55 | 2026-09-30 15:46:56 INFO BeamManipulator::set Beam parameters: Major : 4 arcsec |
| 30-Sep-2026 11:46:55 | 2026-09-30 15:46:56 INFO BeamManipulator::set+ Minor : 2 arcsec |
| 30-Sep-2026 11:46:55 | 2026-09-30 15:46:56 INFO BeamManipulator::set+ Position Angle : 5 deg |
| 30-Sep-2026 11:46:55 | 2026-09-30 15:46:56 INFO image::_casaQuantityFromVar Will use values specified in major, minor, pa to set beam |
| 30-Sep-2026 11:46:55 | 2026-09-30 15:46:56 INFO BeamManipulator::set Beam parameters: Major : 2 arcsec |
| 30-Sep-2026 11:46:55 | 2026-09-30 15:46:56 INFO BeamManipulator::set+ Minor : 1 arcsec |
| 30-Sep-2026 11:46:55 | 2026-09-30 15:46:56 INFO BeamManipulator::set+ Position Angle : 5 deg |
| 30-Sep-2026 11:46:55 | 2026-09-30 15:46:56 INFO image::_casaQuantityFromVar Will use values specified in major, minor, pa to set beam |
| 30-Sep-2026 11:46:55 | 2026-09-30 15:46:56 INFO BeamManipulator::set Beam parameters: Major : 3 arcsec |
| 30-Sep-2026 11:46:55 | 2026-09-30 15:46:56 INFO BeamManipulator::set+ Minor : 2 arcsec |
| 30-Sep-2026 11:46:55 | 2026-09-30 15:46:56 INFO BeamManipulator::set+ Position Angle : 5 deg |
| 30-Sep-2026 11:46:55 | 2026-09-30 15:46:56 INFO image::_casaQuantityFromVar Will use values specified in major, minor, pa to set beam |
| 30-Sep-2026 11:46:55 | 2026-09-30 15:46:56 INFO BeamManipulator::set Beam parameters: Major : 4 arcsec |
| 30-Sep-2026 11:46:55 | 2026-09-30 15:46:56 INFO BeamManipulator::set+ Minor : 3 arcsec |
| 30-Sep-2026 11:46:55 | 2026-09-30 15:46:56 INFO BeamManipulator::set+ Position Angle : 5 deg |
| 30-Sep-2026 11:46:55 | 2026-09-30 15:46:56 INFO image::_casaQuantityFromVar Will use values specified in major, minor, pa to set beam |
| 30-Sep-2026 11:46:55 | 2026-09-30 15:46:56 INFO BeamManipulator::set Beam parameters: Major : 5 arcsec |
| 30-Sep-2026 11:46:55 | 2026-09-30 15:46:56 INFO BeamManipulator::set+ Minor : 4 arcsec |
| 30-Sep-2026 11:46:55 | 2026-09-30 15:46:56 INFO BeamManipulator::set+ Position Angle : 5 deg |
| 30-Sep-2026 11:46:55 | 2026-09-30 15:46:56 INFO image::_casaQuantityFromVar Will use values specified in major, minor, pa to set beam |
| 30-Sep-2026 11:46:55 | 2026-09-30 15:46:56 INFO BeamManipulator::set Beam parameters: Major : 3 arcsec |
| 30-Sep-2026 11:46:55 | 2026-09-30 15:46:56 INFO BeamManipulator::set+ Minor : 2 arcsec |
| 30-Sep-2026 11:46:55 | 2026-09-30 15:46:56 INFO BeamManipulator::set+ Position Angle : 5 deg |
| 30-Sep-2026 11:46:55 | 2026-09-30 15:46:56 INFO image::_casaQuantityFromVar Will use values specified in major, minor, pa to set beam |
| 30-Sep-2026 11:46:55 | 2026-09-30 15:46:56 INFO BeamManipulator::set Beam parameters: Major : 4 arcsec |
| 30-Sep-2026 11:46:55 | 2026-09-30 15:46:56 INFO BeamManipulator::set+ Minor : 3 arcsec |
| 30-Sep-2026 11:46:55 | 2026-09-30 15:46:56 INFO BeamManipulator::set+ Position Angle : 5 deg |
| 30-Sep-2026 11:46:55 | 2026-09-30 15:46:56 INFO image::_casaQuantityFromVar Will use values specified in major, minor, pa to set beam |
| 30-Sep-2026 11:46:55 | 2026-09-30 15:46:56 INFO BeamManipulator::set Beam parameters: Major : 5 arcsec |
| 30-Sep-2026 11:46:55 | 2026-09-30 15:46:56 INFO BeamManipulator::set+ Minor : 4 arcsec |
| 30-Sep-2026 11:46:55 | 2026-09-30 15:46:56 INFO BeamManipulator::set+ Position Angle : 5 deg |
| 30-Sep-2026 11:46:55 | 2026-09-30 15:46:56 INFO image::_casaQuantityFromVar Will use values specified in major, minor, pa to set beam |
| 30-Sep-2026 11:46:55 | 2026-09-30 15:46:56 INFO BeamManipulator::set Beam parameters: Major : 6 arcsec |
| 30-Sep-2026 11:46:55 | 2026-09-30 15:46:56 INFO BeamManipulator::set+ Minor : 5 arcsec |
| 30-Sep-2026 11:46:55 | 2026-09-30 15:46:56 INFO BeamManipulator::set+ Position Angle : 5 deg |
| 30-Sep-2026 11:46:55 | 2026-09-30 15:46:56 INFO image::_casaQuantityFromVar Will use values specified in major, minor, pa to set beam |
| 30-Sep-2026 11:46:55 | 2026-09-30 15:46:56 INFO BeamManipulator::set Beam parameters: Major : 4 arcsec |
| 30-Sep-2026 11:46:55 | 2026-09-30 15:46:56 INFO BeamManipulator::set+ Minor : 3 arcsec |
| 30-Sep-2026 11:46:55 | 2026-09-30 15:46:56 INFO BeamManipulator::set+ Position Angle : 5 deg |
| 30-Sep-2026 11:46:55 | 2026-09-30 15:46:56 INFO image::_casaQuantityFromVar Will use values specified in major, minor, pa to set beam |
| 30-Sep-2026 11:46:55 | 2026-09-30 15:46:56 INFO BeamManipulator::set Beam parameters: Major : 5 arcsec |
| 30-Sep-2026 11:46:55 | 2026-09-30 15:46:56 INFO BeamManipulator::set+ Minor : 4 arcsec |
| 30-Sep-2026 11:46:55 | 2026-09-30 15:46:56 INFO BeamManipulator::set+ Position Angle : 5 deg |
| 30-Sep-2026 11:46:55 | 2026-09-30 15:46:56 INFO image::_casaQuantityFromVar Will use values specified in major, minor, pa to set beam |
| 30-Sep-2026 11:46:55 | 2026-09-30 15:46:56 INFO BeamManipulator::set Beam parameters: Major : 6 arcsec |
| 30-Sep-2026 11:46:55 | 2026-09-30 15:46:56 INFO BeamManipulator::set+ Minor : 5 arcsec |
| 30-Sep-2026 11:46:55 | 2026-09-30 15:46:56 INFO BeamManipulator::set+ Position Angle : 5 deg |
| 30-Sep-2026 11:46:55 | 2026-09-30 15:46:56 INFO image::_casaQuantityFromVar Will use values specified in major, minor, pa to set beam |
| 30-Sep-2026 11:46:55 | 2026-09-30 15:46:56 INFO BeamManipulator::set Beam parameters: Major : 7 arcsec |
| 30-Sep-2026 11:46:55 | 2026-09-30 15:46:56 INFO BeamManipulator::set+ Minor : 6 arcsec |
| 30-Sep-2026 11:46:55 | 2026-09-30 15:46:56 INFO BeamManipulator::set+ Position Angle : 5 deg |
| 30-Sep-2026 11:46:55 | 2026-09-30 15:46:56 INFO image::_casaQuantityFromVar Will use values specified in major, minor, pa to set beam |
| 30-Sep-2026 11:46:55 | 2026-09-30 15:46:56 INFO BeamManipulator::set Beam parameters: Major : 5 arcsec |
| 30-Sep-2026 11:46:55 | 2026-09-30 15:46:56 INFO BeamManipulator::set+ Minor : 4 arcsec |
| 30-Sep-2026 11:46:55 | 2026-09-30 15:46:56 INFO BeamManipulator::set+ Position Angle : 5 deg |
| 30-Sep-2026 11:46:55 | 2026-09-30 15:46:56 INFO image::_casaQuantityFromVar Will use values specified in major, minor, pa to set beam |
| 30-Sep-2026 11:46:55 | 2026-09-30 15:46:56 INFO BeamManipulator::set Beam parameters: Major : 6 arcsec |
| 30-Sep-2026 11:46:55 | 2026-09-30 15:46:56 INFO BeamManipulator::set+ Minor : 5 arcsec |
| 30-Sep-2026 11:46:55 | 2026-09-30 15:46:56 INFO BeamManipulator::set+ Position Angle : 5 deg |
| 30-Sep-2026 11:46:55 | 2026-09-30 15:46:56 INFO image::_casaQuantityFromVar Will use values specified in major, minor, pa to set beam |
| 30-Sep-2026 11:46:55 | 2026-09-30 15:46:56 INFO BeamManipulator::set Beam parameters: Major : 7 arcsec |
| 30-Sep-2026 11:46:55 | 2026-09-30 15:46:56 INFO BeamManipulator::set+ Minor : 6 arcsec |
| 30-Sep-2026 11:46:55 | 2026-09-30 15:46:56 INFO BeamManipulator::set+ Position Angle : 5 deg |
| 30-Sep-2026 11:46:55 | 2026-09-30 15:46:56 INFO image::_casaQuantityFromVar Will use values specified in major, minor, pa to set beam |
| 30-Sep-2026 11:46:55 | 2026-09-30 15:46:56 INFO BeamManipulator::set Beam parameters: Major : 8 arcsec |
| 30-Sep-2026 11:46:55 | 2026-09-30 15:46:56 INFO BeamManipulator::set+ Minor : 7 arcsec |
| 30-Sep-2026 11:46:55 | 2026-09-30 15:46:56 INFO BeamManipulator::set+ Position Angle : 5 deg |
| 30-Sep-2026 11:46:55 | 2026-09-30 15:46:56 INFO image::_casaQuantityFromVar Will use values specified in major, minor, pa to set beam |
| 30-Sep-2026 11:46:55 | 2026-09-30 15:46:56 INFO BeamManipulator::set Beam parameters: Major : 6 arcsec |
| 30-Sep-2026 11:46:55 | 2026-09-30 15:46:56 INFO BeamManipulator::set+ Minor : 5 arcsec |
| 30-Sep-2026 11:46:55 | 2026-09-30 15:46:56 INFO BeamManipulator::set+ Position Angle : 5 deg |
| 30-Sep-2026 11:46:55 | 2026-09-30 15:46:56 INFO image::_casaQuantityFromVar Will use values specified in major, minor, pa to set beam |
| 30-Sep-2026 11:46:55 | 2026-09-30 15:46:56 INFO BeamManipulator::set Beam parameters: Major : 7 arcsec |
| 30-Sep-2026 11:46:55 | 2026-09-30 15:46:56 INFO BeamManipulator::set+ Minor : 6 arcsec |
| 30-Sep-2026 11:46:55 | 2026-09-30 15:46:56 INFO BeamManipulator::set+ Position Angle : 5 deg |
| 30-Sep-2026 11:46:55 | 2026-09-30 15:46:56 INFO image::_casaQuantityFromVar Will use values specified in major, minor, pa to set beam |
| 30-Sep-2026 11:46:55 | 2026-09-30 15:46:56 INFO BeamManipulator::set Beam parameters: Major : 8 arcsec |
| 30-Sep-2026 11:46:55 | 2026-09-30 15:46:56 INFO BeamManipulator::set+ Minor : 7 arcsec |
| 30-Sep-2026 11:46:55 | 2026-09-30 15:46:56 INFO BeamManipulator::set+ Position Angle : 5 deg |
| 30-Sep-2026 11:46:55 | 2026-09-30 15:46:56 INFO image::_casaQuantityFromVar Will use values specified in major, minor, pa to set beam |
| 30-Sep-2026 11:46:55 | 2026-09-30 15:46:56 INFO BeamManipulator::set Beam parameters: Major : 9 arcsec |
| 30-Sep-2026 11:46:55 | 2026-09-30 15:46:56 INFO BeamManipulator::set+ Minor : 8 arcsec |
| 30-Sep-2026 11:46:55 | 2026-09-30 15:46:56 INFO BeamManipulator::set+ Position Angle : 5 deg |
| 30-Sep-2026 11:46:55 | 2026-09-30 15:46:56 INFO image::_casaQuantityFromVar Will use values specified in major, minor, pa to set beam |
| 30-Sep-2026 11:46:55 | 2026-09-30 15:46:56 INFO BeamManipulator::set Beam parameters: Major : 7 arcsec |
| 30-Sep-2026 11:46:55 | 2026-09-30 15:46:56 INFO BeamManipulator::set+ Minor : 6 arcsec |
| 30-Sep-2026 11:46:55 | 2026-09-30 15:46:56 INFO BeamManipulator::set+ Position Angle : 5 deg |
| 30-Sep-2026 11:46:55 | 2026-09-30 15:46:56 INFO image::_casaQuantityFromVar Will use values specified in major, minor, pa to set beam |
| 30-Sep-2026 11:46:55 | 2026-09-30 15:46:56 INFO BeamManipulator::set Beam parameters: Major : 8 arcsec |
| 30-Sep-2026 11:46:55 | 2026-09-30 15:46:56 INFO BeamManipulator::set+ Minor : 7 arcsec |
| 30-Sep-2026 11:46:55 | 2026-09-30 15:46:56 INFO BeamManipulator::set+ Position Angle : 5 deg |
| 30-Sep-2026 11:46:55 | 2026-09-30 15:46:56 INFO image::_casaQuantityFromVar Will use values specified in major, minor, pa to set beam |
| 30-Sep-2026 11:46:55 | 2026-09-30 15:46:56 INFO BeamManipulator::set Beam parameters: Major : 9 arcsec |
| 30-Sep-2026 11:46:55 | 2026-09-30 15:46:56 INFO BeamManipulator::set+ Minor : 8 arcsec |
| 30-Sep-2026 11:46:55 | 2026-09-30 15:46:56 INFO BeamManipulator::set+ Position Angle : 5 deg |
| 30-Sep-2026 11:46:55 | 2026-09-30 15:46:56 INFO image::_casaQuantityFromVar Will use values specified in major, minor, pa to set beam |
| 30-Sep-2026 11:46:55 | 2026-09-30 15:46:56 INFO BeamManipulator::set Beam parameters: Major : 10 arcsec |
| 30-Sep-2026 11:46:55 | 2026-09-30 15:46:56 INFO BeamManipulator::set+ Minor : 9 arcsec |
| 30-Sep-2026 11:46:55 | 2026-09-30 15:46:56 INFO BeamManipulator::set+ Position Angle : 5 deg |
| 30-Sep-2026 11:46:55 | 2026-09-30 15:46:56 INFO image::_casaQuantityFromVar Will use values specified in major, minor, pa to set beam |
| 30-Sep-2026 11:46:55 | 2026-09-30 15:46:56 INFO BeamManipulator::set Beam parameters: Major : 8 arcsec |
| 30-Sep-2026 11:46:55 | 2026-09-30 15:46:56 INFO BeamManipulator::set+ Minor : 7 arcsec |
| 30-Sep-2026 11:46:55 | 2026-09-30 15:46:56 INFO BeamManipulator::set+ Position Angle : 5 deg |
| 30-Sep-2026 11:46:55 | 2026-09-30 15:46:56 INFO image::_casaQuantityFromVar Will use values specified in major, minor, pa to set beam |
| 30-Sep-2026 11:46:55 | 2026-09-30 15:46:56 INFO BeamManipulator::set Beam parameters: Major : 9 arcsec |
| 30-Sep-2026 11:46:55 | 2026-09-30 15:46:56 INFO BeamManipulator::set+ Minor : 8 arcsec |
| 30-Sep-2026 11:46:55 | 2026-09-30 15:46:56 INFO BeamManipulator::set+ Position Angle : 5 deg |
| 30-Sep-2026 11:46:55 | 2026-09-30 15:46:56 INFO image::_casaQuantityFromVar Will use values specified in major, minor, pa to set beam |
| 30-Sep-2026 11:46:55 | 2026-09-30 15:46:56 INFO BeamManipulator::set Beam parameters: Major : 10 arcsec |
| 30-Sep-2026 11:46:55 | 2026-09-30 15:46:56 INFO BeamManipulator::set+ Minor : 9 arcsec |
| 30-Sep-2026 11:46:55 | 2026-09-30 15:46:56 INFO BeamManipulator::set+ Position Angle : 5 deg |
| 30-Sep-2026 11:46:55 | 2026-09-30 15:46:56 INFO image::_casaQuantityFromVar Will use values specified in major, minor, pa to set beam |
| 30-Sep-2026 11:46:55 | 2026-09-30 15:46:56 INFO BeamManipulator::set Beam parameters: Major : 11 arcsec |
| 30-Sep-2026 11:46:55 | 2026-09-30 15:46:56 INFO BeamManipulator::set+ Minor : 10 arcsec |
| 30-Sep-2026 11:46:55 | 2026-09-30 15:46:56 INFO BeamManipulator::set+ Position Angle : 5 deg |
| 30-Sep-2026 11:46:55 | 2026-09-30 15:46:56 INFO image::_casaQuantityFromVar Will use values specified in major, minor, pa to set beam |
| 30-Sep-2026 11:46:55 | 2026-09-30 15:46:56 INFO BeamManipulator::set Beam parameters: Major : 9 arcsec |
| 30-Sep-2026 11:46:55 | 2026-09-30 15:46:56 INFO BeamManipulator::set+ Minor : 8 arcsec |
| 30-Sep-2026 11:46:55 | 2026-09-30 15:46:56 INFO BeamManipulator::set+ Position Angle : 5 deg |
| 30-Sep-2026 11:46:55 | 2026-09-30 15:46:56 INFO image::_casaQuantityFromVar Will use values specified in major, minor, pa to set beam |
| 30-Sep-2026 11:46:55 | 2026-09-30 15:46:56 INFO BeamManipulator::set Beam parameters: Major : 10 arcsec |
| 30-Sep-2026 11:46:55 | 2026-09-30 15:46:56 INFO BeamManipulator::set+ Minor : 9 arcsec |
| 30-Sep-2026 11:46:55 | 2026-09-30 15:46:56 INFO BeamManipulator::set+ Position Angle : 5 deg |
| 30-Sep-2026 11:46:55 | 2026-09-30 15:46:56 INFO image::_casaQuantityFromVar Will use values specified in major, minor, pa to set beam |
| 30-Sep-2026 11:46:55 | 2026-09-30 15:46:56 INFO BeamManipulator::set Beam parameters: Major : 11 arcsec |
| 30-Sep-2026 11:46:55 | 2026-09-30 15:46:56 INFO BeamManipulator::set+ Minor : 10 arcsec |
| 30-Sep-2026 11:46:55 | 2026-09-30 15:46:56 INFO BeamManipulator::set+ Position Angle : 5 deg |
| 30-Sep-2026 11:46:55 | 2026-09-30 15:46:56 INFO image::_casaQuantityFromVar Will use values specified in major, minor, pa to set beam |
| 30-Sep-2026 11:46:55 | 2026-09-30 15:46:56 INFO BeamManipulator::set Beam parameters: Major : 12 arcsec |
| 30-Sep-2026 11:46:55 | 2026-09-30 15:46:56 INFO BeamManipulator::set+ Minor : 11 arcsec |
| 30-Sep-2026 11:46:55 | 2026-09-30 15:46:56 INFO BeamManipulator::set+ Position Angle : 5 deg |
| 30-Sep-2026 11:46:55 | 2026-09-30 15:46:56 INFO image::_casaQuantityFromVar Will use values specified in major, minor, pa to set beam |
| 30-Sep-2026 11:46:55 | 2026-09-30 15:46:56 INFO BeamManipulator::set Beam parameters: Major : 10 arcsec |
| 30-Sep-2026 11:46:55 | 2026-09-30 15:46:56 INFO BeamManipulator::set+ Minor : 9 arcsec |
| 30-Sep-2026 11:46:55 | 2026-09-30 15:46:56 INFO BeamManipulator::set+ Position Angle : 5 deg |
| 30-Sep-2026 11:46:55 | 2026-09-30 15:46:56 INFO image::_casaQuantityFromVar Will use values specified in major, minor, pa to set beam |
| 30-Sep-2026 11:46:55 | 2026-09-30 15:46:56 INFO BeamManipulator::set Beam parameters: Major : 11 arcsec |
| 30-Sep-2026 11:46:55 | 2026-09-30 15:46:56 INFO BeamManipulator::set+ Minor : 10 arcsec |
| 30-Sep-2026 11:46:55 | 2026-09-30 15:46:56 INFO BeamManipulator::set+ Position Angle : 5 deg |
| 30-Sep-2026 11:46:55 | 2026-09-30 15:46:56 INFO image::_casaQuantityFromVar Will use values specified in major, minor, pa to set beam |
| 30-Sep-2026 11:46:55 | 2026-09-30 15:46:56 INFO BeamManipulator::set Beam parameters: Major : 12 arcsec |
| 30-Sep-2026 11:46:55 | 2026-09-30 15:46:56 INFO BeamManipulator::set+ Minor : 11 arcsec |
| 30-Sep-2026 11:46:55 | 2026-09-30 15:46:56 INFO BeamManipulator::set+ Position Angle : 5 deg |
| 30-Sep-2026 11:46:55 | 2026-09-30 15:46:56 INFO image::_casaQuantityFromVar Will use values specified in major, minor, pa to set beam |
| 30-Sep-2026 11:46:55 | 2026-09-30 15:46:56 INFO BeamManipulator::set Beam parameters: Major : 13 arcsec |
| 30-Sep-2026 11:46:55 | 2026-09-30 15:46:56 INFO BeamManipulator::set+ Minor : 12 arcsec |
| 30-Sep-2026 11:46:55 | 2026-09-30 15:46:56 INFO BeamManipulator::set+ Position Angle : 5 deg |
| 30-Sep-2026 11:46:55 | 2026-09-30 15:46:56 INFO image::_casaQuantityFromVar Will use values specified in major, minor, pa to set beam |
| 30-Sep-2026 11:46:55 | 2026-09-30 15:46:56 INFO BeamManipulator::set Beam parameters: Major : 11 arcsec |
| 30-Sep-2026 11:46:55 | 2026-09-30 15:46:56 INFO BeamManipulator::set+ Minor : 10 arcsec |
| 30-Sep-2026 11:46:55 | 2026-09-30 15:46:56 INFO BeamManipulator::set+ Position Angle : 5 deg |
| 30-Sep-2026 11:46:55 | 2026-09-30 15:46:56 INFO image::_casaQuantityFromVar Will use values specified in major, minor, pa to set beam |
| 30-Sep-2026 11:46:55 | 2026-09-30 15:46:56 INFO BeamManipulator::set Beam parameters: Major : 12 arcsec |
| 30-Sep-2026 11:46:55 | 2026-09-30 15:46:56 INFO BeamManipulator::set+ Minor : 11 arcsec |
| 30-Sep-2026 11:46:55 | 2026-09-30 15:46:56 INFO BeamManipulator::set+ Position Angle : 5 deg |
| 30-Sep-2026 11:46:55 | 2026-09-30 15:46:56 INFO image::_casaQuantityFromVar Will use values specified in major, minor, pa to set beam |
| 30-Sep-2026 11:46:55 | 2026-09-30 15:46:56 INFO BeamManipulator::set Beam parameters: Major : 13 arcsec |
| 30-Sep-2026 11:46:55 | 2026-09-30 15:46:56 INFO BeamManipulator::set+ Minor : 12 arcsec |
| 30-Sep-2026 11:46:55 | 2026-09-30 15:46:56 INFO BeamManipulator::set+ Position Angle : 5 deg |
| 30-Sep-2026 11:46:55 | 2026-09-30 15:46:56 INFO image::_casaQuantityFromVar Will use values specified in major, minor, pa to set beam |
| 30-Sep-2026 11:46:55 | 2026-09-30 15:46:56 INFO BeamManipulator::set Beam parameters: Major : 14 arcsec |
| 30-Sep-2026 11:46:55 | 2026-09-30 15:46:56 INFO BeamManipulator::set+ Minor : 13 arcsec |
| 30-Sep-2026 11:46:55 | 2026-09-30 15:46:56 INFO BeamManipulator::set+ Position Angle : 5 deg |
| 30-Sep-2026 11:46:55 | 2026-09-30 15:46:56 INFO ImageRegion::fromRecord Selected bounding box : |
| 30-Sep-2026 11:46:55 | 2026-09-30 15:46:56 INFO ImageRegion::fromRecord+ [2, 2, 2, 2] to [5, 5, 5, 3] (00:00:12.000, -00.03.00.000, 1.415e+09Hz, U to 00:00:00.000, +00.00.00.000, 1.415e+09Hz, V) |
| 30-Sep-2026 11:46:55 | 2026-09-30 15:46:56 INFO ImageRegion::fromRecord Selected bounding box : |
| 30-Sep-2026 11:46:55 | 2026-09-30 15:46:56 INFO ImageRegion::fromRecord+ [2, 2, 2, 2] to [5, 5, 5, 2] (00:00:12.000, -00.03.00.000, 1.415e+09Hz, U to 00:00:00.000, +00.00.00.000, 1.415e+09Hz, U) |
| 30-Sep-2026 11:46:55 | 2026-09-30 15:46:56 INFO ImageRegion::fromRecord Selected bounding box : |
| 30-Sep-2026 11:46:55 | 2026-09-30 15:46:56 INFO ImageRegion::fromRecord+ [2, 2, 6, 1] to [5, 5, 6, 3] (00:00:12.000, -00.03.00.000, 1.415e+09Hz, Q to 00:00:00.000, +00.00.00.000, 1.415e+09Hz, V) |
| 30-Sep-2026 11:46:55 | 2026-09-30 15:46:56 INFO name:: No table opened. |
| 30-Sep-2026 11:46:55 | 2026-09-30 15:46:56 INFO showcache:: The Table Cache is empty. |
| 30-Sep-2026 11:46:55 | test_tool_image_subimage.py::ia_subimage_test::test_beams |
| 30-Sep-2026 11:46:55 | Test per plane beams |
| 30-Sep-2026 11:46:55 | PASSED |
| 30-Sep-2026 11:46:55 | |
| 30-Sep-2026 11:46:55 | 2026-09-30 15:46:56 INFO ImageFactory::createImage Created Paged image 'zz.im' of shape [20, 20] with float valued pixels. |
| 30-Sep-2026 11:46:55 | 2026-09-30 15:46:56 INFO ::::ImageFactory::createImage Created Paged image 'zz.im' of shape [20, 20] with float valued pixels. |
| 30-Sep-2026 11:46:55 | 2026-09-30 15:46:56 INFO ::::image::fromshape Ran ia.fromshape |
| 30-Sep-2026 11:46:55 | 2026-09-30 15:46:56 INFO ::::image::fromshape ia.fromshape(outfile="zz.im", shape=[20,20], csys={...}, linear=false, overwrite=false, log=true, type="f") |
| 30-Sep-2026 11:46:55 | 2026-09-30 15:46:56 INFO ::::image::subimage Ran ia.subimage |
| 30-Sep-2026 11:46:55 | 2026-09-30 15:46:56 INFO ::::image::subimage ia.subimage(outfile="", region="", mask="", dropdeg=false, overwrite=false, list=true, stretch=false, wantreturn=true, keepaxes=[]) |
| 30-Sep-2026 11:46:55 | 2026-09-30 15:46:56 INFO ImageFactory::createImage Created Paged image 'gg' of shape [20, 20] with float valued pixels. |
| 30-Sep-2026 11:46:55 | 2026-09-30 15:46:56 INFO ::::ImageFactory::createImage Created Paged image 'gg' of shape [20, 20] with float valued pixels. |
| 30-Sep-2026 11:46:55 | 2026-09-30 15:46:56 INFO name:: No table opened. |
| 30-Sep-2026 11:46:55 | 2026-09-30 15:46:56 INFO showcache:: The Table Cache is empty. |
| 30-Sep-2026 11:46:55 | test_tool_image_subimage.py::ia_subimage_test::test_history |
| 30-Sep-2026 11:46:55 | verify history writing |
| 30-Sep-2026 11:46:55 | PASSED |
| 30-Sep-2026 11:46:55 | |
| 30-Sep-2026 11:46:55 | 2026-09-30 15:46:56 INFO ImageFactory::createImage Created Temp image of shape [10, 20, 30] with float valued pixels. |
| 30-Sep-2026 11:46:55 | 2026-09-30 15:46:56 INFO ImageRegion::fromRecord Selected bounding box : |
| 30-Sep-2026 11:46:55 | 2026-09-30 15:46:56 INFO ImageRegion::fromRecord+ [0, 0, 0] to [9, 19, 29] (00:00:20.000, -00.10.00.001, 1.41498e+09Hz to 23:59:44.000, +00.09.00.001, 1.41501e+09Hz) |
| 30-Sep-2026 11:46:55 | 2026-09-30 15:46:56 INFO ImageRegion::fromRecord Selected bounding box : |
| 30-Sep-2026 11:46:55 | 2026-09-30 15:46:56 INFO ImageRegion::fromRecord+ [0, 0, 0] to [9, 19, 29] (00:00:20.000, -00.10.00.001, 1.41498e+09Hz to 23:59:44.000, +00.09.00.001, 1.41501e+09Hz) |
| 30-Sep-2026 11:46:55 | 2026-09-30 15:46:56 INFO ImageFactory::createImage Created Paged image 'keep.im' of shape [10, 20, 1, 1] with float valued pixels. |
| 30-Sep-2026 11:46:55 | 2026-09-30 15:46:56 INFO ImageRegion::fromRecord Selected bounding box : |
| 30-Sep-2026 11:46:55 | 2026-09-30 15:46:56 INFO ImageRegion::fromRecord+ [0, 0, 0, 0] to [9, 19, 0, 0] (00:00:20.000, -00.10.00.001, I, 1.415e+09Hz to 23:59:44.000, +00.09.00.001, I, 1.415e+09Hz) |
| 30-Sep-2026 11:46:55 | 2026-09-30 15:46:56 INFO ImageRegion::fromRecord Selected bounding box : |
| 30-Sep-2026 11:46:55 | 2026-09-30 15:46:56 INFO ImageRegion::fromRecord+ [0, 0, 0, 0] to [9, 19, 0, 0] (00:00:20.000, -00.10.00.001, I, 1.415e+09Hz to 23:59:44.000, +00.09.00.001, I, 1.415e+09Hz) |
| 30-Sep-2026 11:46:55 | 2026-09-30 15:46:56 INFO ImageRegion::fromRecord Selected bounding box : |
| 30-Sep-2026 11:46:55 | 2026-09-30 15:46:56 INFO ImageRegion::fromRecord+ [0, 0, 0, 0] to [9, 19, 0, 0] (00:00:20.000, -00.10.00.001, I, 1.415e+09Hz to 23:59:44.000, +00.09.00.001, I, 1.415e+09Hz) |
| 30-Sep-2026 11:46:55 | 2026-09-30 15:46:56 INFO name:: No table opened. |
| 30-Sep-2026 11:46:55 | 2026-09-30 15:46:56 INFO showcache:: The Table Cache is empty. |
| 30-Sep-2026 11:46:55 | test_tool_image_subimage.py::ia_subimage_test::test_keepaxes |
| 30-Sep-2026 11:46:55 | Test the keepaxes parameter |
| 30-Sep-2026 11:46:55 | PASSED |
| 30-Sep-2026 11:46:55 | |
| 30-Sep-2026 11:46:55 | 2026-09-30 15:46:56 INFO ImageFactory::createImage Created Temp image of shape [2, 2] with float valued pixels. |
| 30-Sep-2026 11:46:55 | 2026-09-30 15:46:56 INFO ImageFactory::createImage Created Temp image of shape [2, 2] with Complex valued pixels. |
| 30-Sep-2026 11:46:55 | 2026-09-30 15:46:56 INFO ImageFactory::createImage Created Temp image of shape [2, 2] with double valued pixels. |
| 30-Sep-2026 11:46:55 | 2026-09-30 15:46:56 INFO ImageFactory::createImage Created Temp image of shape [2, 2] with DComplex valued pixels. |
| 30-Sep-2026 11:46:55 | 2026-09-30 15:46:56 INFO name:: No table opened. |
| 30-Sep-2026 11:46:55 | 2026-09-30 15:46:56 INFO showcache:: The Table Cache is empty. |
| 30-Sep-2026 11:46:55 | test_tool_image_subimage.py::ia_subimage_test::test_precision |
| 30-Sep-2026 11:46:55 | Test various precision valued image support |
| 30-Sep-2026 11:46:55 | PASSED |
| 30-Sep-2026 11:46:55 | |
| 30-Sep-2026 11:46:55 | 2026-09-30 15:46:56 INFO ImageFactory::createImage Created Paged image 'mask1.im' of shape [20, 30, 4, 10] with float valued pixels. |
| 30-Sep-2026 11:46:55 | 2026-09-30 15:46:56 INFO ImageFactory::createImage Created Paged image 'mask2.im' of shape [20, 30, 4, 1] with float valued pixels. |
| 30-Sep-2026 11:46:55 | 2026-09-30 15:46:56 INFO ImageFactory::createImage Created Paged image 'mask3.im' of shape [20, 30, 4, 2] with float valued pixels. |
| 30-Sep-2026 11:46:55 | 2026-09-30 15:46:56 INFO ImageFactory::createImage Created Paged image 'xx.im' of shape [20, 30, 4, 10] with float valued pixels. |
| 30-Sep-2026 11:46:55 | 2026-09-30 15:46:56 INFO ImageMaskAttacher::makeMask Created mask `mask0' |
| 30-Sep-2026 11:46:55 | 2026-09-30 15:46:56 INFO name:: No table opened. |
| 30-Sep-2026 11:46:55 | 2026-09-30 15:46:56 INFO showcache:: The Table Cache is empty. |
| 30-Sep-2026 11:46:55 | 2026-09-30 15:46:56 SEVERE image::_detached (file /private/var/folders/60/83wxljbx2vlfbx_hy0yfv8rc0000gn/T/build-via-sdist-yg5p8xhn/casatools-6.7.7.9a14617.dev10/src/tools/image/image_cmpt.cc, line 1653) Image is detached - cannot perform operation. |
| 30-Sep-2026 11:46:55 | 2026-09-30 15:46:56 SEVERE image::_detached (file /private/var/folders/60/83wxljbx2vlfbx_hy0yfv8rc0000gn/T/build-via-sdist-yg5p8xhn/casatools-6.7.7.9a14617.dev10/src/tools/image/image_cmpt.cc, line 1653)+ Call image.open('filename') to reattach. |
| 30-Sep-2026 11:46:55 | 2026-09-30 15:46:56 SEVERE image::_detached (file /private/var/folders/60/83wxljbx2vlfbx_hy0yfv8rc0000gn/T/build-via-sdist-yg5p8xhn/casatools-6.7.7.9a14617.dev10/src/tools/image/image_cmpt.cc, line 1653) Exception Reported: Exception: Unable to create image. |
| 30-Sep-2026 11:46:55 | 2026-09-30 15:46:56 SEVERE image::_detached (file /private/var/folders/60/83wxljbx2vlfbx_hy0yfv8rc0000gn/T/build-via-sdist-yg5p8xhn/casatools-6.7.7.9a14617.dev10/src/tools/image/image_cmpt.cc, line 1653)+ ... thrown by image *casac::image::subimage(const string &, const variant &, const variant &, bool, bool, bool, bool, bool, const vector<long> &) at File: /private/var/folders/60/83wxljbx2vlfbx_hy0yfv8rc0000gn/T/build-via-sdist-yg5p8xhn/casatools-6.7.7.9a14617.dev10/src/tools/image/image_cmpt.cc, line: 6163 |
| 30-Sep-2026 11:46:55 | 2026-09-30 15:46:56 INFO ImageMaskAttacher::makeMask Created mask `mask0' |
| 30-Sep-2026 11:46:55 | 2026-09-30 15:46:56 INFO name:: No table opened. |
| 30-Sep-2026 11:46:55 | 2026-09-30 15:46:56 INFO showcache:: The Table Cache is empty. |
| 30-Sep-2026 11:46:55 | 2026-09-30 15:46:56 SEVERE image::subimage (file /private/var/folders/60/83wxljbx2vlfbx_hy0yfv8rc0000gn/T/build-via-sdist-yg5p8xhn/casatools-6.7.7.9a14617.dev10/src/tools/image/image_cmpt.cc, line 6162) Exception Reported: Unable to extend mask: ExtendSpecifier - new nor stretch axes given at File: /Users/casaci/bamboohome/xml-data/build-dir/CASASPECS-DBC131-BPO15AP312/casainstall/include/casacpp/imageanalysis/ImageAnalysis/SubImageFactory.tcc, line: 313 |
| 30-Sep-2026 11:46:55 | 2026-09-30 15:46:56 INFO name:: No table opened. |
| 30-Sep-2026 11:46:55 | 2026-09-30 15:46:56 INFO showcache:: The Table Cache is empty. |
| 30-Sep-2026 11:46:55 | test_tool_image_subimage.py::ia_subimage_test::test_stretch |
| 30-Sep-2026 11:46:55 | Test the stretch parameter |
| 30-Sep-2026 11:46:55 | PASSED |
| 30-Sep-2026 11:46:55 | |
| 30-Sep-2026 11:46:55 | - generated xml file: /Users/casaci/bamboohome/xml-data/build-dir/CASASPECS-DEVTESTFULLPY312122-TTAM14P/casa6/casatestutils/nosedir/xml/test_tool_image_subimage/nose.xml - |
| 30-Sep-2026 11:46:55 | ========================= 5 passed, 1 warning in 2.45s ========================= |
| 30-Sep-2026 11:46:56 | ============================= test session starts ============================== |
| 30-Sep-2026 11:46:56 | platform darwin -- Python 3.12.8, pytest-9.1.1, pluggy-1.6.0 -- /Users/casaci/bamboohome/xml-data/build-dir/CASASPECS-DEVTESTFULLPY312122-TTAM14P/casa6testenv/bin/python |
| 30-Sep-2026 11:46:56 | cachedir: .pytest_cache |
| 30-Sep-2026 11:46:56 | rootdir: /Users/casaci/bamboohome/xml-data/build-dir/CASASPECS-DEVTESTFULLPY312122-TTAM14P/casa6/casatestutils/nosedir/test_tool_image_pbcor |
| 30-Sep-2026 11:46:56 | configfile: pytest.ini |
| 30-Sep-2026 11:46:58 | collecting ... collected 9 items |
| 30-Sep-2026 11:46:58 | |
| 30-Sep-2026 11:46:58 | |
| 30-Sep-2026 11:46:58 | 2026-09-30 15:46:58 INFO FITSCoordinateUtil::fromFITSHeader passing empty or nonexistant spectral Coordinate axis |
| 30-Sep-2026 11:46:58 | 2026-09-30 15:46:58 INFO FITSCoordinateUtil::fromFITSHeader passing empty or nonexistant spectral Coordinate axis |
| 30-Sep-2026 11:46:58 | 2026-09-30 15:46:58 INFO CasacRegionManager::fromBCS No directional region specified. Using full positional plane. |
| 30-Sep-2026 11:46:58 | 2026-09-30 15:46:58 INFO CasacRegionManager::fromBCS Using all spectral channels. |
| 30-Sep-2026 11:46:58 | 2026-09-30 15:46:58 INFO CasacRegionManager::fromBCS Using polarizations ALL |
| 30-Sep-2026 11:46:58 | 2026-09-30 15:46:58 INFO ImageRegion::fromRecord Selected bounding box : |
| 30-Sep-2026 11:46:58 | 2026-09-30 15:46:58 INFO ImageRegion::fromRecord+ [0, 0, 0, 0] to [112, 75, 4, 1] (00:03:44.024, -00.38.00.046, 1.415e+09Hz, I to 23:56:15.977, +00.37.00.043, 1.415e+09Hz, Q) |
| 30-Sep-2026 11:46:58 | 2026-09-30 15:46:58 INFO ImageRegion::fromRecord Selected bounding box : |
| 30-Sep-2026 11:46:58 | 2026-09-30 15:46:58 INFO ImageRegion::fromRecord+ [0, 0, 0, 0] to [112, 75, 4, 1] (00:03:44.024, -00.38.00.046, 1.415e+09Hz, I to 23:56:15.977, +00.37.00.043, 1.415e+09Hz, Q) |
| 30-Sep-2026 11:46:58 | 2026-09-30 15:46:59 INFO SubImageFactory::createImage Creating image 'mypb.im' of shape [113, 76, 5, 2] |
| 30-Sep-2026 11:46:58 | 2026-09-30 15:46:59 INFO ImageMaskAttacher::makeMask Created mask `mask0' |
| 30-Sep-2026 11:46:58 | 2026-09-30 15:46:59 INFO ImageRegion::fromRecord Selected bounding box : |
| 30-Sep-2026 11:46:58 | 2026-09-30 15:46:59 INFO ImageRegion::fromRecord+ [0, 0, 0, 0] to [112, 75, 0, 0] (00:03:44.024, -00.38.00.046, 1.415e+09Hz, I to 23:56:15.977, +00.37.00.043, 1.415e+09Hz, I) |
| 30-Sep-2026 11:46:58 | 2026-09-30 15:46:59 INFO CasacRegionManager::fromBCS No directional region specified. Using full positional plane. |
| 30-Sep-2026 11:46:58 | 2026-09-30 15:46:59 INFO CasacRegionManager::fromBCS Using all spectral channels. |
| 30-Sep-2026 11:46:58 | 2026-09-30 15:46:59 INFO CasacRegionManager::fromBCS Using polarizations ALL |
| 30-Sep-2026 11:46:58 | 2026-09-30 15:46:59 INFO ImageRegion::fromRecord Selected bounding box : |
| 30-Sep-2026 11:46:58 | 2026-09-30 15:46:59 INFO ImageRegion::fromRecord+ [0, 0, 0, 0] to [112, 75, 4, 1] (00:03:44.024, -00.38.00.046, 1.415e+09Hz, I to 23:56:15.977, +00.37.00.043, 1.415e+09Hz, Q) |
| 30-Sep-2026 11:46:58 | 2026-09-30 15:46:59 INFO ImageRegion::fromRecord Selected bounding box : |
| 30-Sep-2026 11:46:58 | 2026-09-30 15:46:59 INFO ImageRegion::fromRecord+ [0, 0, 0, 0] to [112, 75, 4, 1] (00:03:44.024, -00.38.00.046, 1.415e+09Hz, I to 23:56:15.977, +00.37.00.043, 1.415e+09Hz, Q) |
| 30-Sep-2026 11:46:58 | 2026-09-30 15:46:59 INFO SubImageFactory::createImage Creating image 'mypb.im' of shape [113, 76, 5, 2] |
| 30-Sep-2026 11:46:58 | 2026-09-30 15:46:59 INFO ImageMaskAttacher::makeMask Created mask `mask0' |
| 30-Sep-2026 11:46:58 | 2026-09-30 15:46:59 INFO name:: No table opened. |
| 30-Sep-2026 11:46:58 | 2026-09-30 15:46:59 INFO showcache:: The Table Cache is empty. |
| 30-Sep-2026 11:46:58 | test_tool_image_pbcor.py::ia_pbcor_test::test_4d_image_with_2d_pb |
| 30-Sep-2026 11:46:58 | ia.pbcor: Test full image divide with cutoff. Primary beam is 2 D, image is 4 D |
| 30-Sep-2026 11:46:58 | PASSED |
| 30-Sep-2026 11:46:58 | |
| 30-Sep-2026 11:46:58 | 2026-09-30 15:46:59 INFO SubImageFactory::createImage Creating image 'mypb.im' of shape [5, 5, 1, 1] |
| 30-Sep-2026 11:46:58 | 2026-09-30 15:46:59 INFO name:: No table opened. |
| 30-Sep-2026 11:46:58 | 2026-09-30 15:46:59 INFO showcache:: The Table Cache is empty. |
| 30-Sep-2026 11:46:58 | test_tool_image_pbcor.py::ia_pbcor_test::test_diff_spectral_coordinate |
| 30-Sep-2026 11:46:58 | Verify fix that a different spectral coordinates in target and template don't matter, CAS-5096 |
| 30-Sep-2026 11:46:58 | PASSED |
| 30-Sep-2026 11:46:58 | |
| 30-Sep-2026 11:46:58 | 2026-09-30 15:46:59 INFO ImageFactory::createImage Created Paged image 't_in.im' of shape [20, 20, 4, 20] with float valued pixels. |
| 30-Sep-2026 11:46:58 | 2026-09-30 15:46:59 INFO ImageFactory::createImage Created Paged image 't_pb_in.im' of shape [20, 20, 4, 20] with float valued pixels. |
| 30-Sep-2026 11:46:58 | 2026-09-30 15:46:59 INFO CasacRegionManager::fromBCS No directional region specified. Using full positional plane. |
| 30-Sep-2026 11:46:58 | 2026-09-30 15:46:59 INFO CasacRegionManager::fromBCS Using all spectral channels. |
| 30-Sep-2026 11:46:58 | 2026-09-30 15:46:59 INFO CasacRegionManager::fromBCS Using polarizations I |
| 30-Sep-2026 11:46:58 | 2026-09-30 15:46:59 INFO ImageRegion::fromRecord Selected bounding box : |
| 30-Sep-2026 11:46:58 | 2026-09-30 15:46:59 INFO ImageRegion::fromRecord+ [0, 0, 0, 0] to [19, 19, 0, 19] (00:00:40.000, -00.10.00.001, I, 1.41499e+09Hz to 23:59:24.000, +00.09.00.001, I, 1.41501e+09Hz) |
| 30-Sep-2026 11:46:58 | 2026-09-30 15:46:59 INFO ImageRegion::fromRecord Selected bounding box : |
| 30-Sep-2026 11:46:58 | 2026-09-30 15:46:59 INFO ImageRegion::fromRecord+ [0, 0, 0, 0] to [19, 19, 0, 19] (00:00:40.000, -00.10.00.001, I, 1.41499e+09Hz to 23:59:24.000, +00.09.00.001, I, 1.41501e+09Hz) |
| 30-Sep-2026 11:46:58 | 2026-09-30 15:46:59 INFO SubImageFactory::createImage Creating image 't_out.im' of shape [20, 20, 1, 20] |
| 30-Sep-2026 11:46:58 | 2026-09-30 15:46:59 INFO name:: No table opened. |
| 30-Sep-2026 11:46:58 | 2026-09-30 15:46:59 INFO showcache:: The Table Cache is empty. |
| 30-Sep-2026 11:46:58 | test_tool_image_pbcor.py::ia_pbcor_test::test_empty_region_and_stokes |
| 30-Sep-2026 11:46:58 | Test specifying stokes with empty region works (CAS-11708) |
| 30-Sep-2026 11:46:58 | PASSED |
| 30-Sep-2026 11:46:58 | |
| 30-Sep-2026 11:46:58 | 2026-09-30 15:46:59 SEVERE image::open (file /private/var/folders/60/83wxljbx2vlfbx_hy0yfv8rc0000gn/T/build-via-sdist-yg5p8xhn/casatools-6.7.7.9a14617.dev10/src/tools/image/image_cmpt.cc, line 4208) Exception Reported: Exception: File name is empty. |
| 30-Sep-2026 11:46:58 | 2026-09-30 15:46:59 SEVERE image::open (file /private/var/folders/60/83wxljbx2vlfbx_hy0yfv8rc0000gn/T/build-via-sdist-yg5p8xhn/casatools-6.7.7.9a14617.dev10/src/tools/image/image_cmpt.cc, line 4208)+ ... thrown by static void casa::ImageFactory::_checkInfile(const String &) at File: /Users/casaci/bamboohome/xml-data/build-dir/CASASPECS-DBC131-BPO15AP312/casa6/casatools/src/code/imageanalysis/ImageAnalysis/ImageFactory2.cc, line: 373 |
| 30-Sep-2026 11:46:58 | 2026-09-30 15:46:59 SEVERE image::open (file /private/var/folders/60/83wxljbx2vlfbx_hy0yfv8rc0000gn/T/build-via-sdist-yg5p8xhn/casatools-6.7.7.9a14617.dev10/src/tools/image/image_cmpt.cc, line 4208) Exception Reported: Exception: File totally_bogus does not exist.. |
| 30-Sep-2026 11:46:58 | 2026-09-30 15:46:59 SEVERE image::open (file /private/var/folders/60/83wxljbx2vlfbx_hy0yfv8rc0000gn/T/build-via-sdist-yg5p8xhn/casatools-6.7.7.9a14617.dev10/src/tools/image/image_cmpt.cc, line 4208)+ ... thrown by static void casa::ImageFactory::_checkInfile(const String &) at File: /Users/casaci/bamboohome/xml-data/build-dir/CASASPECS-DBC131-BPO15AP312/casa6/casatools/src/code/imageanalysis/ImageAnalysis/ImageFactory2.cc, line: 378 |
| 30-Sep-2026 11:46:58 | 2026-09-30 15:46:59 INFO FITSCoordinateUtil::fromFITSHeader passing empty or nonexistant spectral Coordinate axis |
| 30-Sep-2026 11:46:58 | 2026-09-30 15:46:59 SEVERE image::pbcor (file /private/var/folders/60/83wxljbx2vlfbx_hy0yfv8rc0000gn/T/build-via-sdist-yg5p8xhn/casatools-6.7.7.9a14617.dev10/src/tools/image/image_cmpt.cc, line 4289) Exception Reported: Exception: The image filename is empty. |
| 30-Sep-2026 11:46:58 | 2026-09-30 15:46:59 SEVERE image::pbcor (file /private/var/folders/60/83wxljbx2vlfbx_hy0yfv8rc0000gn/T/build-via-sdist-yg5p8xhn/casatools-6.7.7.9a14617.dev10/src/tools/image/image_cmpt.cc, line 4289)+ ... thrown by static void casacore::ImageUtilities::openImage(ImageInterface<T> *&, const String &) [T = float] at File: /Users/casaci/bamboohome/xml-data/build-dir/CASASPECS-DBC131-BPO15AP312/casainstall/include/casacore/images/Images/ImageUtilities2.tcc, line: 258 |
| 30-Sep-2026 11:46:58 | 2026-09-30 15:46:59 INFO FITSCoordinateUtil::fromFITSHeader passing empty or nonexistant spectral Coordinate axis |
| 30-Sep-2026 11:46:58 | 2026-09-30 15:46:59 SEVERE image::pbcor (file /private/var/folders/60/83wxljbx2vlfbx_hy0yfv8rc0000gn/T/build-via-sdist-yg5p8xhn/casatools-6.7.7.9a14617.dev10/src/tools/image/image_cmpt.cc, line 4289) Exception Reported: Exception: File 'totally_bogus2' does not exist. |
| 30-Sep-2026 11:46:58 | 2026-09-30 15:46:59 SEVERE image::pbcor (file /private/var/folders/60/83wxljbx2vlfbx_hy0yfv8rc0000gn/T/build-via-sdist-yg5p8xhn/casatools-6.7.7.9a14617.dev10/src/tools/image/image_cmpt.cc, line 4289)+ ... thrown by static void casacore::ImageUtilities::openImage(ImageInterface<T> *&, const String &) [T = float] at File: /Users/casaci/bamboohome/xml-data/build-dir/CASASPECS-DBC131-BPO15AP312/casainstall/include/casacore/images/Images/ImageUtilities2.tcc, line: 263 |
| 30-Sep-2026 11:46:58 | 2026-09-30 15:46:59 INFO FITSCoordinateUtil::fromFITSHeader passing empty or nonexistant spectral Coordinate axis |
| 30-Sep-2026 11:46:58 | 2026-09-30 15:46:59 INFO FITSCoordinateUtil::fromFITSHeader passing empty or nonexistant spectral Coordinate axis |
| 30-Sep-2026 11:46:58 | 2026-09-30 15:46:59 SEVERE ImageInputProcessor::_process Requested output image /bogusplace/bogusimage cannot be created so will not be written |
| 30-Sep-2026 11:46:58 | 2026-09-30 15:46:59 SEVERE image::pbcor (file /private/var/folders/60/83wxljbx2vlfbx_hy0yfv8rc0000gn/T/build-via-sdist-yg5p8xhn/casatools-6.7.7.9a14617.dev10/src/tools/image/image_cmpt.cc, line 4289) Exception Reported: 2026-09-30 15:46:59 SEVERE ImageInputProcessor::_process Requested output image /bogusplace/bogusimage cannot be created so will not be written |
| 30-Sep-2026 11:46:58 | 2026-09-30 15:46:59 INFO FITSCoordinateUtil::fromFITSHeader passing empty or nonexistant spectral Coordinate axis |
| 30-Sep-2026 11:46:58 | 2026-09-30 15:46:59 INFO FITSCoordinateUtil::fromFITSHeader passing empty or nonexistant spectral Coordinate axis |
| 30-Sep-2026 11:46:58 | 2026-09-30 15:46:59 WARN /Users/casaci/bamboohome/xml-data/build-dir/CASASPECS-DEVTESTFULLPY312122-TTAM14P/casa6/casatestutils/nosedir/test_tool_image_pbcor/pbtest1_im.fits is not a valid or readable table |
| 30-Sep-2026 11:46:58 | 2026-09-30 15:46:59 SEVERE Cannot read image /Users/casaci/bamboohome/xml-data/build-dir/CASASPECS-DEVTESTFULLPY312122-TTAM14P/casa6/casatestutils/nosedir/test_tool_image_pbcor/pbtest1_im.fits to get region bogus_region |
| 30-Sep-2026 11:46:58 | 2026-09-30 15:46:59 SEVERE image::pbcor (file /private/var/folders/60/83wxljbx2vlfbx_hy0yfv8rc0000gn/T/build-via-sdist-yg5p8xhn/casatools-6.7.7.9a14617.dev10/src/tools/image/image_cmpt.cc, line 4289) Exception Reported: Unable to open region file or region table description bogus_region in image /Users/casaci/bamboohome/xml-data/build-dir/CASASPECS-DEVTESTFULLPY312122-TTAM14P/casa6/casatestutils/nosedir/test_tool_image_pbcor/pbtest1_im.fits at File: /Users/casaci/bamboohome/xml-data/build-dir/CASASPECS-DBC131-BPO15AP312/casa6/casatools/src/code/imageanalysis/Regions/CasacRegionManager.cc, line: 489 |
| 30-Sep-2026 11:46:58 | 2026-09-30 15:46:59 INFO FITSCoordinateUtil::fromFITSHeader passing empty or nonexistant spectral Coordinate axis |
| 30-Sep-2026 11:46:58 | 2026-09-30 15:46:59 INFO FITSCoordinateUtil::fromFITSHeader passing empty or nonexistant spectral Coordinate axis |
| 30-Sep-2026 11:46:58 | 2026-09-30 15:46:59 SEVERE image::pbcor (file /private/var/folders/60/83wxljbx2vlfbx_hy0yfv8rc0000gn/T/build-via-sdist-yg5p8xhn/casatools-6.7.7.9a14617.dev10/src/tools/image/image_cmpt.cc, line 4289) Exception Reported: Unknown mode zz |
| 30-Sep-2026 11:46:58 | 2026-09-30 15:46:59 INFO FITSCoordinateUtil::fromFITSHeader passing empty or nonexistant spectral Coordinate axis |
| 30-Sep-2026 11:46:58 | 2026-09-30 15:46:59 INFO FITSCoordinateUtil::fromFITSHeader passing empty or nonexistant spectral Coordinate axis |
| 30-Sep-2026 11:46:58 | 2026-09-30 15:46:59 SEVERE image::pbcor (file /private/var/folders/60/83wxljbx2vlfbx_hy0yfv8rc0000gn/T/build-via-sdist-yg5p8xhn/casatools-6.7.7.9a14617.dev10/src/tools/image/image_cmpt.cc, line 4289) Exception Reported: Coordinate systems of image and template are different: The DirectionCoordinates have differing LinearXform components at File: /Users/casaci/bamboohome/xml-data/build-dir/CASASPECS-DBC131-BPO15AP312/casa6/casatools/src/code/imageanalysis/ImageAnalysis/ImagePrimaryBeamCorrector.cc, line: 144 |
| 30-Sep-2026 11:46:58 | 2026-09-30 15:46:59 INFO name:: No table opened. |
| 30-Sep-2026 11:46:58 | 2026-09-30 15:46:59 INFO showcache:: The Table Cache is empty. |
| 30-Sep-2026 11:46:58 | test_tool_image_pbcor.py::ia_pbcor_test::test_exceptions |
| 30-Sep-2026 11:46:58 | ia.pbcor: Test various exception cases |
| 30-Sep-2026 11:46:58 | PASSED |
| 30-Sep-2026 11:46:58 | |
| 30-Sep-2026 11:46:58 | 2026-09-30 15:46:59 INFO FITSCoordinateUtil::fromFITSHeader passing empty or nonexistant spectral Coordinate axis |
| 30-Sep-2026 11:46:58 | 2026-09-30 15:46:59 INFO FITSCoordinateUtil::fromFITSHeader passing empty or nonexistant spectral Coordinate axis |
| 30-Sep-2026 11:46:58 | 2026-09-30 15:46:59 INFO FITSCoordinateUtil::fromFITSHeader passing empty or nonexistant spectral Coordinate axis |
| 30-Sep-2026 11:46:58 | 2026-09-30 15:46:59 INFO CasacRegionManager::fromBCS No directional region specified. Using full positional plane. |
| 30-Sep-2026 11:46:58 | 2026-09-30 15:46:59 INFO ImageRegion::fromRecord Selected bounding box : |
| 30-Sep-2026 11:46:58 | 2026-09-30 15:46:59 INFO ImageRegion::fromRecord+ [0, 0] to [112, 75] (00:00:29.333, -00.07.24.000 to 23:59:29.600, +00.07.36.000) |
| 30-Sep-2026 11:46:58 | 2026-09-30 15:46:59 INFO ImageRegion::fromRecord Selected bounding box : |
| 30-Sep-2026 11:46:58 | 2026-09-30 15:46:59 INFO ImageRegion::fromRecord+ [0, 0] to [112, 75] (00:00:29.333, -00.07.24.000 to 23:59:29.600, +00.07.36.000) |
| 30-Sep-2026 11:46:58 | 2026-09-30 15:46:59 INFO SubImageFactory::createImage Creating image 'mypb.im' of shape [113, 76] |
| 30-Sep-2026 11:46:58 | 2026-09-30 15:46:59 INFO FITSCoordinateUtil::fromFITSHeader passing empty or nonexistant spectral Coordinate axis |
| 30-Sep-2026 11:46:58 | 2026-09-30 15:46:59 INFO FITSCoordinateUtil::fromFITSHeader passing empty or nonexistant spectral Coordinate axis |
| 30-Sep-2026 11:46:58 | 2026-09-30 15:46:59 INFO CasacRegionManager::fromBCS No directional region specified. Using full positional plane. |
| 30-Sep-2026 11:46:58 | 2026-09-30 15:46:59 INFO ImageRegion::fromRecord Selected bounding box : |
| 30-Sep-2026 11:46:58 | 2026-09-30 15:46:59 INFO ImageRegion::fromRecord+ [0, 0] to [112, 75] (00:00:29.333, -00.07.24.000 to 23:59:29.600, +00.07.36.000) |
| 30-Sep-2026 11:46:58 | 2026-09-30 15:46:59 INFO ImageRegion::fromRecord Selected bounding box : |
| 30-Sep-2026 11:46:58 | 2026-09-30 15:46:59 INFO ImageRegion::fromRecord+ [0, 0] to [112, 75] (00:00:29.333, -00.07.24.000 to 23:59:29.600, +00.07.36.000) |
| 30-Sep-2026 11:46:58 | 2026-09-30 15:46:59 INFO SubImageFactory::createImage Creating image 'mypb.im' of shape [113, 76] |
| 30-Sep-2026 11:46:58 | 2026-09-30 15:46:59 INFO FITSCoordinateUtil::fromFITSHeader passing empty or nonexistant spectral Coordinate axis |
| 30-Sep-2026 11:46:58 | 2026-09-30 15:46:59 INFO name:: No table opened. |
| 30-Sep-2026 11:46:58 | 2026-09-30 15:46:59 INFO showcache:: The Table Cache is empty. |
| 30-Sep-2026 11:46:58 | test_tool_image_pbcor.py::ia_pbcor_test::test_full_image_divide |
| 30-Sep-2026 11:46:58 | ia.pbcor: Test full image divide |
| 30-Sep-2026 11:46:58 | PASSED |
| 30-Sep-2026 11:46:58 | |
| 30-Sep-2026 11:46:58 | 2026-09-30 15:46:59 INFO FITSCoordinateUtil::fromFITSHeader passing empty or nonexistant spectral Coordinate axis |
| 30-Sep-2026 11:46:58 | 2026-09-30 15:46:59 INFO FITSCoordinateUtil::fromFITSHeader passing empty or nonexistant spectral Coordinate axis |
| 30-Sep-2026 11:46:58 | 2026-09-30 15:46:59 INFO FITSCoordinateUtil::fromFITSHeader passing empty or nonexistant spectral Coordinate axis |
| 30-Sep-2026 11:46:58 | 2026-09-30 15:46:59 INFO CasacRegionManager::fromBCS No directional region specified. Using full positional plane. |
| 30-Sep-2026 11:46:58 | 2026-09-30 15:46:59 INFO ImageRegion::fromRecord Selected bounding box : |
| 30-Sep-2026 11:46:58 | 2026-09-30 15:46:59 INFO ImageRegion::fromRecord+ [0, 0] to [112, 75] (00:00:29.333, -00.07.24.000 to 23:59:29.600, +00.07.36.000) |
| 30-Sep-2026 11:46:58 | 2026-09-30 15:46:59 INFO ImageRegion::fromRecord Selected bounding box : |
| 30-Sep-2026 11:46:58 | 2026-09-30 15:46:59 INFO ImageRegion::fromRecord+ [0, 0] to [112, 75] (00:00:29.333, -00.07.24.000 to 23:59:29.600, +00.07.36.000) |
| 30-Sep-2026 11:46:58 | 2026-09-30 15:46:59 INFO SubImageFactory::createImage Creating image 'mypb.im' of shape [113, 76] |
| 30-Sep-2026 11:46:58 | 2026-09-30 15:46:59 INFO ImageMaskAttacher::makeMask Created mask `mask0' |
| 30-Sep-2026 11:46:58 | 2026-09-30 15:46:59 INFO FITSCoordinateUtil::fromFITSHeader passing empty or nonexistant spectral Coordinate axis |
| 30-Sep-2026 11:46:58 | 2026-09-30 15:46:59 INFO CasacRegionManager::fromBCS No directional region specified. Using full positional plane. |
| 30-Sep-2026 11:46:58 | 2026-09-30 15:46:59 INFO ImageRegion::fromRecord Selected bounding box : |
| 30-Sep-2026 11:46:58 | 2026-09-30 15:46:59 INFO ImageRegion::fromRecord+ [0, 0] to [112, 75] (00:00:29.333, -00.07.24.000 to 23:59:29.600, +00.07.36.000) |
| 30-Sep-2026 11:46:58 | 2026-09-30 15:46:59 INFO ImageRegion::fromRecord Selected bounding box : |
| 30-Sep-2026 11:46:58 | 2026-09-30 15:46:59 INFO ImageRegion::fromRecord+ [0, 0] to [112, 75] (00:00:29.333, -00.07.24.000 to 23:59:29.600, +00.07.36.000) |
| 30-Sep-2026 11:46:58 | 2026-09-30 15:46:59 INFO SubImageFactory::createImage Creating image 'mypb.im' of shape [113, 76] |
| 30-Sep-2026 11:46:58 | 2026-09-30 15:46:59 INFO ImageMaskAttacher::makeMask Created mask `mask0' |
| 30-Sep-2026 11:46:58 | 2026-09-30 15:46:59 INFO name:: No table opened. |
| 30-Sep-2026 11:46:58 | 2026-09-30 15:46:59 INFO showcache:: The Table Cache is empty. |
| 30-Sep-2026 11:46:58 | test_tool_image_pbcor.py::ia_pbcor_test::test_full_image_using_cutoff |
| 30-Sep-2026 11:46:58 | ia.pbcor: Test full image divide with cutoff |
| 30-Sep-2026 11:46:58 | PASSED |
| 30-Sep-2026 11:46:58 | |
| 30-Sep-2026 11:46:58 | 2026-09-30 15:46:59 INFO ImageFactory::createImage Created Paged image 'zz.im' of shape [20, 20] with float valued pixels. |
| 30-Sep-2026 11:46:58 | 2026-09-30 15:46:59 INFO SubImageFactory::createImage Creating image 'pb_out.im' of shape [20, 20] |
| 30-Sep-2026 11:46:58 | 2026-09-30 15:46:59 INFO ::::ImageFactory::createImage Created Paged image 'zz.im' of shape [20, 20] with float valued pixels. |
| 30-Sep-2026 11:46:58 | 2026-09-30 15:46:59 INFO ::::image::fromshape Ran ia.fromshape |
| 30-Sep-2026 11:46:58 | 2026-09-30 15:46:59 INFO ::::image::fromshape ia.fromshape(outfile="zz.im", shape=[20,20], csys={...}, linear=false, overwrite=false, log=true, type="f") |
| 30-Sep-2026 11:46:58 | 2026-09-30 15:46:59 INFO ::::image::pbcor Ran ia.pbcor |
| 30-Sep-2026 11:46:58 | 2026-09-30 15:46:59 INFO ::::image::pbcor ia.pbcor(pbimage="(...)", outfile="pb_out.im", overwrite=false, box="", region={...}, chans="", stokes="", mask="", mode="divide", cutoff=-1.000000, stretch=false) |
| 30-Sep-2026 11:46:58 | 2026-09-30 15:46:59 INFO name:: No table opened. |
| 30-Sep-2026 11:46:58 | 2026-09-30 15:46:59 INFO showcache:: The Table Cache is empty. |
| 30-Sep-2026 11:46:58 | test_tool_image_pbcor.py::ia_pbcor_test::test_history |
| 30-Sep-2026 11:46:58 | Test history records are written |
| 30-Sep-2026 11:46:58 | PASSED |
| 30-Sep-2026 11:46:58 | |
| 30-Sep-2026 11:46:58 | 2026-09-30 15:46:59 INFO FITSCoordinateUtil::fromFITSHeader passing empty or nonexistant spectral Coordinate axis |
| 30-Sep-2026 11:46:58 | 2026-09-30 15:46:59 INFO ImageFactory::createImage Created Paged image 'mult_pb.im' of shape [113, 76] with float valued pixels. |
| 30-Sep-2026 11:46:58 | 2026-09-30 15:46:59 INFO CasacRegionManager::fromBCS No directional region specified. Using full positional plane. |
| 30-Sep-2026 11:46:58 | 2026-09-30 15:46:59 INFO CasacRegionManager::fromBCS Using all spectral channels. |
| 30-Sep-2026 11:46:58 | 2026-09-30 15:46:59 INFO CasacRegionManager::fromBCS Using polarizations ALL |
| 30-Sep-2026 11:46:58 | 2026-09-30 15:46:59 INFO ImageRegion::fromRecord Selected bounding box : |
| 30-Sep-2026 11:46:58 | 2026-09-30 15:46:59 INFO ImageRegion::fromRecord+ [0, 0, 0, 0] to [112, 75, 4, 1] (00:03:44.024, -00.38.00.046, 1.415e+09Hz, I to 23:56:15.977, +00.37.00.043, 1.415e+09Hz, Q) |
| 30-Sep-2026 11:46:58 | 2026-09-30 15:46:59 INFO ImageRegion::fromRecord Selected bounding box : |
| 30-Sep-2026 11:46:58 | 2026-09-30 15:46:59 INFO ImageRegion::fromRecord+ [0, 0, 0, 0] to [112, 75, 4, 1] (00:03:44.024, -00.38.00.046, 1.415e+09Hz, I to 23:56:15.977, +00.37.00.043, 1.415e+09Hz, Q) |
| 30-Sep-2026 11:46:58 | 2026-09-30 15:46:59 INFO SubImageFactory::createImage Creating image 'mypb.im' of shape [113, 76, 5, 2] |
| 30-Sep-2026 11:46:58 | 2026-09-30 15:46:59 INFO ImageMaskAttacher::makeMask Created mask `mask0' |
| 30-Sep-2026 11:46:58 | 2026-09-30 15:46:59 INFO ImageRegion::fromRecord Selected bounding box : |
| 30-Sep-2026 11:46:58 | 2026-09-30 15:46:59 INFO ImageRegion::fromRecord+ [0, 0, 0, 0] to [112, 75, 0, 0] (00:03:44.024, -00.38.00.046, 1.415e+09Hz, I to 23:56:15.977, +00.37.00.043, 1.415e+09Hz, I) |
| 30-Sep-2026 11:46:58 | 2026-09-30 15:46:59 INFO CasacRegionManager::fromBCS No directional region specified. Using full positional plane. |
| 30-Sep-2026 11:46:58 | 2026-09-30 15:46:59 INFO CasacRegionManager::fromBCS Using all spectral channels. |
| 30-Sep-2026 11:46:58 | 2026-09-30 15:46:59 INFO CasacRegionManager::fromBCS Using polarizations ALL |
| 30-Sep-2026 11:46:58 | 2026-09-30 15:46:59 INFO ImageRegion::fromRecord Selected bounding box : |
| 30-Sep-2026 11:46:58 | 2026-09-30 15:46:59 INFO ImageRegion::fromRecord+ [0, 0, 0, 0] to [112, 75, 4, 1] (00:03:44.024, -00.38.00.046, 1.415e+09Hz, I to 23:56:15.977, +00.37.00.043, 1.415e+09Hz, Q) |
| 30-Sep-2026 11:46:58 | 2026-09-30 15:46:59 INFO ImageRegion::fromRecord Selected bounding box : |
| 30-Sep-2026 11:46:58 | 2026-09-30 15:46:59 INFO ImageRegion::fromRecord+ [0, 0, 0, 0] to [112, 75, 4, 1] (00:03:44.024, -00.38.00.046, 1.415e+09Hz, I to 23:56:15.977, +00.37.00.043, 1.415e+09Hz, Q) |
| 30-Sep-2026 11:46:58 | 2026-09-30 15:46:59 INFO SubImageFactory::createImage Creating image 'mypb.im' of shape [113, 76, 5, 2] |
| 30-Sep-2026 11:46:58 | 2026-09-30 15:46:59 INFO ImageMaskAttacher::makeMask Created mask `mask0' |
| 30-Sep-2026 11:46:58 | 2026-09-30 15:46:59 INFO name:: No table opened. |
| 30-Sep-2026 11:46:58 | 2026-09-30 15:46:59 INFO showcache:: The Table Cache is empty. |
| 30-Sep-2026 11:46:58 | test_tool_image_pbcor.py::ia_pbcor_test::test_multiply |
| 30-Sep-2026 11:46:58 | ia.pbcor: Test full image multiply with cutoff. Primary beam is 2 D, image is 4 D |
| 30-Sep-2026 11:46:58 | PASSED |
| 30-Sep-2026 11:46:58 | |
| 30-Sep-2026 11:46:58 | 2026-09-30 15:46:59 INFO ImageFactory::createImage Created Temp image of shape [113, 76, 1, 1] with float valued pixels. |
| 30-Sep-2026 11:46:58 | 2026-09-30 15:46:59 INFO SubImageFactory::createImage Creating image 'maskim' of shape [113, 76, 1, 1] |
| 30-Sep-2026 11:46:58 | 2026-09-30 15:46:59 INFO FITSCoordinateUtil::fromFITSHeader passing empty or nonexistant spectral Coordinate axis |
| 30-Sep-2026 11:46:58 | 2026-09-30 15:46:59 SEVERE image::pbcor (file /private/var/folders/60/83wxljbx2vlfbx_hy0yfv8rc0000gn/T/build-via-sdist-yg5p8xhn/casatools-6.7.7.9a14617.dev10/src/tools/image/image_cmpt.cc, line 4289) Exception Reported: The input image shape ([113, 76, 5, 2]) and mask shape ([113, 76, 1, 1]) are different, and it was specified that the mask should not be extended, so the mask cannot be applied to the (sub)image. Specifying that the mask should be extended may resolve the issue at File: /Users/casaci/bamboohome/xml-data/build-dir/CASASPECS-DBC131-BPO15AP312/casa6/casatools/src/code/imageanalysis/ImageAnalysis/SubImageFactory.tcc, line: 306 |
| 30-Sep-2026 11:46:58 | 2026-09-30 15:46:59 WARN image::open (file /private/var/folders/60/83wxljbx2vlfbx_hy0yfv8rc0000gn/T/build-via-sdist-yg5p8xhn/casatools-6.7.7.9a14617.dev10/src/tools/image/image_cmpt.cc, line 4208) Another image is already open, closing first |
| 30-Sep-2026 11:46:58 | 2026-09-30 15:46:59 INFO FITSCoordinateUtil::fromFITSHeader passing empty or nonexistant spectral Coordinate axis |
| 30-Sep-2026 11:46:58 | 2026-09-30 15:46:59 INFO SubImageFactory::createImage Creating image 'blahblah' of shape [113, 76, 5, 2] |
| 30-Sep-2026 11:46:58 | 2026-09-30 15:46:59 INFO ImageMaskAttacher::makeMask Created mask `mask0' |
| 30-Sep-2026 11:46:58 | 2026-09-30 15:46:59 INFO name:: No table opened. |
| 30-Sep-2026 11:46:58 | 2026-09-30 15:46:59 INFO showcache:: The Table Cache is empty. |
| 30-Sep-2026 11:46:58 | test_tool_image_pbcor.py::ia_pbcor_test::test_stretch |
| 30-Sep-2026 11:46:58 | ia.pbcor(): Test stretch parameter |
| 30-Sep-2026 11:46:58 | PASSED |
| 30-Sep-2026 11:46:58 | |
| 30-Sep-2026 11:46:58 | - generated xml file: /Users/casaci/bamboohome/xml-data/build-dir/CASASPECS-DEVTESTFULLPY312122-TTAM14P/casa6/casatestutils/nosedir/xml/test_tool_image_pbcor/nose.xml - |
| 30-Sep-2026 11:46:58 | ========================= 9 passed, 1 warning in 2.73s ========================= |
| 30-Sep-2026 11:46:58 | |
| 30-Sep-2026 11:46:58 | |
| 30-Sep-2026 11:46:58 | Setting Working Directory: /Users/casaci/bamboohome/xml-data/build-dir/CASASPECS-DEVTESTFULLPY312122-TTAM14P/casa6/casatestutils/nosedir/test_tool_linearmosaic/ |
| 30-Sep-2026 11:46:58 | Test Directory: /Users/casaci/bamboohome/xml-data/build-dir/CASASPECS-DEVTESTFULLPY312122-TTAM14P/casa6/casatestutils/nosedir/test_tool_linearmosaic |
| 30-Sep-2026 11:46:58 | |
| 30-Sep-2026 11:46:58 | Running Command: pytest --junitxml=/Users/casaci/bamboohome/xml-data/build-dir/CASASPECS-DEVTESTFULLPY312122-TTAM14P/casa6/casatestutils/nosedir/xml/test_tool_linearmosaic/nose.xml -s --disable-pytest-warnings --verbose -ra --tb=short /Users/casaci/bamboohome/xml-data/build-dir/CASASPECS-DEVTESTFULLPY312122-TTAM14P/casa6/casatestutils/nosedir/test_tool_linearmosaic/ |
| 30-Sep-2026 11:46:58 | |
| 30-Sep-2026 11:46:58 | Setting Working Directory: /Users/casaci/bamboohome/xml-data/build-dir/CASASPECS-DEVTESTFULLPY312122-TTAM14P/casa6/casatestutils/nosedir/test_tool_msmetadata/ |
| 30-Sep-2026 11:46:58 | Test Directory: /Users/casaci/bamboohome/xml-data/build-dir/CASASPECS-DEVTESTFULLPY312122-TTAM14P/casa6/casatestutils/nosedir/test_tool_msmetadata |
| 30-Sep-2026 11:46:58 | |
| 30-Sep-2026 11:46:58 | Running Command: pytest --junitxml=/Users/casaci/bamboohome/xml-data/build-dir/CASASPECS-DEVTESTFULLPY312122-TTAM14P/casa6/casatestutils/nosedir/xml/test_tool_msmetadata/nose.xml -s --disable-pytest-warnings --verbose -ra --tb=short /Users/casaci/bamboohome/xml-data/build-dir/CASASPECS-DEVTESTFULLPY312122-TTAM14P/casa6/casatestutils/nosedir/test_tool_msmetadata/ |
| 30-Sep-2026 11:46:58 | |
| 30-Sep-2026 11:46:58 | Setting Working Directory: /Users/casaci/bamboohome/xml-data/build-dir/CASASPECS-DEVTESTFULLPY312122-TTAM14P/casa6/casatestutils/nosedir/test_tool_image_deviation/ |
| 30-Sep-2026 11:46:58 | Test Directory: /Users/casaci/bamboohome/xml-data/build-dir/CASASPECS-DEVTESTFULLPY312122-TTAM14P/casa6/casatestutils/nosedir/test_tool_image_deviation |
| 30-Sep-2026 11:46:58 | |
| 30-Sep-2026 11:46:58 | Running Command: pytest --junitxml=/Users/casaci/bamboohome/xml-data/build-dir/CASASPECS-DEVTESTFULLPY312122-TTAM14P/casa6/casatestutils/nosedir/xml/test_tool_image_deviation/nose.xml -s --disable-pytest-warnings --verbose -ra --tb=short /Users/casaci/bamboohome/xml-data/build-dir/CASASPECS-DEVTESTFULLPY312122-TTAM14P/casa6/casatestutils/nosedir/test_tool_image_deviation/ |
| 30-Sep-2026 11:46:58 | |
| 30-Sep-2026 11:46:58 | Setting Working Directory: /Users/casaci/bamboohome/xml-data/build-dir/CASASPECS-DEVTESTFULLPY312122-TTAM14P/casa6/casatestutils/nosedir/test_tool_image_regrid/ |
| 30-Sep-2026 11:46:58 | Test Directory: /Users/casaci/bamboohome/xml-data/build-dir/CASASPECS-DEVTESTFULLPY312122-TTAM14P/casa6/casatestutils/nosedir/test_tool_image_regrid |
| 30-Sep-2026 11:46:58 | |
| 30-Sep-2026 11:46:58 | Running Command: pytest --junitxml=/Users/casaci/bamboohome/xml-data/build-dir/CASASPECS-DEVTESTFULLPY312122-TTAM14P/casa6/casatestutils/nosedir/xml/test_tool_image_regrid/nose.xml -s --disable-pytest-warnings --verbose -ra --tb=short /Users/casaci/bamboohome/xml-data/build-dir/CASASPECS-DEVTESTFULLPY312122-TTAM14P/casa6/casatestutils/nosedir/test_tool_image_regrid/ |
| 30-Sep-2026 11:46:58 | |
| 30-Sep-2026 11:46:58 | Setting Working Directory: /Users/casaci/bamboohome/xml-data/build-dir/CASASPECS-DEVTESTFULLPY312122-TTAM14P/casa6/casatestutils/nosedir/test_tool_regionmanager/ |
| 30-Sep-2026 11:46:58 | Test Directory: /Users/casaci/bamboohome/xml-data/build-dir/CASASPECS-DEVTESTFULLPY312122-TTAM14P/casa6/casatestutils/nosedir/test_tool_regionmanager |
| 30-Sep-2026 11:46:58 | |
| 30-Sep-2026 11:46:58 | Running Command: pytest --junitxml=/Users/casaci/bamboohome/xml-data/build-dir/CASASPECS-DEVTESTFULLPY312122-TTAM14P/casa6/casatestutils/nosedir/xml/test_tool_regionmanager/nose.xml -s --disable-pytest-warnings --verbose -ra --tb=short /Users/casaci/bamboohome/xml-data/build-dir/CASASPECS-DEVTESTFULLPY312122-TTAM14P/casa6/casatestutils/nosedir/test_tool_regionmanager/ |
| 30-Sep-2026 11:46:58 | |
| 30-Sep-2026 11:46:58 | Setting Working Directory: /Users/casaci/bamboohome/xml-data/build-dir/CASASPECS-DEVTESTFULLPY312122-TTAM14P/casa6/casatestutils/nosedir/test_tool_logsink/ |
| 30-Sep-2026 11:46:58 | Test Directory: /Users/casaci/bamboohome/xml-data/build-dir/CASASPECS-DEVTESTFULLPY312122-TTAM14P/casa6/casatestutils/nosedir/test_tool_logsink |
| 30-Sep-2026 11:46:58 | |
| 30-Sep-2026 11:46:58 | Running Command: pytest --junitxml=/Users/casaci/bamboohome/xml-data/build-dir/CASASPECS-DEVTESTFULLPY312122-TTAM14P/casa6/casatestutils/nosedir/xml/test_tool_logsink/nose.xml -s --disable-pytest-warnings --verbose -ra --tb=short /Users/casaci/bamboohome/xml-data/build-dir/CASASPECS-DEVTESTFULLPY312122-TTAM14P/casa6/casatestutils/nosedir/test_tool_logsink/ |
| 30-Sep-2026 11:46:58 | |
| 30-Sep-2026 11:46:58 | Setting Working Directory: /Users/casaci/bamboohome/xml-data/build-dir/CASASPECS-DEVTESTFULLPY312122-TTAM14P/casa6/casatestutils/nosedir/test_tool_calanalysis/ |
| 30-Sep-2026 11:46:58 | Test Directory: /Users/casaci/bamboohome/xml-data/build-dir/CASASPECS-DEVTESTFULLPY312122-TTAM14P/casa6/casatestutils/nosedir/test_tool_calanalysis |
| 30-Sep-2026 11:46:58 | |
| 30-Sep-2026 11:46:58 | Running Command: pytest --junitxml=/Users/casaci/bamboohome/xml-data/build-dir/CASASPECS-DEVTESTFULLPY312122-TTAM14P/casa6/casatestutils/nosedir/xml/test_tool_calanalysis/nose.xml -s --disable-pytest-warnings --verbose -ra --tb=short /Users/casaci/bamboohome/xml-data/build-dir/CASASPECS-DEVTESTFULLPY312122-TTAM14P/casa6/casatestutils/nosedir/test_tool_calanalysis/ |
| 30-Sep-2026 11:46:58 | |
| 30-Sep-2026 11:46:58 | Setting Working Directory: /Users/casaci/bamboohome/xml-data/build-dir/CASASPECS-DEVTESTFULLPY312122-TTAM14P/casa6/casatestutils/nosedir/test_tool_vpmanager/ |
| 30-Sep-2026 11:46:58 | Test Directory: /Users/casaci/bamboohome/xml-data/build-dir/CASASPECS-DEVTESTFULLPY312122-TTAM14P/casa6/casatestutils/nosedir/test_tool_vpmanager |
| 30-Sep-2026 11:46:58 | |
| 30-Sep-2026 11:46:58 | Running Command: pytest --junitxml=/Users/casaci/bamboohome/xml-data/build-dir/CASASPECS-DEVTESTFULLPY312122-TTAM14P/casa6/casatestutils/nosedir/xml/test_tool_vpmanager/nose.xml -s --disable-pytest-warnings --verbose -ra --tb=short /Users/casaci/bamboohome/xml-data/build-dir/CASASPECS-DEVTESTFULLPY312122-TTAM14P/casa6/casatestutils/nosedir/test_tool_vpmanager/ |
| 30-Sep-2026 11:46:58 | |
| 30-Sep-2026 11:46:58 | Setting Working Directory: /Users/casaci/bamboohome/xml-data/build-dir/CASASPECS-DEVTESTFULLPY312122-TTAM14P/casa6/casatestutils/nosedir/test_tool_simulator/ |
| 30-Sep-2026 11:46:58 | Test Directory: /Users/casaci/bamboohome/xml-data/build-dir/CASASPECS-DEVTESTFULLPY312122-TTAM14P/casa6/casatestutils/nosedir/test_tool_simulator |
| 30-Sep-2026 11:46:58 | |
| 30-Sep-2026 11:46:58 | Running Command: pytest --junitxml=/Users/casaci/bamboohome/xml-data/build-dir/CASASPECS-DEVTESTFULLPY312122-TTAM14P/casa6/casatestutils/nosedir/xml/test_tool_simulator/nose.xml -s --disable-pytest-warnings --verbose -ra --tb=short /Users/casaci/bamboohome/xml-data/build-dir/CASASPECS-DEVTESTFULLPY312122-TTAM14P/casa6/casatestutils/nosedir/test_tool_simulator/ |
| 30-Sep-2026 11:46:58 | |
| 30-Sep-2026 11:46:58 | Setting Working Directory: /Users/casaci/bamboohome/xml-data/build-dir/CASASPECS-DEVTESTFULLPY312122-TTAM14P/casa6/casatestutils/nosedir/test_tool_image_rebin/ |
| 30-Sep-2026 11:46:58 | Test Directory: /Users/casaci/bamboohome/xml-data/build-dir/CASASPECS-DEVTESTFULLPY312122-TTAM14P/casa6/casatestutils/nosedir/test_tool_image_rebin |
| 30-Sep-2026 11:46:58 | |
| 30-Sep-2026 11:46:58 | Running Command: pytest --junitxml=/Users/casaci/bamboohome/xml-data/build-dir/CASASPECS-DEVTESTFULLPY312122-TTAM14P/casa6/casatestutils/nosedir/xml/test_tool_image_rebin/nose.xml -s --disable-pytest-warnings --verbose -ra --tb=short /Users/casaci/bamboohome/xml-data/build-dir/CASASPECS-DEVTESTFULLPY312122-TTAM14P/casa6/casatestutils/nosedir/test_tool_image_rebin/ |
| 30-Sep-2026 11:46:58 | |
| 30-Sep-2026 11:46:58 | Setting Working Directory: /Users/casaci/bamboohome/xml-data/build-dir/CASASPECS-DEVTESTFULLPY312122-TTAM14P/casa6/casatestutils/nosedir/test_tool_measures/ |
| 30-Sep-2026 11:46:58 | Test Directory: /Users/casaci/bamboohome/xml-data/build-dir/CASASPECS-DEVTESTFULLPY312122-TTAM14P/casa6/casatestutils/nosedir/test_tool_measures |
| 30-Sep-2026 11:46:58 | |
| 30-Sep-2026 11:46:58 | Running Command: pytest --junitxml=/Users/casaci/bamboohome/xml-data/build-dir/CASASPECS-DEVTESTFULLPY312122-TTAM14P/casa6/casatestutils/nosedir/xml/test_tool_measures/nose.xml -s --disable-pytest-warnings --verbose -ra --tb=short /Users/casaci/bamboohome/xml-data/build-dir/CASASPECS-DEVTESTFULLPY312122-TTAM14P/casa6/casatestutils/nosedir/test_tool_measures/ |
| 30-Sep-2026 11:46:58 | |
| 30-Sep-2026 11:46:58 | Setting Working Directory: /Users/casaci/bamboohome/xml-data/build-dir/CASASPECS-DEVTESTFULLPY312122-TTAM14P/casa6/casatestutils/nosedir/test_tool_image_statistics/ |
| 30-Sep-2026 11:46:58 | Test Directory: /Users/casaci/bamboohome/xml-data/build-dir/CASASPECS-DEVTESTFULLPY312122-TTAM14P/casa6/casatestutils/nosedir/test_tool_image_statistics |
| 30-Sep-2026 11:46:58 | |
| 30-Sep-2026 11:46:58 | Running Command: pytest --junitxml=/Users/casaci/bamboohome/xml-data/build-dir/CASASPECS-DEVTESTFULLPY312122-TTAM14P/casa6/casatestutils/nosedir/xml/test_tool_image_statistics/nose.xml -s --disable-pytest-warnings --verbose -ra --tb=short /Users/casaci/bamboohome/xml-data/build-dir/CASASPECS-DEVTESTFULLPY312122-TTAM14P/casa6/casatestutils/nosedir/test_tool_image_statistics/ |
| 30-Sep-2026 11:46:58 | |
| 30-Sep-2026 11:46:58 | Setting Working Directory: /Users/casaci/bamboohome/xml-data/build-dir/CASASPECS-DEVTESTFULLPY312122-TTAM14P/casa6/casatestutils/nosedir/test_tool_image_fitprofile/ |
| 30-Sep-2026 11:46:58 | Test Directory: /Users/casaci/bamboohome/xml-data/build-dir/CASASPECS-DEVTESTFULLPY312122-TTAM14P/casa6/casatestutils/nosedir/test_tool_image_fitprofile |
| 30-Sep-2026 11:46:58 | |
| 30-Sep-2026 11:46:58 | Running Command: pytest --junitxml=/Users/casaci/bamboohome/xml-data/build-dir/CASASPECS-DEVTESTFULLPY312122-TTAM14P/casa6/casatestutils/nosedir/xml/test_tool_image_fitprofile/nose.xml -s --disable-pytest-warnings --verbose -ra --tb=short /Users/casaci/bamboohome/xml-data/build-dir/CASASPECS-DEVTESTFULLPY312122-TTAM14P/casa6/casatestutils/nosedir/test_tool_image_fitprofile/ |
| 30-Sep-2026 11:46:58 | |
| 30-Sep-2026 11:46:58 | Setting Working Directory: /Users/casaci/bamboohome/xml-data/build-dir/CASASPECS-DEVTESTFULLPY312122-TTAM14P/casa6/casatestutils/nosedir/test_tool_synthesisutils/ |
| 30-Sep-2026 11:46:58 | Test Directory: /Users/casaci/bamboohome/xml-data/build-dir/CASASPECS-DEVTESTFULLPY312122-TTAM14P/casa6/casatestutils/nosedir/test_tool_synthesisutils |
| 30-Sep-2026 11:46:58 | |
| 30-Sep-2026 11:46:58 | Running Command: pytest --junitxml=/Users/casaci/bamboohome/xml-data/build-dir/CASASPECS-DEVTESTFULLPY312122-TTAM14P/casa6/casatestutils/nosedir/xml/test_tool_synthesisutils/nose.xml -s --disable-pytest-warnings --verbose -ra --tb=short /Users/casaci/bamboohome/xml-data/build-dir/CASASPECS-DEVTESTFULLPY312122-TTAM14P/casa6/casatestutils/nosedir/test_tool_synthesisutils/ |
| 30-Sep-2026 11:46:58 | |
| 30-Sep-2026 11:46:58 | Setting Working Directory: /Users/casaci/bamboohome/xml-data/build-dir/CASASPECS-DEVTESTFULLPY312122-TTAM14P/casa6/casatestutils/nosedir/test_tool_image_pv/ |
| 30-Sep-2026 11:46:58 | Test Directory: /Users/casaci/bamboohome/xml-data/build-dir/CASASPECS-DEVTESTFULLPY312122-TTAM14P/casa6/casatestutils/nosedir/test_tool_image_pv |
| 30-Sep-2026 11:46:58 | |
| 30-Sep-2026 11:46:58 | Running Command: pytest --junitxml=/Users/casaci/bamboohome/xml-data/build-dir/CASASPECS-DEVTESTFULLPY312122-TTAM14P/casa6/casatestutils/nosedir/xml/test_tool_image_pv/nose.xml -s --disable-pytest-warnings --verbose -ra --tb=short /Users/casaci/bamboohome/xml-data/build-dir/CASASPECS-DEVTESTFULLPY312122-TTAM14P/casa6/casatestutils/nosedir/test_tool_image_pv/ |
| 30-Sep-2026 11:46:58 | |
| 30-Sep-2026 11:46:58 | Setting Working Directory: /Users/casaci/bamboohome/xml-data/build-dir/CASASPECS-DEVTESTFULLPY312122-TTAM14P/casa6/casatestutils/nosedir/test_tool_componentlist/ |
| 30-Sep-2026 11:46:58 | Test Directory: /Users/casaci/bamboohome/xml-data/build-dir/CASASPECS-DEVTESTFULLPY312122-TTAM14P/casa6/casatestutils/nosedir/test_tool_componentlist |
| 30-Sep-2026 11:46:58 | |
| 30-Sep-2026 11:46:58 | Running Command: pytest --junitxml=/Users/casaci/bamboohome/xml-data/build-dir/CASASPECS-DEVTESTFULLPY312122-TTAM14P/casa6/casatestutils/nosedir/xml/test_tool_componentlist/nose.xml -s --disable-pytest-warnings --verbose -ra --tb=short /Users/casaci/bamboohome/xml-data/build-dir/CASASPECS-DEVTESTFULLPY312122-TTAM14P/casa6/casatestutils/nosedir/test_tool_componentlist/ |
| 30-Sep-2026 11:46:58 | |
| 30-Sep-2026 11:46:58 | Setting Working Directory: /Users/casaci/bamboohome/xml-data/build-dir/CASASPECS-DEVTESTFULLPY312122-TTAM14P/casa6/casatestutils/nosedir/test_tool_image_collapse/ |
| 30-Sep-2026 11:46:58 | Test Directory: /Users/casaci/bamboohome/xml-data/build-dir/CASASPECS-DEVTESTFULLPY312122-TTAM14P/casa6/casatestutils/nosedir/test_tool_image_collapse |
| 30-Sep-2026 11:46:58 | |
| 30-Sep-2026 11:46:58 | Running Command: pytest --junitxml=/Users/casaci/bamboohome/xml-data/build-dir/CASASPECS-DEVTESTFULLPY312122-TTAM14P/casa6/casatestutils/nosedir/xml/test_tool_image_collapse/nose.xml -s --disable-pytest-warnings --verbose -ra --tb=short /Users/casaci/bamboohome/xml-data/build-dir/CASASPECS-DEVTESTFULLPY312122-TTAM14P/casa6/casatestutils/nosedir/test_tool_image_collapse/ |
| 30-Sep-2026 11:46:58 | |
| 30-Sep-2026 11:46:58 | Setting Working Directory: /Users/casaci/bamboohome/xml-data/build-dir/CASASPECS-DEVTESTFULLPY312122-TTAM14P/casa6/casatestutils/nosedir/test_tool_sdm/ |
| 30-Sep-2026 11:46:58 | Test Directory: /Users/casaci/bamboohome/xml-data/build-dir/CASASPECS-DEVTESTFULLPY312122-TTAM14P/casa6/casatestutils/nosedir/test_tool_sdm |
| 30-Sep-2026 11:46:58 | |
| 30-Sep-2026 11:46:58 | Running Command: pytest --junitxml=/Users/casaci/bamboohome/xml-data/build-dir/CASASPECS-DEVTESTFULLPY312122-TTAM14P/casa6/casatestutils/nosedir/xml/test_tool_sdm/nose.xml -s --disable-pytest-warnings --verbose -ra --tb=short /Users/casaci/bamboohome/xml-data/build-dir/CASASPECS-DEVTESTFULLPY312122-TTAM14P/casa6/casatestutils/nosedir/test_tool_sdm/ |
| 30-Sep-2026 11:46:58 | |
| 30-Sep-2026 11:46:58 | Setting Working Directory: /Users/casaci/bamboohome/xml-data/build-dir/CASASPECS-DEVTESTFULLPY312122-TTAM14P/casa6/casatestutils/nosedir/test_tool_table/ |
| 30-Sep-2026 11:46:58 | Test Directory: /Users/casaci/bamboohome/xml-data/build-dir/CASASPECS-DEVTESTFULLPY312122-TTAM14P/casa6/casatestutils/nosedir/test_tool_table |
| 30-Sep-2026 11:46:58 | |
| 30-Sep-2026 11:46:58 | Running Command: pytest --junitxml=/Users/casaci/bamboohome/xml-data/build-dir/CASASPECS-DEVTESTFULLPY312122-TTAM14P/casa6/casatestutils/nosedir/xml/test_tool_table/nose.xml -s --disable-pytest-warnings --verbose -ra --tb=short /Users/casaci/bamboohome/xml-data/build-dir/CASASPECS-DEVTESTFULLPY312122-TTAM14P/casa6/casatestutils/nosedir/test_tool_table/ |
| 30-Sep-2026 11:46:58 | |
| 30-Sep-2026 11:46:58 | Setting Working Directory: /Users/casaci/bamboohome/xml-data/build-dir/CASASPECS-DEVTESTFULLPY312122-TTAM14P/casa6/casatestutils/nosedir/test_tool_imagepol/ |
| 30-Sep-2026 11:46:58 | Test Directory: /Users/casaci/bamboohome/xml-data/build-dir/CASASPECS-DEVTESTFULLPY312122-TTAM14P/casa6/casatestutils/nosedir/test_tool_imagepol |
| 30-Sep-2026 11:46:58 | |
| 30-Sep-2026 11:46:58 | Running Command: pytest --junitxml=/Users/casaci/bamboohome/xml-data/build-dir/CASASPECS-DEVTESTFULLPY312122-TTAM14P/casa6/casatestutils/nosedir/xml/test_tool_imagepol/nose.xml -s --disable-pytest-warnings --verbose -ra --tb=short /Users/casaci/bamboohome/xml-data/build-dir/CASASPECS-DEVTESTFULLPY312122-TTAM14P/casa6/casatestutils/nosedir/test_tool_imagepol/ |
| 30-Sep-2026 11:46:58 | |
| 30-Sep-2026 11:46:58 | Setting Working Directory: /Users/casaci/bamboohome/xml-data/build-dir/CASASPECS-DEVTESTFULLPY312122-TTAM14P/casa6/casatestutils/nosedir/test_tool_sdm_toms/ |
| 30-Sep-2026 11:46:58 | Test Directory: /Users/casaci/bamboohome/xml-data/build-dir/CASASPECS-DEVTESTFULLPY312122-TTAM14P/casa6/casatestutils/nosedir/test_tool_sdm_toms |
| 30-Sep-2026 11:46:58 | |
| 30-Sep-2026 11:46:58 | Running Command: pytest --junitxml=/Users/casaci/bamboohome/xml-data/build-dir/CASASPECS-DEVTESTFULLPY312122-TTAM14P/casa6/casatestutils/nosedir/xml/test_tool_sdm_toms/nose.xml -s --disable-pytest-warnings --verbose -ra --tb=short /Users/casaci/bamboohome/xml-data/build-dir/CASASPECS-DEVTESTFULLPY312122-TTAM14P/casa6/casatestutils/nosedir/test_tool_sdm_toms/ |
| 30-Sep-2026 11:46:58 | |
| 30-Sep-2026 11:46:58 | Setting Working Directory: /Users/casaci/bamboohome/xml-data/build-dir/CASASPECS-DEVTESTFULLPY312122-TTAM14P/casa6/casatestutils/nosedir/test_tool_agentflagger/ |
| 30-Sep-2026 11:46:58 | Test Directory: /Users/casaci/bamboohome/xml-data/build-dir/CASASPECS-DEVTESTFULLPY312122-TTAM14P/casa6/casatestutils/nosedir/test_tool_agentflagger |
| 30-Sep-2026 11:46:58 | |
| 30-Sep-2026 11:46:58 | Running Command: pytest --junitxml=/Users/casaci/bamboohome/xml-data/build-dir/CASASPECS-DEVTESTFULLPY312122-TTAM14P/casa6/casatestutils/nosedir/xml/test_tool_agentflagger/nose.xml -s --disable-pytest-warnings --verbose -ra --tb=short /Users/casaci/bamboohome/xml-data/build-dir/CASASPECS-DEVTESTFULLPY312122-TTAM14P/casa6/casatestutils/nosedir/test_tool_agentflagger/ |
| 30-Sep-2026 11:46:58 | |
| 30-Sep-2026 11:46:58 | Setting Working Directory: /Users/casaci/bamboohome/xml-data/build-dir/CASASPECS-DEVTESTFULLPY312122-TTAM14P/casa6/casatestutils/nosedir/test_tool_image_subimage/ |
| 30-Sep-2026 11:46:58 | Test Directory: /Users/casaci/bamboohome/xml-data/build-dir/CASASPECS-DEVTESTFULLPY312122-TTAM14P/casa6/casatestutils/nosedir/test_tool_image_subimage |
| 30-Sep-2026 11:46:58 | |
| 30-Sep-2026 11:46:58 | Running Command: pytest --junitxml=/Users/casaci/bamboohome/xml-data/build-dir/CASASPECS-DEVTESTFULLPY312122-TTAM14P/casa6/casatestutils/nosedir/xml/test_tool_image_subimage/nose.xml -s --disable-pytest-warnings --verbose -ra --tb=short /Users/casaci/bamboohome/xml-data/build-dir/CASASPECS-DEVTESTFULLPY312122-TTAM14P/casa6/casatestutils/nosedir/test_tool_image_subimage/ |
| 30-Sep-2026 11:46:58 | |
| 30-Sep-2026 11:46:58 | Setting Working Directory: /Users/casaci/bamboohome/xml-data/build-dir/CASASPECS-DEVTESTFULLPY312122-TTAM14P/casa6/casatestutils/nosedir/test_tool_image_pbcor/ |
| 30-Sep-2026 11:46:58 | Test Directory: /Users/casaci/bamboohome/xml-data/build-dir/CASASPECS-DEVTESTFULLPY312122-TTAM14P/casa6/casatestutils/nosedir/test_tool_image_pbcor |
| 30-Sep-2026 11:46:58 | |
| 30-Sep-2026 11:46:58 | Running Command: pytest --junitxml=/Users/casaci/bamboohome/xml-data/build-dir/CASASPECS-DEVTESTFULLPY312122-TTAM14P/casa6/casatestutils/nosedir/xml/test_tool_image_pbcor/nose.xml -s --disable-pytest-warnings --verbose -ra --tb=short /Users/casaci/bamboohome/xml-data/build-dir/CASASPECS-DEVTESTFULLPY312122-TTAM14P/casa6/casatestutils/nosedir/test_tool_image_pbcor/ |
| 30-Sep-2026 11:46:58 | a nosedir |
| 30-Sep-2026 11:46:58 | a nosedir/test_tool_msuvbinner |
| 30-Sep-2026 11:46:58 | a nosedir/test_tool_image_deviation |
| 30-Sep-2026 11:46:58 | a nosedir/test_tool_image |
| 30-Sep-2026 11:46:58 | a nosedir/test_tool_ms_statwt |
| 30-Sep-2026 11:46:58 | a nosedir/test_tool_image_pbcor |
| 30-Sep-2026 11:46:58 | a nosedir/test_tool_ms_createmultims |
| 30-Sep-2026 11:46:58 | a nosedir/test_tool_msmetadata |
| 30-Sep-2026 11:46:58 | a nosedir/test_tool_imagepol |
| 30-Sep-2026 11:46:58 | a nosedir/test_tool_componentlist |
| 30-Sep-2026 11:46:58 | a nosedir/test_tool_image_subimage |
| 30-Sep-2026 11:46:58 | a nosedir/test_tool_logsink |
| 30-Sep-2026 11:46:58 | a nosedir/test_tool_ms |
| 30-Sep-2026 11:46:58 | a nosedir/summary_of_failed.log |
| 30-Sep-2026 11:46:58 | a nosedir/test_tool_simulator |
| 30-Sep-2026 11:46:58 | a nosedir/test_tool_measures |
| 30-Sep-2026 11:46:58 | a nosedir/test_tool_coordsys |
| 30-Sep-2026 11:46:58 | a nosedir/test_tool_image_statistics |
| 30-Sep-2026 11:46:58 | a nosedir/xml |
| 30-Sep-2026 11:46:58 | a nosedir/test_tool_image_fitprofile |
| 30-Sep-2026 11:46:58 | a nosedir/test_tool_image_pv |
| 30-Sep-2026 11:46:58 | a nosedir/test_tool_sdm |
| 30-Sep-2026 11:46:58 | a nosedir/test_tool_agentflagger |
| 30-Sep-2026 11:46:58 | a nosedir/test_tool_image_transpose |
| 30-Sep-2026 11:46:58 | a nosedir/test_tool_image_collapse |
| 30-Sep-2026 11:46:58 | a nosedir/test_tool_synthesisutils |
| 30-Sep-2026 11:46:58 | a nosedir/test_tool_calanalysis |
| 30-Sep-2026 11:46:58 | a nosedir/test_tool_vpmanager |
| 30-Sep-2026 11:46:58 | a nosedir/test_tool_regionmanager |
| 30-Sep-2026 11:46:58 | a nosedir/test_tool_calibrater |
| 30-Sep-2026 11:46:58 | a nosedir/test_tool_quanta |
| 30-Sep-2026 11:46:58 | a nosedir/test_tool_linearmosaic |
| 30-Sep-2026 11:46:58 | a nosedir/test_tool_image_rebin |
| 30-Sep-2026 11:46:58 | a nosedir/test_tool_sdm_toms |
| 30-Sep-2026 11:46:58 | a nosedir/test_tool_image_regrid |
| 30-Sep-2026 11:46:58 | a nosedir/test_tool_table |
| 30-Sep-2026 11:46:58 | a nosedir/test_tool_table/conftest.py |
| 30-Sep-2026 11:46:58 | a nosedir/test_tool_table/test_tool_table.py |
| 30-Sep-2026 11:46:58 | a nosedir/test_tool_table/casa-20260930-154325.log |
| 30-Sep-2026 11:46:58 | a nosedir/test_tool_table/short_summary.log |
| 30-Sep-2026 11:46:58 | a nosedir/test_tool_image_regrid/conftest.py |
| 30-Sep-2026 11:46:58 | a nosedir/test_tool_image_regrid/test_tool_image_regrid.py |
| 30-Sep-2026 11:46:58 | a nosedir/test_tool_image_regrid/short_summary.log |
| 30-Sep-2026 11:46:58 | a nosedir/test_tool_image_regrid/casa-20260930-153959.log |
| 30-Sep-2026 11:46:58 | a nosedir/test_tool_sdm_toms/test_tool_sdm_toms.py |
| 30-Sep-2026 11:46:58 | a nosedir/test_tool_sdm_toms/conftest.py |
| 30-Sep-2026 11:46:58 | a nosedir/test_tool_sdm_toms/casa-20260930-154331.log |
| 30-Sep-2026 11:46:58 | a nosedir/test_tool_sdm_toms/short_summary.log |
| 30-Sep-2026 11:46:58 | a nosedir/test_tool_image_rebin/casa-20260930-154023.log |
| 30-Sep-2026 11:46:58 | a nosedir/test_tool_image_rebin/conftest.py |
| 30-Sep-2026 11:46:58 | a nosedir/test_tool_image_rebin/test_tool_image_rebin.py |
| 30-Sep-2026 11:46:58 | a nosedir/test_tool_image_rebin/short_summary.log |
| 30-Sep-2026 11:46:58 | a nosedir/test_tool_linearmosaic/conftest.py |
| 30-Sep-2026 11:46:58 | a nosedir/test_tool_linearmosaic/casa-20260930-153944.log |
| 30-Sep-2026 11:46:58 | a nosedir/test_tool_linearmosaic/test_tool_linearmosaic.py |
| 30-Sep-2026 11:46:58 | a nosedir/test_tool_linearmosaic/short_summary.log |
| 30-Sep-2026 11:46:58 | a nosedir/test_tool_quanta/casa-20260930-153940.log |
| 30-Sep-2026 11:46:58 | a nosedir/test_tool_quanta/conftest.py |
| 30-Sep-2026 11:46:58 | a nosedir/test_tool_quanta/test_tool_quanta.py |
| 30-Sep-2026 11:46:58 | a nosedir/test_tool_quanta/short_summary.log |
| 30-Sep-2026 11:46:58 | a nosedir/test_tool_calibrater/conftest.py |
| 30-Sep-2026 11:46:58 | a nosedir/test_tool_calibrater/test_tool_calibrater.py |
| 30-Sep-2026 11:46:58 | a nosedir/test_tool_calibrater/short_summary.log |
| 30-Sep-2026 11:46:58 | a nosedir/test_tool_calibrater/casa-20260930-153803.log |
| 30-Sep-2026 11:46:58 | a nosedir/test_tool_regionmanager/test_tool_regionmanager.py |
| 30-Sep-2026 11:46:58 | a nosedir/test_tool_regionmanager/conftest.py |
| 30-Sep-2026 11:46:58 | a nosedir/test_tool_regionmanager/short_summary.log |
| 30-Sep-2026 11:46:58 | a nosedir/test_tool_regionmanager/casa-20260930-154003.log |
| 30-Sep-2026 11:46:58 | a nosedir/test_tool_vpmanager/test_tool_vpmanager.py |
| 30-Sep-2026 11:46:58 | a nosedir/test_tool_vpmanager/conftest.py |
| 30-Sep-2026 11:46:58 | a nosedir/test_tool_vpmanager/short_summary.log |
| 30-Sep-2026 11:46:58 | a nosedir/test_tool_vpmanager/casa-20260930-154016.log |
| 30-Sep-2026 11:46:58 | a nosedir/test_tool_calanalysis/conftest.py |
| 30-Sep-2026 11:46:58 | a nosedir/test_tool_calanalysis/test_tool_calanalysis.py |
| 30-Sep-2026 11:46:58 | a nosedir/test_tool_calanalysis/short_summary.log |
| 30-Sep-2026 11:46:58 | a nosedir/test_tool_calanalysis/casa-20260930-154013.log |
| 30-Sep-2026 11:46:58 | a nosedir/test_tool_synthesisutils/conftest.py |
| 30-Sep-2026 11:46:58 | a nosedir/test_tool_synthesisutils/casa-20260930-154301.log |
| 30-Sep-2026 11:46:58 | a nosedir/test_tool_synthesisutils/test_tool_synthesisutils.py |
| 30-Sep-2026 11:46:58 | a nosedir/test_tool_synthesisutils/short_summary.log |
| 30-Sep-2026 11:46:58 | a nosedir/test_tool_image_collapse/conftest.py |
| 30-Sep-2026 11:46:58 | a nosedir/test_tool_image_collapse/casa-20260930-154313.log |
| 30-Sep-2026 11:46:58 | a nosedir/test_tool_image_collapse/short_summary.log |
| 30-Sep-2026 11:46:58 | a nosedir/test_tool_image_collapse/test_tool_image_collapse.py |
| 30-Sep-2026 11:46:58 | a nosedir/test_tool_image_transpose/conftest.py |
| 30-Sep-2026 11:46:58 | a nosedir/test_tool_image_transpose/test_tool_image_transpose.py |
| 30-Sep-2026 11:46:58 | a nosedir/test_tool_image_transpose/short_summary.log |
| 30-Sep-2026 11:46:58 | a nosedir/test_tool_image_transpose/casa-20260930-153800.log |
| 30-Sep-2026 11:46:58 | a nosedir/test_tool_agentflagger/conftest.py |
| 30-Sep-2026 11:46:58 | a nosedir/test_tool_agentflagger/casa-20260930-154647.log |
| 30-Sep-2026 11:46:58 | a nosedir/test_tool_agentflagger/short_summary.log |
| 30-Sep-2026 11:46:58 | a nosedir/test_tool_agentflagger/test_tool_agentflagger.py |
| 30-Sep-2026 11:46:58 | a nosedir/test_tool_sdm/conftest.py |
| 30-Sep-2026 11:46:58 | a nosedir/test_tool_sdm/casa-20260930-154316.log |
| 30-Sep-2026 11:46:58 | a nosedir/test_tool_sdm/short_summary.log |
| 30-Sep-2026 11:46:58 | a nosedir/test_tool_sdm/test_tool_sdm.py |
| 30-Sep-2026 11:46:58 | a nosedir/test_tool_image_pv/conftest.py |
| 30-Sep-2026 11:46:58 | a nosedir/test_tool_image_pv/casa-20260930-154307.log |
| 30-Sep-2026 11:46:58 | a nosedir/test_tool_image_pv/short_summary.log |
| 30-Sep-2026 11:46:58 | a nosedir/test_tool_image_pv/test_tool_image_pv.py |
| 30-Sep-2026 11:46:58 | a nosedir/test_tool_image_fitprofile/conftest.py |
| 30-Sep-2026 11:46:58 | a nosedir/test_tool_image_fitprofile/casa-20260930-154253.log |
| 30-Sep-2026 11:46:58 | a nosedir/test_tool_image_fitprofile/test_tool_image_fitprofile.py |
| 30-Sep-2026 11:46:58 | a nosedir/test_tool_image_fitprofile/short_summary.log |
| 30-Sep-2026 11:46:58 | a nosedir/xml/test_tool_msuvbinner |
| 30-Sep-2026 11:46:58 | a nosedir/xml/test_tool_image_deviation |
| 30-Sep-2026 11:46:58 | a nosedir/xml/test_tool_image |
| 30-Sep-2026 11:46:58 | a nosedir/xml/test_tool_ms_statwt |
| 30-Sep-2026 11:46:58 | a nosedir/xml/test_tool_image_pbcor |
| 30-Sep-2026 11:46:58 | a nosedir/xml/test_tool_ms_createmultims |
| 30-Sep-2026 11:46:58 | a nosedir/xml/test_tool_msmetadata |
| 30-Sep-2026 11:46:58 | a nosedir/xml/test_tool_imagepol |
| 30-Sep-2026 11:46:58 | a nosedir/xml/test_tool_componentlist |
| 30-Sep-2026 11:46:58 | a nosedir/xml/test_tool_image_subimage |
| 30-Sep-2026 11:46:58 | a nosedir/xml/test_tool_logsink |
| 30-Sep-2026 11:46:58 | a nosedir/xml/test_tool_ms |
| 30-Sep-2026 11:46:58 | a nosedir/xml/test_tool_simulator |
| 30-Sep-2026 11:46:58 | a nosedir/xml/test_tool_measures |
| 30-Sep-2026 11:46:58 | a nosedir/xml/test_tool_coordsys |
| 30-Sep-2026 11:46:58 | a nosedir/xml/test_tool_image_statistics |
| 30-Sep-2026 11:46:58 | a nosedir/xml/test_tool_image_fitprofile |
| 30-Sep-2026 11:46:58 | a nosedir/xml/test_tool_image_pv |
| 30-Sep-2026 11:46:58 | a nosedir/xml/test_tool_sdm |
| 30-Sep-2026 11:46:58 | a nosedir/xml/test_tool_agentflagger |
| 30-Sep-2026 11:46:58 | a nosedir/xml/test_tool_image_transpose |
| 30-Sep-2026 11:46:58 | a nosedir/xml/test_tool_image_collapse |
| 30-Sep-2026 11:46:58 | a nosedir/xml/test_tool_synthesisutils |
| 30-Sep-2026 11:46:58 | a nosedir/xml/test_tool_calanalysis |
| 30-Sep-2026 11:46:58 | a nosedir/xml/test_tool_vpmanager |
| 30-Sep-2026 11:46:58 | a nosedir/xml/test_tool_regionmanager |
| 30-Sep-2026 11:46:58 | a nosedir/xml/test_tool_calibrater |
| 30-Sep-2026 11:46:58 | a nosedir/xml/test_tool_quanta |
| 30-Sep-2026 11:46:58 | a nosedir/xml/test_tool_linearmosaic |
| 30-Sep-2026 11:46:58 | a nosedir/xml/test_tool_image_rebin |
| 30-Sep-2026 11:46:58 | a nosedir/xml/test_tool_sdm_toms |
| 30-Sep-2026 11:46:58 | a nosedir/xml/test_tool_image_regrid |
| 30-Sep-2026 11:46:58 | a nosedir/xml/test_tool_table |
| 30-Sep-2026 11:46:58 | a nosedir/xml/test_tool_table/nose.xml |
| 30-Sep-2026 11:46:58 | a nosedir/xml/test_tool_image_regrid/nose.xml |
| 30-Sep-2026 11:46:58 | a nosedir/xml/test_tool_sdm_toms/nose.xml |
| 30-Sep-2026 11:46:58 | a nosedir/xml/test_tool_image_rebin/nose.xml |
| 30-Sep-2026 11:46:58 | a nosedir/xml/test_tool_linearmosaic/nose.xml |
| 30-Sep-2026 11:46:58 | a nosedir/xml/test_tool_quanta/nose.xml |
| 30-Sep-2026 11:46:58 | a nosedir/xml/test_tool_calibrater/nose.xml |
| 30-Sep-2026 11:46:58 | a nosedir/xml/test_tool_regionmanager/nose.xml |
| 30-Sep-2026 11:46:58 | a nosedir/xml/test_tool_vpmanager/nose.xml |
| 30-Sep-2026 11:46:58 | a nosedir/xml/test_tool_calanalysis/nose.xml |
| 30-Sep-2026 11:46:58 | a nosedir/xml/test_tool_synthesisutils/nose.xml |
| 30-Sep-2026 11:46:58 | a nosedir/xml/test_tool_image_collapse/nose.xml |
| 30-Sep-2026 11:46:58 | a nosedir/xml/test_tool_image_transpose/nose.xml |
| 30-Sep-2026 11:46:58 | a nosedir/xml/test_tool_agentflagger/nose.xml |
| 30-Sep-2026 11:46:58 | a nosedir/xml/test_tool_sdm/nose.xml |
| 30-Sep-2026 11:46:58 | a nosedir/xml/test_tool_image_pv/nose.xml |
| 30-Sep-2026 11:46:58 | a nosedir/xml/test_tool_image_fitprofile/nose.xml |
| 30-Sep-2026 11:46:58 | a nosedir/xml/test_tool_image_statistics/nose.xml |
| 30-Sep-2026 11:46:58 | a nosedir/xml/test_tool_coordsys/nose.xml |
| 30-Sep-2026 11:46:58 | a nosedir/xml/test_tool_measures/nose.xml |
| 30-Sep-2026 11:46:58 | a nosedir/xml/test_tool_simulator/nose.xml |
| 30-Sep-2026 11:46:58 | a nosedir/xml/test_tool_ms/nose.xml |
| 30-Sep-2026 11:46:58 | a nosedir/xml/test_tool_logsink/nose.xml |
| 30-Sep-2026 11:46:58 | a nosedir/xml/test_tool_image_subimage/nose.xml |
| 30-Sep-2026 11:46:58 | a nosedir/xml/test_tool_componentlist/nose.xml |
| 30-Sep-2026 11:46:58 | a nosedir/xml/test_tool_imagepol/nose.xml |
| 30-Sep-2026 11:46:58 | a nosedir/xml/test_tool_msmetadata/nose.xml |
| 30-Sep-2026 11:46:58 | a nosedir/xml/test_tool_ms_createmultims/nose.xml |
| 30-Sep-2026 11:46:58 | a nosedir/xml/test_tool_image_pbcor/nose.xml |
| 30-Sep-2026 11:46:58 | a nosedir/xml/test_tool_ms_statwt/nose.xml |
| 30-Sep-2026 11:46:58 | a nosedir/xml/test_tool_image/nose.xml |
| 30-Sep-2026 11:46:58 | a nosedir/xml/test_tool_image_deviation/nose.xml |
| 30-Sep-2026 11:46:58 | a nosedir/xml/test_tool_msuvbinner/nose.xml |
| 30-Sep-2026 11:46:58 | a nosedir/test_tool_image_statistics/test_tool_image_statistics.py |
| 30-Sep-2026 11:46:58 | a nosedir/test_tool_image_statistics/conftest.py |
| 30-Sep-2026 11:46:58 | a nosedir/test_tool_image_statistics/short_summary.log |
| 30-Sep-2026 11:46:58 | a nosedir/test_tool_image_statistics/casa-20260930-154028.log |
| 30-Sep-2026 11:46:58 | a nosedir/test_tool_coordsys/conftest.py |
| 30-Sep-2026 11:46:58 | a nosedir/test_tool_coordsys/test_tool_coordsys.py |
| 30-Sep-2026 11:46:58 | a nosedir/test_tool_coordsys/casa-20260930-153844.log |
| 30-Sep-2026 11:46:58 | a nosedir/test_tool_coordsys/short_summary.log |
| 30-Sep-2026 11:46:58 | a nosedir/test_tool_measures/conftest.py |
| 30-Sep-2026 11:46:58 | a nosedir/test_tool_measures/casa-20260930-154026.log |
| 30-Sep-2026 11:46:58 | a nosedir/test_tool_measures/test_tool_measures.py |
| 30-Sep-2026 11:46:58 | a nosedir/test_tool_measures/short_summary.log |
| 30-Sep-2026 11:46:58 | a nosedir/test_tool_simulator/casa-20260930-154020.log |
| 30-Sep-2026 11:46:58 | a nosedir/test_tool_simulator/conftest.py |
| 30-Sep-2026 11:46:58 | a nosedir/test_tool_simulator/short_summary.log |
| 30-Sep-2026 11:46:58 | a nosedir/test_tool_simulator/test_tool_simulator.py |
| 30-Sep-2026 11:46:58 | a nosedir/test_tool_ms/conftest.py |
| 30-Sep-2026 11:46:58 | a nosedir/test_tool_ms/test_tool_ms.py |
| 30-Sep-2026 11:46:58 | a nosedir/test_tool_ms/casa-20260930-153915.log |
| 30-Sep-2026 11:46:58 | a nosedir/test_tool_ms/short_summary.log |
| 30-Sep-2026 11:46:58 | a nosedir/test_tool_logsink/conftest.py |
| 30-Sep-2026 11:46:58 | a nosedir/test_tool_logsink/test_tool_logsink.py |
| 30-Sep-2026 11:46:58 | a nosedir/test_tool_logsink/short_summary.log |
| 30-Sep-2026 11:46:58 | a nosedir/test_tool_logsink/casa-20260930-154011.log |
| 30-Sep-2026 11:46:58 | a nosedir/test_tool_image_subimage/conftest.py |
| 30-Sep-2026 11:46:58 | a nosedir/test_tool_image_subimage/casa-20260930-154655.log |
| 30-Sep-2026 11:46:58 | a nosedir/test_tool_image_subimage/short_summary.log |
| 30-Sep-2026 11:46:58 | a nosedir/test_tool_image_subimage/test_tool_image_subimage.py |
| 30-Sep-2026 11:46:58 | a nosedir/test_tool_componentlist/conftest.py |
| 30-Sep-2026 11:46:58 | a nosedir/test_tool_componentlist/test_tool_componentlist.py |
| 30-Sep-2026 11:46:58 | a nosedir/test_tool_componentlist/casa-20260930-154310.log |
| 30-Sep-2026 11:46:58 | a nosedir/test_tool_componentlist/short_summary.log |
| 30-Sep-2026 11:46:58 | a nosedir/test_tool_imagepol/conftest.py |
| 30-Sep-2026 11:46:58 | a nosedir/test_tool_imagepol/casa-20260930-154328.log |
| 30-Sep-2026 11:46:58 | a nosedir/test_tool_imagepol/short_summary.log |
| 30-Sep-2026 11:46:58 | a nosedir/test_tool_imagepol/test_tool_imagepol.py |
| 30-Sep-2026 11:46:58 | a nosedir/test_tool_msmetadata/conftest.py |
| 30-Sep-2026 11:46:58 | a nosedir/test_tool_msmetadata/casa-20260930-153951.log |
| 30-Sep-2026 11:46:58 | a nosedir/test_tool_msmetadata/test_tool_msmetadata.py |
| 30-Sep-2026 11:46:58 | a nosedir/test_tool_msmetadata/short_summary.log |
| 30-Sep-2026 11:46:58 | a nosedir/test_tool_ms_createmultims/conftest.py |
| 30-Sep-2026 11:46:58 | a nosedir/test_tool_ms_createmultims/test_tool_ms_createmultims.py |
| 30-Sep-2026 11:46:58 | a nosedir/test_tool_ms_createmultims/casa-20260930-153935.log |
| 30-Sep-2026 11:46:58 | a nosedir/test_tool_ms_createmultims/short_summary.log |
| 30-Sep-2026 11:46:58 | a nosedir/test_tool_image_pbcor/test_tool_image_pbcor.py |
| 30-Sep-2026 11:46:58 | a nosedir/test_tool_image_pbcor/conftest.py |
| 30-Sep-2026 11:46:58 | a nosedir/test_tool_image_pbcor/casa-20260930-154658.log |
| 30-Sep-2026 11:46:58 | a nosedir/test_tool_image_pbcor/short_summary.log |
| 30-Sep-2026 11:46:58 | a nosedir/test_tool_ms_statwt/conftest.py |
| 30-Sep-2026 11:46:58 | a nosedir/test_tool_ms_statwt/casa-20260930-153905.log |
| 30-Sep-2026 11:46:58 | a nosedir/test_tool_ms_statwt/short_summary.log |
| 30-Sep-2026 11:46:58 | a nosedir/test_tool_ms_statwt/test_tool_ms_statwt.py |
| 30-Sep-2026 11:46:58 | a nosedir/test_tool_image/conftest.py |
| 30-Sep-2026 11:46:58 | a nosedir/test_tool_image/test_tool_image.py |
| 30-Sep-2026 11:46:58 | a nosedir/test_tool_image/casa-20260930-153847.log |
| 30-Sep-2026 11:46:58 | a nosedir/test_tool_image/short_summary.log |
| 30-Sep-2026 11:46:58 | a nosedir/test_tool_image_deviation/conftest.py |
| 30-Sep-2026 11:46:58 | a nosedir/test_tool_image_deviation/casa-20260930-153956.log |
| 30-Sep-2026 11:46:58 | a nosedir/test_tool_image_deviation/test_tool_image_deviation.py |
| 30-Sep-2026 11:46:58 | a nosedir/test_tool_image_deviation/short_summary.log |
| 30-Sep-2026 11:46:58 | a nosedir/test_tool_msuvbinner/conftest.py |
| 30-Sep-2026 11:46:58 | a nosedir/test_tool_msuvbinner/casa-20260930-153932.log |
| 30-Sep-2026 11:46:58 | a nosedir/test_tool_msuvbinner/test_tool_msuvbinner.py |
| 30-Sep-2026 11:46:58 | a nosedir/test_tool_msuvbinner/short_summary.log |
| 30-Sep-2026 11:46:58 | Finished task 'Test wheel' with result: Success |
| 30-Sep-2026 11:46:58 | Starting task 'Parse tests' of type 'com.atlassian.bamboo.plugins.testresultparser:task.testresultparser.junit' |
| 30-Sep-2026 11:46:58 | Parsing test results under /Users/casaci/bamboohome/xml-data/build-dir/CASASPECS-DEVTESTFULLPY312122-TTAM14P... |
| 30-Sep-2026 11:46:59 | Finished task 'Parse tests' with result: Success |
| 30-Sep-2026 11:46:59 | Running post build plugin 'Docker Container Cleanup' |
| 30-Sep-2026 11:46:59 | Running post build plugin 'NCover Results Collector' |
| 30-Sep-2026 11:46:59 | Running post build plugin 'Build Results Label Collector' |
| 30-Sep-2026 11:46:59 | Running post build plugin 'Clover Results Collector' |
| 30-Sep-2026 11:46:59 | Running post build plugin 'npm Cache Cleanup' |
| 30-Sep-2026 11:46:59 | Running post build plugin 'Artifact Copier' |
| 30-Sep-2026 11:46:59 | Publishing an artifact: requirements.txt |
| 30-Sep-2026 11:46:59 | Finished publishing of artifact Non required job artifact Http Compression On : [requirements.txt], patterns: [requirements.txt] anchored at: [wheeldirectory/] in 60.06 ms |
| 30-Sep-2026 11:46:59 | Publishing an artifact: Workdir |
| 30-Sep-2026 11:46:59 | Finished publishing of artifact Non required job artifact Http Compression On : [Workdir], patterns: [work*.tar.gz] anchored at: [wheeldirectory/] in 30.70 ms |
| 30-Sep-2026 11:46:59 | Finalising the build... |
| 30-Sep-2026 11:46:59 | Stopping timer. |
| 30-Sep-2026 11:46:59 | Build CASASPECS-DEVTESTFULLPY312122-TTAM14P-1 completed. |
| 30-Sep-2026 11:46:59 | Running on server: post build plugin 'Build Hanging Detection Configuration' |
| 30-Sep-2026 11:46:59 | Running on server: post build plugin 'NCover Results Collector' |
| 30-Sep-2026 11:46:59 | Running on server: post build plugin 'Build Labeller' |
| 30-Sep-2026 11:46:59 | Running on server: post build plugin 'Clover Delta Calculator' |
| 30-Sep-2026 11:46:59 | Running on server: post build plugin 'Maven Dependencies Postprocessor' |
| 30-Sep-2026 11:46:59 | All post build plugins have finished |
| 30-Sep-2026 11:46:59 | Generating build results summary... |
| 30-Sep-2026 11:47:00 | Saving build results to disk... |
| 30-Sep-2026 11:47:00 | Store variable context... |
| 30-Sep-2026 11:47:00 | Finished building CASASPECS-DEVTESTFULLPY312122-TTAM14P-1. |