Build: #1 did not complete

Job: Test Tasks macOS 15 Py3.12 did not complete

Build log

The build generated 24,033 lines of output.   The output is too long and has been truncated to the last 1,000 lines. Download or view full build log. You can find logs from previous runs here.

02-Sep-2026 19:37:15 2026-09-02 23:37:16        WARN        SynthesisParamsImage::fromRecord (file /Users/casaci/bamboohome/xml-data/build-dir/CASASPECS-DBC248-BPO15AP312/casa6/casatools/src/code/synthesis/ImagerObjects/SynthesisUtilMethods.cc, line 2482)        imsize with 350 pixels is not an efficient imagesize. Try 360 instead.
02-Sep-2026 19:37:15 2026-09-02 23:37:16        WARN        SynthesisParamsImage::fromRecord (file /Users/casaci/bamboohome/xml-data/build-dir/CASASPECS-DBC248-BPO15AP312/casa6/casatools/src/code/synthesis/ImagerObjects/SynthesisUtilMethods.cc, line 2482)        imsize with 280 pixels is not an efficient imagesize. Try 288 instead.
02-Sep-2026 19:37:17 2026-09-02 23:37:17        WARN        tclean::::casa        Warning! Non-zero values at the edge of the .pb image can cause unexpected aliasing effects! (found value 0.8712907433509827 at index [np.int64(346), np.int64(140), np.int64(0), np.int64(1)])
02-Sep-2026 19:37:17 2026-09-02 23:37:17        WARN        SynthesisParamsImage::fromRecord (file /Users/casaci/bamboohome/xml-data/build-dir/CASASPECS-DBC248-BPO15AP312/casa6/casatools/src/code/synthesis/ImagerObjects/SynthesisUtilMethods.cc, line 2482)        imsize with 350 pixels is not an efficient imagesize. Try 360 instead.
02-Sep-2026 19:37:17 2026-09-02 23:37:17        WARN        SynthesisParamsImage::fromRecord (file /Users/casaci/bamboohome/xml-data/build-dir/CASASPECS-DBC248-BPO15AP312/casa6/casatools/src/code/synthesis/ImagerObjects/SynthesisUtilMethods.cc, line 2482)        imsize with 280 pixels is not an efficient imagesize. Try 288 instead.
02-Sep-2026 19:37:18 2026-09-02 23:37:18        WARN        task_tclean::SIImageStore::restore (file /Users/casaci/bamboohome/xml-data/build-dir/CASASPECS-DBC248-BPO15AP312/casa6/casatools/src/code/synthesis/ImagerObjects/SIImageStore.cc, line 2353)        Restoring with an empty model image. Only residuals will be processed to form the output restored image.
02-Sep-2026 19:37:18 test_task_tclean.py::test_mosaic_cube::test_mosaic_briggsbwtaper
02-Sep-2026 19:37:18 PASSED
02-Sep-2026 19:37:18
02-Sep-2026 19:37:18 2026-09-02 23:37:19        WARN        SynthesisParamsImage::fromRecord (file /Users/casaci/bamboohome/xml-data/build-dir/CASASPECS-DBC248-BPO15AP312/casa6/casatools/src/code/synthesis/ImagerObjects/SynthesisUtilMethods.cc, line 2482)        imsize with 420 pixels is not an efficient imagesize. Try 432 instead.
02-Sep-2026 19:37:18 2026-09-02 23:37:19        WARN        SynthesisParamsImage::fromRecord (file /Users/casaci/bamboohome/xml-data/build-dir/CASASPECS-DBC248-BPO15AP312/casa6/casatools/src/code/synthesis/ImagerObjects/SynthesisUtilMethods.cc, line 2482)        imsize with 420 pixels is not an efficient imagesize. Try 432 instead.
02-Sep-2026 19:37:19 2026-09-02 23:37:19        WARN        task_tclean::SynthesisParamsImage::fromRecord (file /Users/casaci/bamboohome/xml-data/build-dir/CASASPECS-DBC248-BPO15AP312/casa6/casatools/src/code/synthesis/ImagerObjects/SynthesisUtilMethods.cc, line 2482)        imsize with 420 pixels is not an efficient imagesize. Try 432 instead.
02-Sep-2026 19:37:20 2026-09-02 23:37:20        WARN        task_tclean::SIImageStore::restore (file /Users/casaci/bamboohome/xml-data/build-dir/CASASPECS-DBC248-BPO15AP312/casa6/casatools/src/code/synthesis/ImagerObjects/SIImageStore.cc, line 2353)        Restoring with an empty model image. Only residuals will be processed to form the output restored image.
02-Sep-2026 19:37:20 test_task_tclean.py::test_ephemeris::test_multifield_cube_eph
02-Sep-2026 19:37:20 [ephemeris] test_multifield_cube_eph : multifield (mosaic gridder), cubesource mode 
02-Sep-2026 19:37:20 PASSED
02-Sep-2026 19:37:20
02-Sep-2026 19:37:20 2026-09-02 23:37:21        WARN        SynthesisParamsImage::fromRecord (file /Users/casaci/bamboohome/xml-data/build-dir/CASASPECS-DBC248-BPO15AP312/casa6/casatools/src/code/synthesis/ImagerObjects/SynthesisUtilMethods.cc, line 2482)        imsize with 420 pixels is not an efficient imagesize. Try 432 instead.
02-Sep-2026 19:37:20 2026-09-02 23:37:21        WARN        SynthesisParamsImage::fromRecord (file /Users/casaci/bamboohome/xml-data/build-dir/CASASPECS-DBC248-BPO15AP312/casa6/casatools/src/code/synthesis/ImagerObjects/SynthesisUtilMethods.cc, line 2482)        imsize with 420 pixels is not an efficient imagesize. Try 432 instead.
02-Sep-2026 19:37:23 2026-09-02 23:37:24        WARN        task_tclean::SynthesisParamsImage::fromRecord (file /Users/casaci/bamboohome/xml-data/build-dir/CASASPECS-DBC248-BPO15AP312/casa6/casatools/src/code/synthesis/ImagerObjects/SynthesisUtilMethods.cc, line 2482)        imsize with 420 pixels is not an efficient imagesize. Try 432 instead.
02-Sep-2026 19:37:25 2026-09-02 23:37:26        WARN        task_tclean::SIImageStore::restore (file /Users/casaci/bamboohome/xml-data/build-dir/CASASPECS-DBC248-BPO15AP312/casa6/casatools/src/code/synthesis/ImagerObjects/SIImageStore.cc, line 2353)        Restoring with an empty model image. Only residuals will be processed to form the output restored image.
02-Sep-2026 19:37:26 test_task_tclean.py::test_ephemeris::test_multifield_cube_exttab_eph
02-Sep-2026 19:37:26 [ephemeris] test_multifield_cube_eph : multifield (mosaic gridder), cubesource mode 
02-Sep-2026 19:37:26 PASSED
02-Sep-2026 19:37:26
02-Sep-2026 19:37:26 2026-09-02 23:37:27        WARN        SynthesisParamsImage::fromRecord (file /Users/casaci/bamboohome/xml-data/build-dir/CASASPECS-DBC248-BPO15AP312/casa6/casatools/src/code/synthesis/ImagerObjects/SynthesisUtilMethods.cc, line 2482)        imsize with 420 pixels is not an efficient imagesize. Try 432 instead.
02-Sep-2026 19:37:27 2026-09-02 23:37:28        WARN        task_tclean::SIImageStore::restore (file /Users/casaci/bamboohome/xml-data/build-dir/CASASPECS-DBC248-BPO15AP312/casa6/casatools/src/code/synthesis/ImagerObjects/SIImageStore.cc, line 2353)        Restoring with an empty model image. Only residuals will be processed to form the output restored image.
02-Sep-2026 19:37:27 test_task_tclean.py::test_ephemeris::test_multifield_mfs_eph
02-Sep-2026 19:37:27 [ephemeris] test_multifield_mfs_eph : multifield (mosaic gridder), mfs mode 
02-Sep-2026 19:37:27 PASSED
02-Sep-2026 19:37:27
02-Sep-2026 19:37:28 2026-09-02 23:37:28        WARN        SynthesisParamsImage::fromRecord (file /Users/casaci/bamboohome/xml-data/build-dir/CASASPECS-DBC248-BPO15AP312/casa6/casatools/src/code/synthesis/ImagerObjects/SynthesisUtilMethods.cc, line 2482)        imsize with 420 pixels is not an efficient imagesize. Try 432 instead.
02-Sep-2026 19:37:29 2026-09-02 23:37:29        WARN        task_tclean::SIImageStore::restore (file /Users/casaci/bamboohome/xml-data/build-dir/CASASPECS-DBC248-BPO15AP312/casa6/casatools/src/code/synthesis/ImagerObjects/SIImageStore.cc, line 2353)        Restoring with an empty model image. Only residuals will be processed to form the output restored image.
02-Sep-2026 19:37:29 test_task_tclean.py::test_ephemeris::test_multifield_mfs_exttab_eph
02-Sep-2026 19:37:29 [ephemeris] test_multifield_mfs_eph : multifield (mosaic gridder), mfs mode 
02-Sep-2026 19:37:29 PASSED
02-Sep-2026 19:37:29
02-Sep-2026 19:37:29 2026-09-02 23:37:30        WARN        task_tclean::SIImageStore::restore (file /Users/casaci/bamboohome/xml-data/build-dir/CASASPECS-DBC248-BPO15AP312/casa6/casatools/src/code/synthesis/ImagerObjects/SIImageStore.cc, line 2353)        Restoring with an empty model image. Only residuals will be processed to form the output restored image.
02-Sep-2026 19:37:29 test_task_tclean.py::test_ephemeris::test_onefield_cube_eph
02-Sep-2026 19:37:29 [ephemeris] test_onefield_cube_eph : single field (standard gridder), cubesource mode 
02-Sep-2026 19:37:29 PASSED
02-Sep-2026 19:37:29
02-Sep-2026 19:37:30 2026-09-02 23:37:30        WARN        task_tclean::SIImageStore::restore (file /Users/casaci/bamboohome/xml-data/build-dir/CASASPECS-DBC248-BPO15AP312/casa6/casatools/src/code/synthesis/ImagerObjects/SIImageStore.cc, line 2353)        Restoring with an empty model image. Only residuals will be processed to form the output restored image.
02-Sep-2026 19:37:30 test_task_tclean.py::test_ephemeris::test_onefield_cube_exttab_eph
02-Sep-2026 19:37:30 [ephemeris] test_onefield_cube_exttab_eph : single field (standard gridder), cubesource mode using an external epehemeris table
02-Sep-2026 19:37:30 PASSED
02-Sep-2026 19:37:30
02-Sep-2026 19:37:30 2026-09-02 23:37:31        WARN        task_tclean::SIImageStore::restore (file /Users/casaci/bamboohome/xml-data/build-dir/CASASPECS-DBC248-BPO15AP312/casa6/casatools/src/code/synthesis/ImagerObjects/SIImageStore.cc, line 2353)        Restoring with an empty model image. Only residuals will be processed to form the output restored image.
02-Sep-2026 19:37:30 test_task_tclean.py::test_ephemeris::test_onefield_mfs_eph
02-Sep-2026 19:37:30 [ephemeris] test_onefield_mfs_eph : single field (standard gridder), mfs mode 
02-Sep-2026 19:37:30 PASSED
02-Sep-2026 19:37:30
02-Sep-2026 19:37:31 2026-09-02 23:37:31        WARN        task_tclean::SIImageStore::restore (file /Users/casaci/bamboohome/xml-data/build-dir/CASASPECS-DBC248-BPO15AP312/casa6/casatools/src/code/synthesis/ImagerObjects/SIImageStore.cc, line 2353)        Restoring with an empty model image. Only residuals will be processed to form the output restored image.
02-Sep-2026 19:37:31 test_task_tclean.py::test_ephemeris::test_onefield_mfs_eph_internaltb_outside
02-Sep-2026 19:37:31 [ephemeris] test_onefield_mfs_eph_internaltb_outside: single field (standard gridder), mfs mode with explicitly specifying internal ephem table moved to outside
02-Sep-2026 19:37:31 PASSED
02-Sep-2026 19:37:31
02-Sep-2026 19:37:31 2026-09-02 23:37:32        WARN        task_tclean::SIImageStore::restore (file /Users/casaci/bamboohome/xml-data/build-dir/CASASPECS-DBC248-BPO15AP312/casa6/casatools/src/code/synthesis/ImagerObjects/SIImageStore.cc, line 2353)        Restoring with an empty model image. Only residuals will be processed to form the output restored image.
02-Sep-2026 19:37:31 test_task_tclean.py::test_ephemeris::test_onefield_mfs_exttab_eph
02-Sep-2026 19:37:31 [ephemeris] test_onefield_mfs_exttab_eph: single field (standard gridder), mfs mode using an external ephemeris table
02-Sep-2026 19:37:31 PASSED
02-Sep-2026 19:37:31
02-Sep-2026 19:37:31 2026-09-02 23:37:32        WARN        SynthesisParamsImage::fromRecord (file /Users/casaci/bamboohome/xml-data/build-dir/CASASPECS-DBC248-BPO15AP312/casa6/casatools/src/code/synthesis/ImagerObjects/SynthesisUtilMethods.cc, line 2482)        imsize with 98 pixels is not an efficient imagesize. Try 100 instead.
02-Sep-2026 19:37:31 2026-09-02 23:37:32        SEVERE        tclean::::casa        Task tclean raised an exception of class RuntimeError with the following message: Invalid Image Parameter set : Invalid Frequency Frame fail_!
02-Sep-2026 19:37:31 test_task_tclean.py::test_errors_failures::test_bad_freqframe_define_image
02-Sep-2026 19:37:31 test_bad_freqframe: produce exception in initializeImagers/defineImage
02-Sep-2026 19:37:31
02-Sep-2026 19:37:31 File ".../__casac__/synthesisimager.py", line 180, in defineimage
02-Sep-2026 19:37:31   return _synthesisimager.synthesisimager_defineimage(self, *args, **kwargs)
02-Sep-2026 19:37:31 RuntimeError: Invalid Image Parameter set : Invalid Frequency Frame fail_!
02-Sep-2026 19:37:31 PASSED
02-Sep-2026 19:37:31
02-Sep-2026 19:37:32 2026-09-02 23:37:32        SEVERE        task_tclean::FTMachine::initMaps        number of pixels 6 on x axis is smaller that the gridding support 6 Please use a larger value
02-Sep-2026 19:37:32 2026-09-02 23:37:32        WARN        task_tclean::SynthesisImagerVi2::CubeMajorCycle (file /Users/casaci/bamboohome/xml-data/build-dir/CASASPECS-DBC248-BPO15AP312/casa6/casatools/src/code/synthesis/ImagerObjects/CubeMajorCycleAlgorithm.cc, line 353)        Exception for chan range [0, 9] ---   Error in making PSF : 2026-09-02 23:37:32        SEVERE        task_tclean::FTMachine::initMaps        number of pixels 6 on x axis is smaller that the gridding support 6 Please use a larger value
02-Sep-2026 19:37:32 ##################################
02-Sep-2026 19:37:32 #############################
02-Sep-2026 19:37:32 Exception: Error in making PSF : 2026-09-02 23:37:32        SEVERE        task_tclean::FTMachine::initMaps        number of pixels 6 on x axis is smaller that the gridding support 6 Please use a larger value
02-Sep-2026 19:37:32 2026-09-02 23:37:32        SEVERE        task_tclean::SynthesisImagerVi2::runCubeGridding (file /Users/casaci/bamboohome/xml-data/build-dir/CASASPECS-DBC248-BPO15AP312/casa6/casatools/src/code/synthesis/ImagerObjects/SynthesisImagerVi2.cc, line 1694)        remainder rank 0 failed
02-Sep-2026 19:37:32 2026-09-02 23:37:32        SEVERE        tclean::::casa        Task tclean raised an exception of class RuntimeError with the following message: Error in making PSF : One or more  of the cube section failed in de/gridding. Return values for the sections: [0]
02-Sep-2026 19:37:32 test_task_tclean.py::test_errors_failures::test_error_gridding
02-Sep-2026 19:37:32 test_error_gridding: produces exception in gridding
02-Sep-2026 19:37:32
02-Sep-2026 19:37:32 One way to make gridding fail is to give imsize=3,4, etc. This fails like:
02-Sep-2026 19:37:32 RuntimeError: Error in making PSF : One or more  of the cube section failed in de/gridding. Return values for the sections: [0]
02-Sep-2026 19:37:32 With a preceding SEVERE error messages:
02-Sep-2026 19:37:32
02-Sep-2026 19:37:32 SEVERE  task_tclean::FTMachine::initMaps  number of pixels 6 on x axis is smaller that the gridding support 6 Please use a larger value
02-Sep-2026 19:37:32 SEVERE  task_tclean::CubeMajorCycleAlgorithm::task (file .../code/synthesis/ImagerObjects/CubeMajorCycleAlgorithm.cc, line 136) Exception: Error in making PSF :
02-Sep-2026 19:37:32 SEVERE  task_tclean::FTMachine::initMapsnumber of pixels 6 on x axis is smaller that the gridding support 6 Please use a larger value
02-Sep-2026 19:37:32 PASSED
02-Sep-2026 19:37:32
02-Sep-2026 19:37:32 2026-09-02 23:37:32        WARN                Field Expression: Found out-of-range index(s) in the list (33 ) [TIP: Double-quoted strings forces name matching]
02-Sep-2026 19:37:32 2026-09-02 23:37:32        SEVERE        tclean::::casa        Task tclean raised an exception of class RuntimeError with the following message: Error in selectData() : Field Expression: Partial or no match for Field ID list [33]
02-Sep-2026 19:37:32 2026-09-02 23:37:32        SEVERE        tclean::::casa+        (near char. 2 in string "33")
02-Sep-2026 19:37:32 test_task_tclean.py::test_errors_failures::test_wrong_field_select_data
02-Sep-2026 19:37:32 test_wrong_field: should produce exception in selectData.
02-Sep-2026 19:37:32
02-Sep-2026 19:37:32 Exception like:
02-Sep-2026 19:37:32   RuntimeError: Error in selectData() : Field Expression: Partial or no match for Field ID list [33]
02-Sep-2026 19:37:32 PASSED
02-Sep-2026 19:37:32
02-Sep-2026 19:37:32 2026-09-02 23:37:32        SEVERE        tclean::::casa        Task tclean raised an exception of class RuntimeError with the following message: Error in selectData() : Spw Expression: No match found for 33,
02-Sep-2026 19:37:32 test_task_tclean.py::test_errors_failures::test_wrong_spw_select_data
02-Sep-2026 19:37:32 test_wrong_spw: should produce exception in selectData.
02-Sep-2026 19:37:32
02-Sep-2026 19:37:32 Should throw something like
02-Sep-2026 19:37:32 RuntimeError: Error in selectData() : Spw Expression: No match found for 33,
02-Sep-2026 19:37:32 PASSED
02-Sep-2026 19:37:32
02-Sep-2026 19:37:32 2026-09-02 23:37:33        WARN        SynthesisParamsImage::buildCoordinateSystem (file /Users/casaci/bamboohome/xml-data/build-dir/CASASPECS-DBC248-BPO15AP312/casa6/casatools/src/code/synthesis/ImagerObjects/SynthesisUtilMethods.cc, line 2861)        No rest frequency info, using the center of the selected spw(s):1.475e+09 Hz. Velocity labelling may not be correct.
02-Sep-2026 19:37:34 test_task_tclean.py::test_gclean::test_gclean_threeiter
02-Sep-2026 19:37:34 test_gclean_threeiter: test the the gclean generator runs for at least three iterations
02-Sep-2026 19:37:34 Running initial major cycle to create first residual image.
02-Sep-2026 19:37:34 PASSED
02-Sep-2026 19:37:34
02-Sep-2026 19:37:34 - generated xml file: /Users/casaci/bamboohome/xml-data/build-dir/CASASPECS-DEVTESTFULLPY312110-TTAAM14P/casa6/casatestutils/nosedir/xml/test_task_tclean/nose.xml -
02-Sep-2026 19:37:34 =========================== short test summary info ============================
02-Sep-2026 19:37:34 SKIPPED [1] test_task_tclean.py:3331: Skip until we can check why the model column is empty in all channels, after the tclean run. May need new ticket.
02-Sep-2026 19:37:34 SKIPPED [1] test_task_tclean.py:3559: Skip test.
02-Sep-2026 19:37:34 SKIPPED [1] test_task_tclean.py:3457: Skip. This test deprecated. no longer need mtmfs for cube use msclean
02-Sep-2026 19:37:34 SKIPPED [1] test_task_tclean.py:3248: Skip until we can figure out what causes the common bean difference between the local runs and bamboo runs for reim_point_linRL.ms
02-Sep-2026 19:37:34 SKIPPED [1] test_task_tclean.py:3466: Skip. This test deprecated. no longer need mtmfs for cube use msclean
02-Sep-2026 19:37:34 SKIPPED [1] test_task_tclean.py:3715: Skip test.
02-Sep-2026 19:37:34 SKIPPED [1] test_task_tclean.py:3720: Skip test.
02-Sep-2026 19:37:34 SKIPPED [1] test_task_tclean.py:3725: Skip test.
02-Sep-2026 19:37:34 SKIPPED [1] test_task_tclean.py:3710: Skip test.
02-Sep-2026 19:37:34 SKIPPED [1] test_task_tclean.py:4228: Not correct GPU or MPI is not compatible with hpg
02-Sep-2026 19:37:34 SKIPPED [1] test_task_tclean.py:4391: Not Correct GPU or MPI is not compatible with hpg
02-Sep-2026 19:37:34 SKIPPED [1] test_task_tclean.py:4344: Not Correct GPU or MPI is not compatible with hpg
02-Sep-2026 19:37:34 SKIPPED [1] test_task_tclean.py:4483: Not correct GPU or MPI is not compatible with hpg
02-Sep-2026 19:37:34 SKIPPED [1] test_task_tclean.py:5152: Skip the test temporarily
02-Sep-2026 19:37:34 SKIPPED [1] test_task_tclean.py:5382: mfs+mtmfs+pbcor no longer recommended
02-Sep-2026 19:37:34 SKIPPED [1] test_task_tclean.py:5914: Skip test due to unexplained bamboo errors. Manual tests run correctly. See CAS-13530 for history.
02-Sep-2026 19:37:34 SKIPPED [1] test_task_tclean.py:5823: Skip test due to unexplained bamboo errors. Manual tests run correctly. See CAS-13530 for history.
02-Sep-2026 19:37:34 =========== 324 passed, 17 skipped, 1 warning in 2393.75s (0:39:53) ============
02-Sep-2026 19:37:34 ============================= test session starts ==============================
02-Sep-2026 19:37:34 platform darwin -- Python 3.12.8, pytest-9.1.1, pluggy-1.6.0 -- /Users/casaci/bamboohome/xml-data/build-dir/CASASPECS-DEVTESTFULLPY312110-TTAAM14P/casa6testenv/bin/python
02-Sep-2026 19:37:34 cachedir: .pytest_cache
02-Sep-2026 19:37:34 rootdir: /Users/casaci/bamboohome/xml-data/build-dir/CASASPECS-DEVTESTFULLPY312110-TTAAM14P/casa6/casatestutils/nosedir/test_task_imcontsub
02-Sep-2026 19:37:34 configfile: pytest.ini
02-Sep-2026 19:37:38 collecting ... collected 10 items
02-Sep-2026 19:37:38
02-Sep-2026 19:37:38
02-Sep-2026 19:37:38 2026-09-02 23:37:39        WARN        imcontsub::::casa        The linefile parameter is empty, consequently the spectral line image will NOT be
02-Sep-2026 19:37:38 2026-09-02 23:37:39        WARN        imcontsub::::casa+        saved on disk.
02-Sep-2026 19:37:38 2026-09-02 23:37:39        WARN        imcontsub::::casa        The contfile parameter is empty, consequently the continuum image will NOT be
02-Sep-2026 19:37:38 2026-09-02 23:37:39        WARN        imcontsub::::casa+        saved on disk.
02-Sep-2026 19:37:38 2026-09-02 23:37:39        SEVERE        CasacRegionManager::_fromBCS        blc in box spec is less than 0
02-Sep-2026 19:37:38 2026-09-02 23:37:39        SEVERE        regionmanager::frombcs        Exception Reported: 2026-09-02 23:37:39        SEVERE        CasacRegionManager::_fromBCS        blc in box spec is less than 0
02-Sep-2026 19:37:38 2026-09-02 23:37:39        SEVERE        imcontsub::::casa        Task imcontsub raised an exception of class RuntimeError with the following message: 2026-09-02 23:37:39        SEVERE        CasacRegionManager::_fromBCS        blc in box spec is less than 0
02-Sep-2026 19:37:38 2026-09-02 23:37:39        WARN        imcontsub::::casa        The linefile parameter is empty, consequently the spectral line image will NOT be
02-Sep-2026 19:37:38 2026-09-02 23:37:39        WARN        imcontsub::::casa+        saved on disk.
02-Sep-2026 19:37:38 2026-09-02 23:37:39        WARN        imcontsub::::casa        The contfile parameter is empty, consequently the continuum image will NOT be
02-Sep-2026 19:37:38 2026-09-02 23:37:39        WARN        imcontsub::::casa+        saved on disk.
02-Sep-2026 19:37:38 2026-09-02 23:37:39        SEVERE        CasacRegionManager::_fromBCS        blc in box spec is less than 0
02-Sep-2026 19:37:38 2026-09-02 23:37:39        SEVERE        regionmanager::frombcs        Exception Reported: 2026-09-02 23:37:39        SEVERE        CasacRegionManager::_fromBCS        blc in box spec is less than 0
02-Sep-2026 19:37:38 2026-09-02 23:37:39        SEVERE        imcontsub::::casa        Task imcontsub raised an exception of class RuntimeError with the following message: 2026-09-02 23:37:39        SEVERE        CasacRegionManager::_fromBCS        blc in box spec is less than 0
02-Sep-2026 19:37:38 2026-09-02 23:37:39        WARN        imcontsub::::casa        The linefile parameter is empty, consequently the spectral line image will NOT be
02-Sep-2026 19:37:38 2026-09-02 23:37:39        WARN        imcontsub::::casa+        saved on disk.
02-Sep-2026 19:37:38 2026-09-02 23:37:39        WARN        imcontsub::::casa        The contfile parameter is empty, consequently the continuum image will NOT be
02-Sep-2026 19:37:38 2026-09-02 23:37:39        WARN        imcontsub::::casa+        saved on disk.
02-Sep-2026 19:37:38 2026-09-02 23:37:39        SEVERE        CasacRegionManager::_fromBCS        blc in box spec is less than 0
02-Sep-2026 19:37:38 2026-09-02 23:37:39        SEVERE        regionmanager::frombcs        Exception Reported: 2026-09-02 23:37:39        SEVERE        CasacRegionManager::_fromBCS        blc in box spec is less than 0
02-Sep-2026 19:37:38 2026-09-02 23:37:39        SEVERE        imcontsub::::casa        Task imcontsub raised an exception of class RuntimeError with the following message: 2026-09-02 23:37:39        SEVERE        CasacRegionManager::_fromBCS        blc in box spec is less than 0
02-Sep-2026 19:37:38 2026-09-02 23:37:39        WARN        imcontsub::::casa        The linefile parameter is empty, consequently the spectral line image will NOT be
02-Sep-2026 19:37:38 2026-09-02 23:37:39        WARN        imcontsub::::casa+        saved on disk.
02-Sep-2026 19:37:38 2026-09-02 23:37:39        WARN        imcontsub::::casa        The contfile parameter is empty, consequently the continuum image will NOT be
02-Sep-2026 19:37:38 2026-09-02 23:37:39        WARN        imcontsub::::casa+        saved on disk.
02-Sep-2026 19:37:38 2026-09-02 23:37:39        SEVERE        CasacRegionManager::_fromBCS        blc in box spec is less than 0
02-Sep-2026 19:37:38 2026-09-02 23:37:39        SEVERE        regionmanager::frombcs        Exception Reported: 2026-09-02 23:37:39        SEVERE        CasacRegionManager::_fromBCS        blc in box spec is less than 0
02-Sep-2026 19:37:38 2026-09-02 23:37:39        SEVERE        imcontsub::::casa        Task imcontsub raised an exception of class RuntimeError with the following message: 2026-09-02 23:37:39        SEVERE        CasacRegionManager::_fromBCS        blc in box spec is less than 0
02-Sep-2026 19:37:38 2026-09-02 23:37:39        WARN        imcontsub::::casa        The linefile parameter is empty, consequently the spectral line image will NOT be
02-Sep-2026 19:37:38 2026-09-02 23:37:39        WARN        imcontsub::::casa+        saved on disk.
02-Sep-2026 19:37:38 2026-09-02 23:37:39        WARN        imcontsub::::casa        The contfile parameter is empty, consequently the continuum image will NOT be
02-Sep-2026 19:37:38 2026-09-02 23:37:39        WARN        imcontsub::::casa+        saved on disk.
02-Sep-2026 19:37:38 2026-09-02 23:37:39        SEVERE        CasacRegionManager::_fromBCS        trc in box spec is greater than or equal to number of direction coordinate pixels in the image
02-Sep-2026 19:37:38 2026-09-02 23:37:39        SEVERE        regionmanager::frombcs        Exception Reported: 2026-09-02 23:37:39        SEVERE        CasacRegionManager::_fromBCS        trc in box spec is greater than or equal to number of direction coordinate pixels in the image
02-Sep-2026 19:37:38 2026-09-02 23:37:39        SEVERE        imcontsub::::casa        Task imcontsub raised an exception of class RuntimeError with the following message: 2026-09-02 23:37:39        SEVERE        CasacRegionManager::_fromBCS        trc in box spec is greater than or equal to number of direction coordinate pixels in the image
02-Sep-2026 19:37:38 2026-09-02 23:37:39        WARN        imcontsub::::casa        The linefile parameter is empty, consequently the spectral line image will NOT be
02-Sep-2026 19:37:38 2026-09-02 23:37:39        WARN        imcontsub::::casa+        saved on disk.
02-Sep-2026 19:37:38 2026-09-02 23:37:39        WARN        imcontsub::::casa        The contfile parameter is empty, consequently the continuum image will NOT be
02-Sep-2026 19:37:38 2026-09-02 23:37:39        WARN        imcontsub::::casa+        saved on disk.
02-Sep-2026 19:37:38 2026-09-02 23:37:39        SEVERE        CasacRegionManager::_fromBCS        trc in box spec is greater than or equal to number of direction coordinate pixels in the image
02-Sep-2026 19:37:38 2026-09-02 23:37:39        SEVERE        regionmanager::frombcs        Exception Reported: 2026-09-02 23:37:39        SEVERE        CasacRegionManager::_fromBCS        trc in box spec is greater than or equal to number of direction coordinate pixels in the image
02-Sep-2026 19:37:38 2026-09-02 23:37:39        SEVERE        imcontsub::::casa        Task imcontsub raised an exception of class RuntimeError with the following message: 2026-09-02 23:37:39        SEVERE        CasacRegionManager::_fromBCS        trc in box spec is greater than or equal to number of direction coordinate pixels in the image
02-Sep-2026 19:37:38 2026-09-02 23:37:39        WARN        imcontsub::::casa        The linefile parameter is empty, consequently the spectral line image will NOT be
02-Sep-2026 19:37:38 2026-09-02 23:37:39        WARN        imcontsub::::casa+        saved on disk.
02-Sep-2026 19:37:38 2026-09-02 23:37:39        WARN        imcontsub::::casa        The contfile parameter is empty, consequently the continuum image will NOT be
02-Sep-2026 19:37:38 2026-09-02 23:37:39        WARN        imcontsub::::casa+        saved on disk.
02-Sep-2026 19:37:38 2026-09-02 23:37:39        SEVERE        CasacRegionManager::_fromBCS        trc in box spec is greater than or equal to number of direction coordinate pixels in the image
02-Sep-2026 19:37:38 2026-09-02 23:37:39        SEVERE        regionmanager::frombcs        Exception Reported: 2026-09-02 23:37:39        SEVERE        CasacRegionManager::_fromBCS        trc in box spec is greater than or equal to number of direction coordinate pixels in the image
02-Sep-2026 19:37:38 2026-09-02 23:37:39        SEVERE        imcontsub::::casa        Task imcontsub raised an exception of class RuntimeError with the following message: 2026-09-02 23:37:39        SEVERE        CasacRegionManager::_fromBCS        trc in box spec is greater than or equal to number of direction coordinate pixels in the image
02-Sep-2026 19:37:38 2026-09-02 23:37:39        WARN        imcontsub::::casa        The linefile parameter is empty, consequently the spectral line image will NOT be
02-Sep-2026 19:37:38 2026-09-02 23:37:39        WARN        imcontsub::::casa+        saved on disk.
02-Sep-2026 19:37:38 2026-09-02 23:37:39        WARN        imcontsub::::casa        The contfile parameter is empty, consequently the continuum image will NOT be
02-Sep-2026 19:37:38 2026-09-02 23:37:39        WARN        imcontsub::::casa+        saved on disk.
02-Sep-2026 19:37:38 2026-09-02 23:37:39        SEVERE        CasacRegionManager::_fromBCS        trc in box spec is greater than or equal to number of direction coordinate pixels in the image
02-Sep-2026 19:37:38 2026-09-02 23:37:39        SEVERE        regionmanager::frombcs        Exception Reported: 2026-09-02 23:37:39        SEVERE        CasacRegionManager::_fromBCS        trc in box spec is greater than or equal to number of direction coordinate pixels in the image
02-Sep-2026 19:37:38 2026-09-02 23:37:39        SEVERE        imcontsub::::casa        Task imcontsub raised an exception of class RuntimeError with the following message: 2026-09-02 23:37:39        SEVERE        CasacRegionManager::_fromBCS        trc in box spec is greater than or equal to number of direction coordinate pixels in the image
02-Sep-2026 19:37:38 test_task_imcontsub.py::imcontsub_test::test_bad_box
02-Sep-2026 19:37:38 Test bad box parameter causes failure
02-Sep-2026 19:37:38 PASSED
02-Sep-2026 19:37:38
02-Sep-2026 19:37:38 2026-09-02 23:37:39        WARN        imcontsub::::casa        The linefile parameter is empty, consequently the spectral line image will NOT be
02-Sep-2026 19:37:38 2026-09-02 23:37:39        WARN        imcontsub::::casa+        saved on disk.
02-Sep-2026 19:37:38 2026-09-02 23:37:39        WARN        imcontsub::::casa        The contfile parameter is empty, consequently the continuum image will NOT be
02-Sep-2026 19:37:38 2026-09-02 23:37:39        WARN        imcontsub::::casa+        saved on disk.
02-Sep-2026 19:37:38 2026-09-02 23:37:39        SEVERE        regionmanager::selectedchannels        Exception Reported: Invalid channel specification in -5 of spec -5 at File: /Users/casaci/bamboohome/xml-data/build-dir/CASASPECS-DBC248-BPO15AP312/casa6/casatools/src/code/imageanalysis/IO/ParameterParser.cc, line: 176
02-Sep-2026 19:37:38 2026-09-02 23:37:39        SEVERE        imcontsub::::casa        Task imcontsub raised an exception of class RuntimeError with the following message: Invalid channel specification in -5 of spec -5 at File: /Users/casaci/bamboohome/xml-data/build-dir/CASASPECS-DBC248-BPO15AP312/casa6/casatools/src/code/imageanalysis/IO/ParameterParser.cc, line: 176
02-Sep-2026 19:37:38 2026-09-02 23:37:39        WARN        imcontsub::::casa        The linefile parameter is empty, consequently the spectral line image will NOT be
02-Sep-2026 19:37:38 2026-09-02 23:37:39        WARN        imcontsub::::casa+        saved on disk.
02-Sep-2026 19:37:38 2026-09-02 23:37:39        WARN        imcontsub::::casa        The contfile parameter is empty, consequently the continuum image will NOT be
02-Sep-2026 19:37:38 2026-09-02 23:37:39        WARN        imcontsub::::casa+        saved on disk.
02-Sep-2026 19:37:38 2026-09-02 23:37:39        SEVERE        regionmanager::selectedchannels        Exception Reported: Invalid channel specification in -2 of spec -2 at File: /Users/casaci/bamboohome/xml-data/build-dir/CASASPECS-DBC248-BPO15AP312/casa6/casatools/src/code/imageanalysis/IO/ParameterParser.cc, line: 176
02-Sep-2026 19:37:38 2026-09-02 23:37:39        SEVERE        imcontsub::::casa        Task imcontsub raised an exception of class RuntimeError with the following message: Invalid channel specification in -2 of spec -2 at File: /Users/casaci/bamboohome/xml-data/build-dir/CASASPECS-DBC248-BPO15AP312/casa6/casatools/src/code/imageanalysis/IO/ParameterParser.cc, line: 176
02-Sep-2026 19:37:38 2026-09-02 23:37:39        WARN        imcontsub::::casa        The linefile parameter is empty, consequently the spectral line image will NOT be
02-Sep-2026 19:37:38 2026-09-02 23:37:39        WARN        imcontsub::::casa+        saved on disk.
02-Sep-2026 19:37:38 2026-09-02 23:37:39        WARN        imcontsub::::casa        The contfile parameter is empty, consequently the continuum image will NOT be
02-Sep-2026 19:37:38 2026-09-02 23:37:39        WARN        imcontsub::::casa+        saved on disk.
02-Sep-2026 19:37:38 2026-09-02 23:37:39        SEVERE        regionmanager::selectedchannels        Exception Reported: Invalid channel specification in -18 of spec -18 at File: /Users/casaci/bamboohome/xml-data/build-dir/CASASPECS-DBC248-BPO15AP312/casa6/casatools/src/code/imageanalysis/IO/ParameterParser.cc, line: 176
02-Sep-2026 19:37:38 2026-09-02 23:37:39        SEVERE        imcontsub::::casa        Task imcontsub raised an exception of class RuntimeError with the following message: Invalid channel specification in -18 of spec -18 at File: /Users/casaci/bamboohome/xml-data/build-dir/CASASPECS-DBC248-BPO15AP312/casa6/casatools/src/code/imageanalysis/IO/ParameterParser.cc, line: 176
02-Sep-2026 19:37:38 2026-09-02 23:37:39        WARN        imcontsub::::casa        The linefile parameter is empty, consequently the spectral line image will NOT be
02-Sep-2026 19:37:38 2026-09-02 23:37:39        WARN        imcontsub::::casa+        saved on disk.
02-Sep-2026 19:37:38 2026-09-02 23:37:39        WARN        imcontsub::::casa        The contfile parameter is empty, consequently the continuum image will NOT be
02-Sep-2026 19:37:38 2026-09-02 23:37:39        WARN        imcontsub::::casa+        saved on disk.
02-Sep-2026 19:37:38 2026-09-02 23:37:39        SEVERE        regionmanager::selectedchannels        Exception Reported: Exception: Zero-based max channel 45 must be less than the total number of channels (40) in the channel specification 45.
02-Sep-2026 19:37:38 2026-09-02 23:37:39        SEVERE        regionmanager::selectedchannels+        ... thrown by static std::vector<uInt> casa::ParameterParser::spectralRangesFromChans(uInt &, const String &, const uInt) at File: /Users/casaci/bamboohome/xml-data/build-dir/CASASPECS-DBC248-BPO15AP312/casa6/casatools/src/code/imageanalysis/IO/ParameterParser.cc, line: 188
02-Sep-2026 19:37:38 2026-09-02 23:37:39        SEVERE        imcontsub::::casa        Task imcontsub raised an exception of class RuntimeError with the following message: Exception: Zero-based max channel 45 must be less than the total number of channels (40) in the channel specification 45.
02-Sep-2026 19:37:38 2026-09-02 23:37:39        SEVERE        imcontsub::::casa+        ... thrown by static std::vector<uInt> casa::ParameterParser::spectralRangesFromChans(uInt &, const String &, const uInt) at File: /Users/casaci/bamboohome/xml-data/build-dir/CASASPECS-DBC248-BPO15AP312/casa6/casatools/src/code/imageanalysis/IO/ParameterParser.cc, line: 188
02-Sep-2026 19:37:38 2026-09-02 23:37:39        WARN        imcontsub::::casa        The linefile parameter is empty, consequently the spectral line image will NOT be
02-Sep-2026 19:37:38 2026-09-02 23:37:39        WARN        imcontsub::::casa+        saved on disk.
02-Sep-2026 19:37:38 2026-09-02 23:37:39        WARN        imcontsub::::casa        The contfile parameter is empty, consequently the continuum image will NOT be
02-Sep-2026 19:37:38 2026-09-02 23:37:39        WARN        imcontsub::::casa+        saved on disk.
02-Sep-2026 19:37:38 2026-09-02 23:37:39        SEVERE        regionmanager::selectedchannels        Exception Reported: Exception: Zero-based max channel 40 must be less than the total number of channels (40) in the channel specification 40.
02-Sep-2026 19:37:38 2026-09-02 23:37:39        SEVERE        regionmanager::selectedchannels+        ... thrown by static std::vector<uInt> casa::ParameterParser::spectralRangesFromChans(uInt &, const String &, const uInt) at File: /Users/casaci/bamboohome/xml-data/build-dir/CASASPECS-DBC248-BPO15AP312/casa6/casatools/src/code/imageanalysis/IO/ParameterParser.cc, line: 188
02-Sep-2026 19:37:38 2026-09-02 23:37:39        SEVERE        imcontsub::::casa        Task imcontsub raised an exception of class RuntimeError with the following message: Exception: Zero-based max channel 40 must be less than the total number of channels (40) in the channel specification 40.
02-Sep-2026 19:37:38 2026-09-02 23:37:39        SEVERE        imcontsub::::casa+        ... thrown by static std::vector<uInt> casa::ParameterParser::spectralRangesFromChans(uInt &, const String &, const uInt) at File: /Users/casaci/bamboohome/xml-data/build-dir/CASASPECS-DBC248-BPO15AP312/casa6/casatools/src/code/imageanalysis/IO/ParameterParser.cc, line: 188
02-Sep-2026 19:37:39 test_task_imcontsub.py::imcontsub_test::test_bad_chans
02-Sep-2026 19:37:39 Test bad chans parameter causes failure
02-Sep-2026 19:37:39 PASSED
02-Sep-2026 19:37:39
02-Sep-2026 19:37:39 2026-09-02 23:37:39        WARN        imcontsub::::casa        The linefile parameter is empty, consequently the spectral line image will NOT be
02-Sep-2026 19:37:39 2026-09-02 23:37:39        WARN        imcontsub::::casa+        saved on disk.
02-Sep-2026 19:37:39 2026-09-02 23:37:39        SEVERE        imcontsub::::casa        Task imcontsub raised an exception of class ValueError with the following message: Error: Unable to continue file input_test_cont already exists, please delete before continuing.
02-Sep-2026 19:37:39 test_task_imcontsub.py::imcontsub_test::test_bad_contfile
02-Sep-2026 19:37:39 Test bad continuum file name fails
02-Sep-2026 19:37:39 PASSED
02-Sep-2026 19:37:39
02-Sep-2026 19:37:39 test_task_imcontsub.py::imcontsub_test::test_bad_fitorder
02-Sep-2026 19:37:39 Test bad fitorder fails
02-Sep-2026 19:37:39 PASSED
02-Sep-2026 19:37:39
02-Sep-2026 19:37:40 test_task_imcontsub.py::imcontsub_test::test_bad_imagename
02-Sep-2026 19:37:40 Test bad image name throws exception
02-Sep-2026 19:37:40 PASSED
02-Sep-2026 19:37:40
02-Sep-2026 19:37:40 2026-09-02 23:37:41        SEVERE        imcontsub::::casa        Task imcontsub raised an exception of class ValueError with the following message: ('Error: file input_test_line1 already exists, please delete before continuing.', 'SEVERE')
02-Sep-2026 19:37:40 test_task_imcontsub.py::imcontsub_test::test_bad_linefile
02-Sep-2026 19:37:40 Test bad line file name fails
02-Sep-2026 19:37:40 PASSED
02-Sep-2026 19:37:40
02-Sep-2026 19:37:40 2026-09-02 23:37:41        WARN        imcontsub::::casa        The linefile parameter is empty, consequently the spectral line image will NOT be
02-Sep-2026 19:37:40 2026-09-02 23:37:41        WARN        imcontsub::::casa+        saved on disk.
02-Sep-2026 19:37:40 2026-09-02 23:37:41        WARN        imcontsub::::casa        The contfile parameter is empty, consequently the continuum image will NOT be
02-Sep-2026 19:37:40 2026-09-02 23:37:41        WARN        imcontsub::::casa+        saved on disk.
02-Sep-2026 19:37:40 2026-09-02 23:37:41        SEVERE        regionmanager::frombcs        Exception Reported: Unable to open region file or region table description /Users/casaci/bamboohome/xml-data/build-dir/CASASPECS-DEVTESTFULLPY312110-TTAAM14P/casa6/casatestutils/nosedir/test_task_imcontsub/garbage.rgn.
02-Sep-2026 19:37:40 2026-09-02 23:37:41        SEVERE        regionmanager::frombcs+        If it is supposed to be a text string its format is incorrect at File: /Users/casaci/bamboohome/xml-data/build-dir/CASASPECS-DBC248-BPO15AP312/casa6/casatools/src/code/imageanalysis/Regions/CasacRegionManager.cc, line: 497
02-Sep-2026 19:37:40 2026-09-02 23:37:41        SEVERE        imcontsub::::casa        Task imcontsub raised an exception of class RuntimeError with the following message: Unable to open region file or region table description /Users/casaci/bamboohome/xml-data/build-dir/CASASPECS-DEVTESTFULLPY312110-TTAAM14P/casa6/casatestutils/nosedir/test_task_imcontsub/garbage.rgn.
02-Sep-2026 19:37:40 2026-09-02 23:37:41        SEVERE        imcontsub::::casa+        If it is supposed to be a text string its format is incorrect at File: /Users/casaci/bamboohome/xml-data/build-dir/CASASPECS-DBC248-BPO15AP312/casa6/casatools/src/code/imageanalysis/Regions/CasacRegionManager.cc, line: 497
02-Sep-2026 19:37:40 2026-09-02 23:37:41        WARN        imcontsub::::casa        The linefile parameter is empty, consequently the spectral line image will NOT be
02-Sep-2026 19:37:40 2026-09-02 23:37:41        WARN        imcontsub::::casa+        saved on disk.
02-Sep-2026 19:37:40 2026-09-02 23:37:41        WARN        imcontsub::::casa        The contfile parameter is empty, consequently the continuum image will NOT be
02-Sep-2026 19:37:40 2026-09-02 23:37:41        WARN        imcontsub::::casa+        saved on disk.
02-Sep-2026 19:37:40 2026-09-02 23:37:41        SEVERE        regionmanager::frombcs        Exception Reported: /Users/casaci/bamboohome/xml-data/build-dir/CASASPECS-DEVTESTFULLPY312110-TTAAM14P/casa6/casatestutils/nosedir/test_task_imcontsub/garbage.rgn is neither a valid binary region file, nor a valid region text file. at File: /Users/casaci/bamboohome/xml-data/build-dir/CASASPECS-DBC248-BPO15AP312/casa6/casatools/src/code/imageanalysis/Regions/CasacRegionManager.cc, line: 431
02-Sep-2026 19:37:40 2026-09-02 23:37:41        SEVERE        imcontsub::::casa        Task imcontsub raised an exception of class RuntimeError with the following message: /Users/casaci/bamboohome/xml-data/build-dir/CASASPECS-DEVTESTFULLPY312110-TTAAM14P/casa6/casatestutils/nosedir/test_task_imcontsub/garbage.rgn is neither a valid binary region file, nor a valid region text file. at File: /Users/casaci/bamboohome/xml-data/build-dir/CASASPECS-DBC248-BPO15AP312/casa6/casatools/src/code/imageanalysis/Regions/CasacRegionManager.cc, line: 431
02-Sep-2026 19:37:41 test_task_imcontsub.py::imcontsub_test::test_bad_region
02-Sep-2026 19:37:41 Test bad region parameter fails
02-Sep-2026 19:37:41 PASSED
02-Sep-2026 19:37:41
02-Sep-2026 19:37:41 2026-09-02 23:37:41        WARN        imcontsub::::casa        The linefile parameter is empty, consequently the spectral line image will NOT be
02-Sep-2026 19:37:41 2026-09-02 23:37:41        WARN        imcontsub::::casa+        saved on disk.
02-Sep-2026 19:37:41 2026-09-02 23:37:41        WARN        imcontsub::::casa        The contfile parameter is empty, consequently the continuum image will NOT be
02-Sep-2026 19:37:41 2026-09-02 23:37:41        WARN        imcontsub::::casa+        saved on disk.
02-Sep-2026 19:37:41 2026-09-02 23:37:41        SEVERE        regionmanager::frombcs        Exception Reported: LCBox::LCBox - blc [0, 0, 2147483647, 0] must be <= trc [511, 511, 0, 39]
02-Sep-2026 19:37:41 2026-09-02 23:37:41        SEVERE        imcontsub::::casa        Task imcontsub raised an exception of class RuntimeError with the following message: LCBox::LCBox - blc [0, 0, 2147483647, 0] must be <= trc [511, 511, 0, 39]
02-Sep-2026 19:37:41 2026-09-02 23:37:41        WARN        imcontsub::::casa        The linefile parameter is empty, consequently the spectral line image will NOT be
02-Sep-2026 19:37:41 2026-09-02 23:37:41        WARN        imcontsub::::casa+        saved on disk.
02-Sep-2026 19:37:41 2026-09-02 23:37:41        WARN        imcontsub::::casa        The contfile parameter is empty, consequently the continuum image will NOT be
02-Sep-2026 19:37:41 2026-09-02 23:37:41        WARN        imcontsub::::casa+        saved on disk.
02-Sep-2026 19:37:41 2026-09-02 23:37:41        SEVERE        CasacRegionManager::_setPolarizationRanges        (Sub)String YELLOW in stokes specification part YELLOW does not match a known polarization.
02-Sep-2026 19:37:41 2026-09-02 23:37:41        SEVERE        regionmanager::frombcs        Exception Reported: 2026-09-02 23:37:41        SEVERE        CasacRegionManager::_setPolarizationRanges        (Sub)String YELLOW in stokes specification part YELLOW does not match a known polarization.
02-Sep-2026 19:37:41 2026-09-02 23:37:41        SEVERE        imcontsub::::casa        Task imcontsub raised an exception of class RuntimeError with the following message: 2026-09-02 23:37:41        SEVERE        CasacRegionManager::_setPolarizationRanges        (Sub)String YELLOW in stokes specification part YELLOW does not match a known polarization.
02-Sep-2026 19:37:41 test_task_imcontsub.py::imcontsub_test::test_bad_stokes
02-Sep-2026 19:37:41 Test bad stokes parameter causes failure
02-Sep-2026 19:37:41 PASSED
02-Sep-2026 19:37:41
02-Sep-2026 19:37:41 test_task_imcontsub.py::imcontsub_test::test_box_and_chans
02-Sep-2026 19:37:41 Imcontsub: Testing box and chans
02-Sep-2026 19:37:41 PASSED
02-Sep-2026 19:37:41
02-Sep-2026 19:37:57 ....10....20....30....40....50....60....70....80....90....100%
02-Sep-2026 19:38:17 ....10....20....30....40....50....60....70....80....90....100%
02-Sep-2026 19:38:18 test_task_imcontsub.py::imcontsub_test::test_fitorder
02-Sep-2026 19:38:18 Imcontsub: testing fitorder correctness
02-Sep-2026 19:38:18 PASSED
02-Sep-2026 19:38:18
02-Sep-2026 19:38:18 - generated xml file: /Users/casaci/bamboohome/xml-data/build-dir/CASASPECS-DEVTESTFULLPY312110-TTAAM14P/casa6/casatestutils/nosedir/xml/test_task_imcontsub/nose.xml -
02-Sep-2026 19:38:18 ======================== 10 passed, 1 warning in 43.83s ========================
02-Sep-2026 19:38:18
02-Sep-2026 19:38:18 Test Directory: /Users/casaci/bamboohome/xml-data/build-dir/CASASPECS-DEVTESTFULLPY312110-TTAAM14P/casa6/casatestutils/nosedir/test_task_plotweather
02-Sep-2026 19:38:18
02-Sep-2026 19:38:18 Running Command: pytest --junitxml=/Users/casaci/bamboohome/xml-data/build-dir/CASASPECS-DEVTESTFULLPY312110-TTAAM14P/casa6/casatestutils/nosedir/xml/test_task_plotweather/nose.xml -s --disable-pytest-warnings --verbose -ra --tb=short /Users/casaci/bamboohome/xml-data/build-dir/CASASPECS-DEVTESTFULLPY312110-TTAAM14P/casa6/casatestutils/nosedir/test_task_plotweather/
02-Sep-2026 19:38:18
02-Sep-2026 19:38:18 Setting Working Directory: /Users/casaci/bamboohome/xml-data/build-dir/CASASPECS-DEVTESTFULLPY312110-TTAAM14P/casa6/casatestutils/nosedir/test_task_fixplanets/
02-Sep-2026 19:38:18 Test Directory: /Users/casaci/bamboohome/xml-data/build-dir/CASASPECS-DEVTESTFULLPY312110-TTAAM14P/casa6/casatestutils/nosedir/test_task_fixplanets
02-Sep-2026 19:38:18
02-Sep-2026 19:38:18 Running Command: pytest --junitxml=/Users/casaci/bamboohome/xml-data/build-dir/CASASPECS-DEVTESTFULLPY312110-TTAAM14P/casa6/casatestutils/nosedir/xml/test_task_fixplanets/nose.xml -s --disable-pytest-warnings --verbose -ra --tb=short /Users/casaci/bamboohome/xml-data/build-dir/CASASPECS-DEVTESTFULLPY312110-TTAAM14P/casa6/casatestutils/nosedir/test_task_fixplanets/
02-Sep-2026 19:38:18
02-Sep-2026 19:38:18 Setting Working Directory: /Users/casaci/bamboohome/xml-data/build-dir/CASASPECS-DEVTESTFULLPY312110-TTAAM14P/casa6/casatestutils/nosedir/test_task_rmtables/
02-Sep-2026 19:38:18 Test Directory: /Users/casaci/bamboohome/xml-data/build-dir/CASASPECS-DEVTESTFULLPY312110-TTAAM14P/casa6/casatestutils/nosedir/test_task_rmtables
02-Sep-2026 19:38:18
02-Sep-2026 19:38:18 Running Command: pytest --junitxml=/Users/casaci/bamboohome/xml-data/build-dir/CASASPECS-DEVTESTFULLPY312110-TTAAM14P/casa6/casatestutils/nosedir/xml/test_task_rmtables/nose.xml -s --disable-pytest-warnings --verbose -ra --tb=short /Users/casaci/bamboohome/xml-data/build-dir/CASASPECS-DEVTESTFULLPY312110-TTAAM14P/casa6/casatestutils/nosedir/test_task_rmtables/
02-Sep-2026 19:38:18
02-Sep-2026 19:38:18 Setting Working Directory: /Users/casaci/bamboohome/xml-data/build-dir/CASASPECS-DEVTESTFULLPY312110-TTAAM14P/casa6/casatestutils/nosedir/test_task_getephemtable/
02-Sep-2026 19:38:18 Test Directory: /Users/casaci/bamboohome/xml-data/build-dir/CASASPECS-DEVTESTFULLPY312110-TTAAM14P/casa6/casatestutils/nosedir/test_task_getephemtable
02-Sep-2026 19:38:18
02-Sep-2026 19:38:18 Running Command: pytest --junitxml=/Users/casaci/bamboohome/xml-data/build-dir/CASASPECS-DEVTESTFULLPY312110-TTAAM14P/casa6/casatestutils/nosedir/xml/test_task_getephemtable/nose.xml -s --disable-pytest-warnings --verbose -ra --tb=short /Users/casaci/bamboohome/xml-data/build-dir/CASASPECS-DEVTESTFULLPY312110-TTAAM14P/casa6/casatestutils/nosedir/test_task_getephemtable/
02-Sep-2026 19:38:18
02-Sep-2026 19:38:18 Setting Working Directory: /Users/casaci/bamboohome/xml-data/build-dir/CASASPECS-DEVTESTFULLPY312110-TTAAM14P/casa6/casatestutils/nosedir/test_task_exportuvfits/
02-Sep-2026 19:38:18 Test Directory: /Users/casaci/bamboohome/xml-data/build-dir/CASASPECS-DEVTESTFULLPY312110-TTAAM14P/casa6/casatestutils/nosedir/test_task_exportuvfits
02-Sep-2026 19:38:18
02-Sep-2026 19:38:18 Running Command: pytest --junitxml=/Users/casaci/bamboohome/xml-data/build-dir/CASASPECS-DEVTESTFULLPY312110-TTAAM14P/casa6/casatestutils/nosedir/xml/test_task_exportuvfits/nose.xml -s --disable-pytest-warnings --verbose -ra --tb=short /Users/casaci/bamboohome/xml-data/build-dir/CASASPECS-DEVTESTFULLPY312110-TTAAM14P/casa6/casatestutils/nosedir/test_task_exportuvfits/
02-Sep-2026 19:38:18
02-Sep-2026 19:38:18 Setting Working Directory: /Users/casaci/bamboohome/xml-data/build-dir/CASASPECS-DEVTESTFULLPY312110-TTAAM14P/casa6/casatestutils/nosedir/test_task_importmiriad/
02-Sep-2026 19:38:18 Test Directory: /Users/casaci/bamboohome/xml-data/build-dir/CASASPECS-DEVTESTFULLPY312110-TTAAM14P/casa6/casatestutils/nosedir/test_task_importmiriad
02-Sep-2026 19:38:18
02-Sep-2026 19:38:18 Running Command: pytest --junitxml=/Users/casaci/bamboohome/xml-data/build-dir/CASASPECS-DEVTESTFULLPY312110-TTAAM14P/casa6/casatestutils/nosedir/xml/test_task_importmiriad/nose.xml -s --disable-pytest-warnings --verbose -ra --tb=short /Users/casaci/bamboohome/xml-data/build-dir/CASASPECS-DEVTESTFULLPY312110-TTAAM14P/casa6/casatestutils/nosedir/test_task_importmiriad/
02-Sep-2026 19:38:18
02-Sep-2026 19:38:18 Setting Working Directory: /Users/casaci/bamboohome/xml-data/build-dir/CASASPECS-DEVTESTFULLPY312110-TTAAM14P/casa6/casatestutils/nosedir/test_task_mstransform/
02-Sep-2026 19:38:18 Test Directory: /Users/casaci/bamboohome/xml-data/build-dir/CASASPECS-DEVTESTFULLPY312110-TTAAM14P/casa6/casatestutils/nosedir/test_task_mstransform
02-Sep-2026 19:38:18
02-Sep-2026 19:38:18 Running Command: pytest --junitxml=/Users/casaci/bamboohome/xml-data/build-dir/CASASPECS-DEVTESTFULLPY312110-TTAAM14P/casa6/casatestutils/nosedir/xml/test_task_mstransform/nose.xml -s --disable-pytest-warnings --verbose -ra --tb=short /Users/casaci/bamboohome/xml-data/build-dir/CASASPECS-DEVTESTFULLPY312110-TTAAM14P/casa6/casatestutils/nosedir/test_task_mstransform/
02-Sep-2026 19:38:18
02-Sep-2026 19:38:18 Setting Working Directory: /Users/casaci/bamboohome/xml-data/build-dir/CASASPECS-DEVTESTFULLPY312110-TTAAM14P/casa6/casatestutils/nosedir/test_task_statwt/
02-Sep-2026 19:38:18 Test Directory: /Users/casaci/bamboohome/xml-data/build-dir/CASASPECS-DEVTESTFULLPY312110-TTAAM14P/casa6/casatestutils/nosedir/test_task_statwt
02-Sep-2026 19:38:18
02-Sep-2026 19:38:18 Running Command: pytest --junitxml=/Users/casaci/bamboohome/xml-data/build-dir/CASASPECS-DEVTESTFULLPY312110-TTAAM14P/casa6/casatestutils/nosedir/xml/test_task_statwt/nose.xml -s --disable-pytest-warnings --verbose -ra --tb=short /Users/casaci/bamboohome/xml-data/build-dir/CASASPECS-DEVTESTFULLPY312110-TTAAM14P/casa6/casatestutils/nosedir/test_task_statwt/
02-Sep-2026 19:38:18
02-Sep-2026 19:38:18 Setting Working Directory: /Users/casaci/bamboohome/xml-data/build-dir/CASASPECS-DEVTESTFULLPY312110-TTAAM14P/casa6/casatestutils/nosedir/test_task_getjyperkalma/
02-Sep-2026 19:38:18 Test Directory: /Users/casaci/bamboohome/xml-data/build-dir/CASASPECS-DEVTESTFULLPY312110-TTAAM14P/casa6/casatestutils/nosedir/test_task_getjyperkalma
02-Sep-2026 19:38:18
02-Sep-2026 19:38:18 Running Command: pytest --junitxml=/Users/casaci/bamboohome/xml-data/build-dir/CASASPECS-DEVTESTFULLPY312110-TTAAM14P/casa6/casatestutils/nosedir/xml/test_task_getjyperkalma/nose.xml -s --disable-pytest-warnings --verbose -ra --tb=short /Users/casaci/bamboohome/xml-data/build-dir/CASASPECS-DEVTESTFULLPY312110-TTAAM14P/casa6/casatestutils/nosedir/test_task_getjyperkalma/
02-Sep-2026 19:38:18
02-Sep-2026 19:38:18 Setting Working Directory: /Users/casaci/bamboohome/xml-data/build-dir/CASASPECS-DEVTESTFULLPY312110-TTAAM14P/casa6/casatestutils/nosedir/test_task_mstransform_mms/
02-Sep-2026 19:38:18 Test Directory: /Users/casaci/bamboohome/xml-data/build-dir/CASASPECS-DEVTESTFULLPY312110-TTAAM14P/casa6/casatestutils/nosedir/test_task_mstransform_mms
02-Sep-2026 19:38:18
02-Sep-2026 19:38:18 Running Command: pytest --junitxml=/Users/casaci/bamboohome/xml-data/build-dir/CASASPECS-DEVTESTFULLPY312110-TTAAM14P/casa6/casatestutils/nosedir/xml/test_task_mstransform_mms/nose.xml -s --disable-pytest-warnings --verbose -ra --tb=short /Users/casaci/bamboohome/xml-data/build-dir/CASASPECS-DEVTESTFULLPY312110-TTAAM14P/casa6/casatestutils/nosedir/test_task_mstransform_mms/
02-Sep-2026 19:38:18
02-Sep-2026 19:38:18 Setting Working Directory: /Users/casaci/bamboohome/xml-data/build-dir/CASASPECS-DEVTESTFULLPY312110-TTAAM14P/casa6/casatestutils/nosedir/test_task_sdsmooth/
02-Sep-2026 19:38:18 Test Directory: /Users/casaci/bamboohome/xml-data/build-dir/CASASPECS-DEVTESTFULLPY312110-TTAAM14P/casa6/casatestutils/nosedir/test_task_sdsmooth
02-Sep-2026 19:38:18
02-Sep-2026 19:38:18 Running Command: pytest --junitxml=/Users/casaci/bamboohome/xml-data/build-dir/CASASPECS-DEVTESTFULLPY312110-TTAAM14P/casa6/casatestutils/nosedir/xml/test_task_sdsmooth/nose.xml -s --disable-pytest-warnings --verbose -ra --tb=short /Users/casaci/bamboohome/xml-data/build-dir/CASASPECS-DEVTESTFULLPY312110-TTAAM14P/casa6/casatestutils/nosedir/test_task_sdsmooth/
02-Sep-2026 19:38:18
02-Sep-2026 19:38:18 Setting Working Directory: /Users/casaci/bamboohome/xml-data/build-dir/CASASPECS-DEVTESTFULLPY312110-TTAAM14P/casa6/casatestutils/nosedir/test_task_immoments/
02-Sep-2026 19:38:18 Test Directory: /Users/casaci/bamboohome/xml-data/build-dir/CASASPECS-DEVTESTFULLPY312110-TTAAM14P/casa6/casatestutils/nosedir/test_task_immoments
02-Sep-2026 19:38:18
02-Sep-2026 19:38:18 Running Command: pytest --junitxml=/Users/casaci/bamboohome/xml-data/build-dir/CASASPECS-DEVTESTFULLPY312110-TTAAM14P/casa6/casatestutils/nosedir/xml/test_task_immoments/nose.xml -s --disable-pytest-warnings --verbose -ra --tb=short /Users/casaci/bamboohome/xml-data/build-dir/CASASPECS-DEVTESTFULLPY312110-TTAAM14P/casa6/casatestutils/nosedir/test_task_immoments/
02-Sep-2026 19:38:18
02-Sep-2026 19:38:18 Setting Working Directory: /Users/casaci/bamboohome/xml-data/build-dir/CASASPECS-DEVTESTFULLPY312110-TTAAM14P/casa6/casatestutils/nosedir/test_task_plotbandpass/
02-Sep-2026 19:38:18 Test Directory: /Users/casaci/bamboohome/xml-data/build-dir/CASASPECS-DEVTESTFULLPY312110-TTAAM14P/casa6/casatestutils/nosedir/test_task_plotbandpass
02-Sep-2026 19:38:18 ============================= test session starts ==============================
02-Sep-2026 19:38:18 platform darwin -- Python 3.12.8, pytest-9.1.1, pluggy-1.6.0 -- /Users/casaci/bamboohome/xml-data/build-dir/CASASPECS-DEVTESTFULLPY312110-TTAAM14P/casa6testenv/bin/python
02-Sep-2026 19:38:18 cachedir: .pytest_cache
02-Sep-2026 19:38:18 rootdir: /Users/casaci/bamboohome/xml-data/build-dir/CASASPECS-DEVTESTFULLPY312110-TTAAM14P/casa6/casatestutils/nosedir/test_task_simobserve
02-Sep-2026 19:38:18 configfile: pytest.ini
02-Sep-2026 19:38:21 collecting ... collected 93 items
02-Sep-2026 19:38:21
02-Sep-2026 19:38:21
02-Sep-2026 19:38:23 test_task_simobserve.py::simobserve_sky::testSky_almaptg
02-Sep-2026 19:38:23 Test skymodel simulation: only setpointing (maptype='ALMA')
02-Sep-2026 19:38:23
02-Sep-2026 19:38:23 Comparing 105 pointings in 'simobserve_sky/simobserve_sky.alma.out01.ptg.txt' with 'alma.alma.out01.ptg.txt'
02-Sep-2026 19:38:23 PASSED
02-Sep-2026 19:38:23
02-Sep-2026 19:38:25 test_task_simobserve.py::simobserve_sky::testSky_hexptg
02-Sep-2026 19:38:25 Test skymodel simulation: only setpointing (maptype='hexagonal')
02-Sep-2026 19:38:25
02-Sep-2026 19:38:25 Comparing 27 pointings in 'simobserve_sky/simobserve_sky.aca.i.ptg.txt' with 'hex.aca.i.ptg.txt'
02-Sep-2026 19:38:25 PASSED
02-Sep-2026 19:38:25
02-Sep-2026 19:38:27 2026-09-02 23:38:28        SEVERE        simobserve::MeasTable::dUTC(Double) (file ../../measures/Measures/MeasTable.cc, line 4290)        Leap second table TAI_UTC seems out-of-date.
02-Sep-2026 19:38:27 2026-09-02 23:38:28        SEVERE        simobserve::MeasTable::dUTC(Double) (file ../../measures/Measures/MeasTable.cc, line 4290)+        Until the table is updated (see the CASA documentation or your system admin),
02-Sep-2026 19:38:27 2026-09-02 23:38:28        SEVERE        simobserve::MeasTable::dUTC(Double) (file ../../measures/Measures/MeasTable.cc, line 4290)+        times and coordinates derived from UTC could be wrong by 1s or more.
02-Sep-2026 19:38:29 test_task_simobserve.py::simobserve_sky::testSky_intAll
02-Sep-2026 19:38:29 Test skymodel simulation: interferometer
02-Sep-2026 19:38:29
02-Sep-2026 19:38:29 Comparing image statistics of 'simobserve_sky/simobserve_sky.alma.out01.skymodel' with reference 'ref_sky.aca.tp.skymodel'
02-Sep-2026 19:38:29 Comparing 7 pointings in 'simobserve_sky/simobserve_sky.alma.out01.ptg.txt' with 'ref_sky.alma.out01.ptg.txt'
02-Sep-2026 19:38:29 Comparing MS statistics of 'simobserve_sky/simobserve_sky.alma.out01.ms' with reference 'ref_sky.alma.out01.ms'
02-Sep-2026 19:38:29 PASSED
02-Sep-2026 19:38:29
02-Sep-2026 19:38:32 2026-09-02 23:38:33        WARN        simobserve::leak::casa        Copying simobserve_sky/simobserve_sky.alma.out01.ms to simobserve_sky/simobserve_sky.alma.out01.fullpol.ms and adding polarization leakage ...
02-Sep-2026 19:38:32 test_task_simobserve.py::simobserve_sky::testSky_intLeak
02-Sep-2026 19:38:32 Test skymodel simulation: only observation (INT) with leakage>0
02-Sep-2026 19:38:32
02-Sep-2026 19:38:32 Comparing MS statistics of 'simobserve_sky/simobserve_sky.alma.out01.fullpol.ms' with reference 'ref_sky.alma.out01.fullpol.ms'
02-Sep-2026 19:38:32 PASSED
02-Sep-2026 19:38:32
02-Sep-2026 19:38:36 2026-09-02 23:38:36        WARN        simobserve::leak::casa        Copying simobserve_sky/simobserve_sky.alma.out01.ms to simobserve_sky/simobserve_sky.alma.out01.fullpol.ms and adding polarization leakage ...
02-Sep-2026 19:38:36 2026-09-02 23:38:36        WARN        simobserve::noise::casa        Applying thermal noise ...
02-Sep-2026 19:38:36 2026-09-02 23:38:36        WARN        simobserve::noise::casa        Copying simobserve_sky/simobserve_sky.alma.out01.fullpol.ms to simobserve_sky/simobserve_sky.alma.out01.noisier.ms and adding thermal noise ...
02-Sep-2026 19:38:36 test_task_simobserve.py::simobserve_sky::testSky_intLeak_noise
02-Sep-2026 19:38:36 Test INT thermal noise (tsys-manual) in full pol with leakage>0
02-Sep-2026 19:38:36
02-Sep-2026 19:38:36 PASSED
02-Sep-2026 19:38:36
02-Sep-2026 19:38:40 test_task_simobserve.py::simobserve_sky::testSky_intObs
02-Sep-2026 19:38:40 Test skymodel simulation: only observation (INT)
02-Sep-2026 19:38:40
02-Sep-2026 19:38:40 Comparing MS statistics of 'simobserve_sky/simobserve_sky.alma.out01.ms' with reference 'ref_sky.alma.out01.ms'
02-Sep-2026 19:38:40 PASSED
02-Sep-2026 19:38:40
02-Sep-2026 19:38:43 test_task_simobserve.py::simobserve_sky::testSky_intObs_namedAntlist
02-Sep-2026 19:38:43 Test skymodel simulation: observation (INT) with ACA configuration file containing an extra column to indirectly exercise readantenna method of simutil
02-Sep-2026 19:38:43
02-Sep-2026 19:38:43 PASSED
02-Sep-2026 19:38:43
02-Sep-2026 19:38:46 test_task_simobserve.py::simobserve_sky::testSky_sdAll
02-Sep-2026 19:38:46 Test skymodel simulation: single dish
02-Sep-2026 19:38:46
02-Sep-2026 19:38:46 Comparing image statistics of 'simobserve_sky/simobserve_sky.aca.tp.skymodel' with reference 'ref_sky.aca.tp.skymodel'
02-Sep-2026 19:38:46 Comparing 144 pointings in 'simobserve_sky/simobserve_sky.aca.tp.ptg.txt' with 'ref_sky.aca.tp.ptg.txt'
02-Sep-2026 19:38:46 Comparing MS statistics of 'simobserve_sky/simobserve_sky.aca.tp.sd.ms' with reference 'ref_sky.aca.tp.sd.ms'
02-Sep-2026 19:38:46 PASSED
02-Sep-2026 19:38:46
02-Sep-2026 19:38:49 test_task_simobserve.py::simobserve_sky::testSky_sdObs
02-Sep-2026 19:38:49 Test skymodel simulation: only observation (SD)
02-Sep-2026 19:38:49
02-Sep-2026 19:38:49 Comparing MS statistics of 'simobserve_sky/simobserve_sky.aca.tp.sd.ms' with reference 'ref_sky.aca.tp.sd.ms'
02-Sep-2026 19:38:49 PASSED
02-Sep-2026 19:38:49
02-Sep-2026 19:38:52 2026-09-02 23:38:52        WARN        simobserve::noise::casa        Applying thermal noise ...
02-Sep-2026 19:38:52 2026-09-02 23:38:52        WARN        simobserve::noise::casa        Copying simobserve_sky/simobserve_sky.aca.tp.sd.ms to simobserve_sky/simobserve_sky.aca.tp.noisy.sd.ms and adding thermal noise ...
02-Sep-2026 19:38:53 test_task_simobserve.py::simobserve_sky::testSky_sdObs_noise
02-Sep-2026 19:38:53 Test skymodel simulation: observation (SD) with added thermal noise
02-Sep-2026 19:38:53
02-Sep-2026 19:38:53 Comparing MS statistics of 'simobserve_sky/simobserve_sky.aca.tp.sd.ms' with reference 'ref_sky.aca.tp.sd.ms'
02-Sep-2026 19:38:53 Comparing MS statistics of 'simobserve_sky/simobserve_sky.aca.tp.noisy.sd.ms' with reference 'ref_sky.aca.tp.noisy.sd.ms'
02-Sep-2026 19:38:53 PASSED
02-Sep-2026 19:38:53
02-Sep-2026 19:38:55 test_task_simobserve.py::simobserve_sky::testSky_skymodel
02-Sep-2026 19:38:55 Test skymodel simulation: only modify model
02-Sep-2026 19:38:55
02-Sep-2026 19:38:55 Comparing image statistics of 'simobserve_sky/simobserve_sky.alma.out01.skymodel' with reference 'ref_sky.aca.tp.skymodel'
02-Sep-2026 19:38:55 PASSED
02-Sep-2026 19:38:55
02-Sep-2026 19:38:57 test_task_simobserve.py::simobserve_sky::testSky_sqptg
02-Sep-2026 19:38:57 Test skymodel simulation: only setpointing (maptype='square')
02-Sep-2026 19:38:57
02-Sep-2026 19:38:57 Comparing 256 pointings in 'simobserve_sky/simobserve_sky.aca.tp.ptg.txt' with 'square.aca.tp.ptg.txt'
02-Sep-2026 19:38:57 PASSED
02-Sep-2026 19:38:57
02-Sep-2026 19:38:57 test_task_simobserve.py::simobserve_comp::testComp_almaptg
02-Sep-2026 19:38:57 Test complist simulation: only setpointing (maptype='ALMA')
02-Sep-2026 19:38:57
02-Sep-2026 19:38:57 Comparing 17 pointings in 'simobserve_comp/simobserve_comp.alma.out01.ptg.txt' with 'alma.alma.out01.ptg.txt'
02-Sep-2026 19:38:57 PASSED
02-Sep-2026 19:38:57
02-Sep-2026 19:38:57 test_task_simobserve.py::simobserve_comp::testComp_complist
02-Sep-2026 19:38:57 Test complist simulation: only generating input model
02-Sep-2026 19:38:57
02-Sep-2026 19:38:57 Comparing image statistics of 'simobserve_comp/simobserve_comp.alma.out01.compskymodel' with reference 'ref_comp.alma.out01.compskymodel'
02-Sep-2026 19:38:57 PASSED
02-Sep-2026 19:38:57
02-Sep-2026 19:38:58 test_task_simobserve.py::simobserve_comp::testComp_hexptg
02-Sep-2026 19:38:58 Test complist simulation: only setpointing (maptype='hexagonal')
02-Sep-2026 19:38:58
02-Sep-2026 19:38:58 Comparing 3 pointings in 'simobserve_comp/simobserve_comp.aca.i.ptg.txt' with 'hex.aca.i.ptg.txt'
02-Sep-2026 19:38:58 PASSED
02-Sep-2026 19:38:58
02-Sep-2026 19:38:58 test_task_simobserve.py::simobserve_comp::testComp_intAll
02-Sep-2026 19:38:58 Test complist simulation: interferometer
02-Sep-2026 19:38:58
02-Sep-2026 19:38:58 Comparing image statistics of 'simobserve_comp/simobserve_comp.alma.out01.compskymodel' with reference 'ref_comp.alma.out01.compskymodel'
02-Sep-2026 19:38:58 Comparing 7 pointings in 'simobserve_comp/simobserve_comp.alma.out01.ptg.txt' with 'ref_comp.alma.out01.ptg.txt'
02-Sep-2026 19:38:58 Comparing MS statistics of 'simobserve_comp/simobserve_comp.alma.out01.ms' with reference 'ref_comp.alma.out01.ms'
02-Sep-2026 19:38:58 PASSED
02-Sep-2026 19:38:58
02-Sep-2026 19:38:58 test_task_simobserve.py::simobserve_comp::testComp_intLeak
02-Sep-2026 19:38:58 Test complist simulation: only observation (INT)
02-Sep-2026 19:38:58 SKIPPED (Previously disabled for unknown reason.)
02-Sep-2026 19:38:58
02-Sep-2026 19:38:59 test_task_simobserve.py::simobserve_comp::testComp_intNchan
02-Sep-2026 19:38:59 Test complist simulation: interferometer, but with comp_nchan > 1
02-Sep-2026 19:38:59
02-Sep-2026 19:38:59 Comparing image statistics of 'simobserve_comp/simobserve_comp.alma.out01.compskymodel' with reference 'ref_comp.alma.out01.8ch.compskymodel'
02-Sep-2026 19:38:59 Comparing 7 pointings in 'simobserve_comp/simobserve_comp.alma.out01.ptg.txt' with 'ref_comp.alma.out01.8ch.ptg.txt'
02-Sep-2026 19:38:59 Comparing MS statistics of 'simobserve_comp/simobserve_comp.alma.out01.ms' with reference 'ref_comp.alma.out01.8ch.ms'
02-Sep-2026 19:38:59 PASSED
02-Sep-2026 19:38:59
02-Sep-2026 19:39:00 test_task_simobserve.py::simobserve_comp::testComp_intObs
02-Sep-2026 19:39:00 Test complist simulation: only observation (INT)
02-Sep-2026 19:39:00
02-Sep-2026 19:39:00 Comparing MS statistics of 'simobserve_comp/simobserve_comp.alma.out01.ms' with reference 'ref_comp.alma.out01.ms'
02-Sep-2026 19:39:00 PASSED
02-Sep-2026 19:39:00
02-Sep-2026 19:39:02 test_task_simobserve.py::simobserve_comp::testComp_plp
02-Sep-2026 19:39:02 Test plp (spectral dependency) is supported CAS-13776
02-Sep-2026 19:39:02
02-Sep-2026 19:39:02 PASSED
02-Sep-2026 19:39:02
02-Sep-2026 19:39:02 test_task_simobserve.py::simobserve_comp::testComp_sdAll
02-Sep-2026 19:39:02 Test complist simulation: single dish
02-Sep-2026 19:39:02 SKIPPED (Previously disabled with comment: "TEMPORARY discarding due...)
02-Sep-2026 19:39:02
02-Sep-2026 19:39:02 test_task_simobserve.py::simobserve_comp::testComp_sdObs
02-Sep-2026 19:39:02 Test complist simulation: only observation (SD)
02-Sep-2026 19:39:02 SKIPPED (Previously disabled with comment: "TEMPORARY discarding due...)
02-Sep-2026 19:39:02
02-Sep-2026 19:39:02 test_task_simobserve.py::simobserve_comp::testComp_sqptg
02-Sep-2026 19:39:02 Test complist simulation: only setpointing (maptype='square')
02-Sep-2026 19:39:02
02-Sep-2026 19:39:02 Comparing 36 pointings in 'simobserve_comp/simobserve_comp.aca.tp.ptg.txt' with 'square.aca.tp.ptg.txt'
02-Sep-2026 19:39:02 PASSED
02-Sep-2026 19:39:02
02-Sep-2026 19:39:05 test_task_simobserve.py::simobserve_skycomp::testSC_almaptg
02-Sep-2026 19:39:05 Test skymodel + complist simulation: only setpointing (maptype='ALMA')
02-Sep-2026 19:39:05
02-Sep-2026 19:39:05 Comparing 105 pointings in 'simobserve_sc/simobserve_sc.alma.out01.ptg.txt' with 'alma.alma.out01.ptg.txt'
02-Sep-2026 19:39:05 PASSED
02-Sep-2026 19:39:05
02-Sep-2026 19:39:08 test_task_simobserve.py::simobserve_skycomp::testSC_hexptg
02-Sep-2026 19:39:08 Test skymodel + complist simulation: only setpointing (maptype='hexagonal')
02-Sep-2026 19:39:08
02-Sep-2026 19:39:08 Comparing 27 pointings in 'simobserve_sc/simobserve_sc.aca.i.ptg.txt' with 'hex.aca.i.ptg.txt'
02-Sep-2026 19:39:08 PASSED
02-Sep-2026 19:39:08
02-Sep-2026 19:39:13 test_task_simobserve.py::simobserve_skycomp::testSC_intAll
02-Sep-2026 19:39:13 Test skymodel + complist simulation: interferometer
02-Sep-2026 19:39:13
02-Sep-2026 19:39:13 Comparing image statistics of 'simobserve_sc/simobserve_sc.alma.out01.skymodel.flat' with reference 'ref_sky.aca.tp.skymodel.flat'
02-Sep-2026 19:39:13 Comparing 7 pointings in 'simobserve_sc/simobserve_sc.alma.out01.ptg.txt' with 'ref_sky.alma.out01.ptg.txt'
02-Sep-2026 19:39:13 Comparing MS statistics of 'simobserve_sc/simobserve_sc.alma.out01.ms' with reference 'ref_sky.alma.out01.ms'
02-Sep-2026 19:39:13 PASSED
02-Sep-2026 19:39:13
02-Sep-2026 19:39:13 test_task_simobserve.py::simobserve_skycomp::testSC_intLeak
02-Sep-2026 19:39:13 Test skymodel + complist simulation: only leakage (INT)
02-Sep-2026 19:39:13 SKIPPED (Previously disabled for unknown reason.)
02-Sep-2026 19:39:13
02-Sep-2026 19:39:17 test_task_simobserve.py::simobserve_skycomp::testSC_intObs
02-Sep-2026 19:39:17 Test skymodel + complist simulation: only observation (INT)
02-Sep-2026 19:39:17
02-Sep-2026 19:39:17 Comparing MS statistics of 'simobserve_sc/simobserve_sc.alma.out01.ms' with reference 'ref_sky.alma.out01.ms'
02-Sep-2026 19:39:17 PASSED
02-Sep-2026 19:39:17
02-Sep-2026 19:39:17 test_task_simobserve.py::simobserve_skycomp::testSC_sdAll
02-Sep-2026 19:39:17 Test skymodel + complist simulation: single dish
02-Sep-2026 19:39:17 SKIPPED (Previously disabled with comment: "TEMPORARY discarding due...)
02-Sep-2026 19:39:17
02-Sep-2026 19:39:17 test_task_simobserve.py::simobserve_skycomp::testSC_sdObs
02-Sep-2026 19:39:17 Test skymodel + complist simulation: only observation (SD)
02-Sep-2026 19:39:17 SKIPPED (Previously disabled with comment: "TEMPORARY discarding due...)
02-Sep-2026 19:39:17
02-Sep-2026 19:39:20 test_task_simobserve.py::simobserve_skycomp::testSC_skymodel
02-Sep-2026 19:39:20 Test skymodel + complist simulation: only modify model
02-Sep-2026 19:39:20
02-Sep-2026 19:39:20 Comparing image statistics of 'simobserve_sc/simobserve_sc.alma.out01.skymodel.flat' with reference 'ref_sky.aca.tp.skymodel.flat'
02-Sep-2026 19:39:20 PASSED
02-Sep-2026 19:39:20
02-Sep-2026 19:39:23 test_task_simobserve.py::simobserve_skycomp::testSC_sqptg
02-Sep-2026 19:39:23 Test skymodel + complist simulation: only setpointing (maptype='square')
02-Sep-2026 19:39:23
02-Sep-2026 19:39:23 Comparing 256 pointings in 'simobserve_sc/simobserve_sc.aca.tp.ptg.txt' with 'square.aca.tp.ptg.txt'
02-Sep-2026 19:39:23 PASSED
02-Sep-2026 19:39:23
02-Sep-2026 19:39:23 test_task_simobserve.py::simobserve_noise::testNZ_intAtm
02-Sep-2026 19:39:23 Test INT thermal noise (tsys-atm): standard parameter set
02-Sep-2026 19:39:23 SKIPPED (disabled pending change in CAS-12496)
02-Sep-2026 19:39:23
02-Sep-2026 19:39:23 2026-09-02 23:39:24        WARN        simobserve::noise::casa        Applying thermal noise ...
02-Sep-2026 19:39:23 2026-09-02 23:39:24        WARN        simobserve::noise::casa        Copying noise_int/noise_int.aca_cycle1.ms to noise_int/noise_int.aca_cycle1.noisy.ms and adding thermal noise ...
02-Sep-2026 19:39:23 test_task_simobserve.py::simobserve_noise::testNZ_intMan
02-Sep-2026 19:39:23 Test INT thermal noise (tsys-manual)
02-Sep-2026 19:39:23
02-Sep-2026 19:39:23 PASSED
02-Sep-2026 19:39:23
02-Sep-2026 19:39:26 2026-09-02 23:39:26        WARN        simobserve::leak::casa        Copying noise_int/noise_int.aca_cycle1.ms to noise_int/noise_int.aca_cycle1.fullpol.ms and adding polarization leakage ...
02-Sep-2026 19:39:26 2026-09-02 23:39:26        WARN        simobserve::noise::casa        Applying thermal noise ...
02-Sep-2026 19:39:26 2026-09-02 23:39:26        WARN        simobserve::noise::casa        Copying noise_int/noise_int.aca_cycle1.fullpol.ms to noise_int/noise_int.aca_cycle1.noisier.ms and adding thermal noise ...
02-Sep-2026 19:39:27 test_task_simobserve.py::simobserve_noise::testNZ_intMan_Leak
02-Sep-2026 19:39:27 Test INT thermal noise (tsys-manual) in full pol with leakage>0
02-Sep-2026 19:39:27
02-Sep-2026 19:39:27 PASSED
02-Sep-2026 19:39:27
02-Sep-2026 19:39:27 2026-09-02 23:39:27        WARN        simobserve::noise::casa        Applying thermal noise ...
02-Sep-2026 19:39:27 2026-09-02 23:39:27        WARN        simobserve::noise::casa        Copying noise_sd/noise_sd.aca.tp.sd.ms to noise_sd/noise_sd.aca.tp.noisy.sd.ms and adding thermal noise ...
02-Sep-2026 19:39:27 2026-09-02 23:39:28        WARN        noise::CTPatchedInterp::interpolate        In caltable noise_sd.aca.tp.noisy.sd.T.cal_sim_temp (Tf Jones):
02-Sep-2026 19:39:27 2026-09-02 23:39:28        WARN        noise::CTPatchedInterp::interpolate+         Insufficient solution channel sampling (nchan=1) for frequency-dependent LINEAR interpolation
02-Sep-2026 19:39:27 2026-09-02 23:39:28        WARN        noise::CTPatchedInterp::interpolate+         of calibration for MS spw=0; using NEAREST instead.
02-Sep-2026 19:39:27 test_task_simobserve.py::simobserve_noise::testNZ_sdAtm
02-Sep-2026 19:39:27 Test SD thermal noise (tsys-atm): standard parameter set
02-Sep-2026 19:39:27
02-Sep-2026 19:39:27 PASSED
02-Sep-2026 19:39:27
02-Sep-2026 19:39:28 2026-09-02 23:39:28        WARN        simobserve::noise::casa        Applying thermal noise ...
02-Sep-2026 19:39:28 2026-09-02 23:39:28        WARN        simobserve::noise::casa        Copying noise_sd/noise_sd.aca.tp.sd.ms to noise_sd/noise_sd.aca.tp.noisy.sd.ms and adding thermal noise ...
02-Sep-2026 19:39:28 2026-09-02 23:39:28        WARN        noise::CTPatchedInterp::interpolate        In caltable noise_sd.aca.tp.noisy.sd.T.cal_sim_temp (Tf Jones):
02-Sep-2026 19:39:28 2026-09-02 23:39:28        WARN        noise::CTPatchedInterp::interpolate+         Insufficient solution channel sampling (nchan=1) for frequency-dependent LINEAR interpolation
02-Sep-2026 19:39:28 2026-09-02 23:39:28        WARN        noise::CTPatchedInterp::interpolate+         of calibration for MS spw=0; using NEAREST instead.
02-Sep-2026 19:39:28 test_task_simobserve.py::simobserve_noise::testNZ_sdAtm_dnu
02-Sep-2026 19:39:28 Test SD thermal noise (tsys-atm): inwidth='1MHz'
02-Sep-2026 19:39:28
02-Sep-2026 19:39:28 PASSED
02-Sep-2026 19:39:28
02-Sep-2026 19:39:28 2026-09-02 23:39:29        WARN        simobserve::noise::casa        Applying thermal noise ...
02-Sep-2026 19:39:28 2026-09-02 23:39:29        WARN        simobserve::noise::casa        Copying noise_sd/noise_sd.aca.tp.sd.ms to noise_sd/noise_sd.aca.tp.noisy.sd.ms and adding thermal noise ...
02-Sep-2026 19:39:28 2026-09-02 23:39:29        WARN        noise::CTPatchedInterp::interpolate        In caltable noise_sd.aca.tp.noisy.sd.T.cal_sim_temp (Tf Jones):
02-Sep-2026 19:39:28 2026-09-02 23:39:29        WARN        noise::CTPatchedInterp::interpolate+         Insufficient solution channel sampling (nchan=1) for frequency-dependent LINEAR interpolation
02-Sep-2026 19:39:28 2026-09-02 23:39:29        WARN        noise::CTPatchedInterp::interpolate+         of calibration for MS spw=0; using NEAREST instead.
02-Sep-2026 19:39:28 test_task_simobserve.py::simobserve_noise::testNZ_sdAtm_el
02-Sep-2026 19:39:28 Test SD thermal noise (tsys-atm): elevation = 60 deg
02-Sep-2026 19:39:28
02-Sep-2026 19:39:28 PASSED
02-Sep-2026 19:39:28
02-Sep-2026 19:39:28 2026-09-02 23:39:29        WARN        simobserve::noise::casa        Applying thermal noise ...
02-Sep-2026 19:39:28 2026-09-02 23:39:29        WARN        simobserve::noise::casa        Copying noise_sd/noise_sd.aca.tp.sd.ms to noise_sd/noise_sd.aca.tp.noisy.sd.ms and adding thermal noise ...
02-Sep-2026 19:39:29 2026-09-02 23:39:29        WARN        noise::CTPatchedInterp::interpolate        In caltable noise_sd.aca.tp.noisy.sd.T.cal_sim_temp (Tf Jones):
02-Sep-2026 19:39:29 2026-09-02 23:39:29        WARN        noise::CTPatchedInterp::interpolate+         Insufficient solution channel sampling (nchan=1) for frequency-dependent LINEAR interpolation
02-Sep-2026 19:39:29 2026-09-02 23:39:29        WARN        noise::CTPatchedInterp::interpolate+         of calibration for MS spw=0; using NEAREST instead.
02-Sep-2026 19:39:29 test_task_simobserve.py::simobserve_noise::testNZ_sdAtm_pwv
02-Sep-2026 19:39:29 Test SD thermal noise (tsys-atm): pwv = 2.0
02-Sep-2026 19:39:29
02-Sep-2026 19:39:29 PASSED
02-Sep-2026 19:39:29
02-Sep-2026 19:39:29 2026-09-02 23:39:30        WARN        simobserve::noise::casa        Applying thermal noise ...
02-Sep-2026 19:39:29 2026-09-02 23:39:30        WARN        simobserve::noise::casa        Copying noise_sd/noise_sd.aca.tp.sd.ms to noise_sd/noise_sd.aca.tp.noisy.sd.ms and adding thermal noise ...
02-Sep-2026 19:39:29 2026-09-02 23:39:30        WARN        noise::CTPatchedInterp::interpolate        In caltable noise_sd.aca.tp.noisy.sd.T.cal_sim_temp (Tf Jones):
02-Sep-2026 19:39:29 2026-09-02 23:39:30        WARN        noise::CTPatchedInterp::interpolate+         Insufficient solution channel sampling (nchan=1) for frequency-dependent LINEAR interpolation
02-Sep-2026 19:39:29 2026-09-02 23:39:30        WARN        noise::CTPatchedInterp::interpolate+         of calibration for MS spw=0; using NEAREST instead.
02-Sep-2026 19:39:29 test_task_simobserve.py::simobserve_noise::testNZ_sdAtm_tint
02-Sep-2026 19:39:29 Test SD thermal noise (tsys-atm): integration = '2s'
02-Sep-2026 19:39:29
02-Sep-2026 19:39:29 PASSED
02-Sep-2026 19:39:29
02-Sep-2026 19:39:29 2026-09-02 23:39:30        WARN        simobserve::noise::casa        Applying thermal noise ...
02-Sep-2026 19:39:29 2026-09-02 23:39:30        WARN        simobserve::noise::casa        Copying noise_sd/noise_sd.aca.tp.sd.ms to noise_sd/noise_sd.aca.tp.noisy.sd.ms and adding thermal noise ...
02-Sep-2026 19:39:29 test_task_simobserve.py::simobserve_noise::testNZ_sdMan
02-Sep-2026 19:39:29 Test SD thermal noise (tsys-manual): standard parameter set
02-Sep-2026 19:39:29
02-Sep-2026 19:39:29 PASSED
02-Sep-2026 19:39:29
02-Sep-2026 19:39:30 2026-09-02 23:39:30        WARN        simobserve::noise::casa        Applying thermal noise ...
02-Sep-2026 19:39:30 2026-09-02 23:39:30        WARN        simobserve::noise::casa        Copying noise_sd/noise_sd.aca.tp.sd.ms to noise_sd/noise_sd.aca.tp.noisy.sd.ms and adding thermal noise ...
02-Sep-2026 19:39:30 test_task_simobserve.py::simobserve_noise::testNZ_sdMan_dnu
02-Sep-2026 19:39:30 Test SD thermal noise (tsys-manual): inwidth='1MHz'
02-Sep-2026 19:39:30
02-Sep-2026 19:39:30 PASSED
02-Sep-2026 19:39:30
02-Sep-2026 19:39:30 2026-09-02 23:39:31        WARN        simobserve::noise::casa        Applying thermal noise ...
02-Sep-2026 19:39:30 2026-09-02 23:39:31        WARN        simobserve::noise::casa        Copying noise_sd/noise_sd.aca.tp.sd.ms to noise_sd/noise_sd.aca.tp.noisy.sd.ms and adding thermal noise ...
02-Sep-2026 19:39:31 test_task_simobserve.py::simobserve_noise::testNZ_sdMan_el
02-Sep-2026 19:39:31 Test SD thermal noise (tsys-manual): elevation = 60 deg
02-Sep-2026 19:39:31
02-Sep-2026 19:39:31 PASSED
02-Sep-2026 19:39:31
02-Sep-2026 19:39:31 2026-09-02 23:39:31        WARN        simobserve::noise::casa        Applying thermal noise ...
02-Sep-2026 19:39:31 2026-09-02 23:39:31        WARN        simobserve::noise::casa        Copying noise_sd/noise_sd.aca.tp.sd.ms to noise_sd/noise_sd.aca.tp.noisy.sd.ms and adding thermal noise ...
02-Sep-2026 19:39:31 test_task_simobserve.py::simobserve_noise::testNZ_sdMan_tau
02-Sep-2026 19:39:31 Test SD thermal noise (tsys-manual): tau0=1.5
02-Sep-2026 19:39:31
02-Sep-2026 19:39:31 PASSED
02-Sep-2026 19:39:31
02-Sep-2026 19:39:31 2026-09-02 23:39:32        WARN        simobserve::noise::casa        Applying thermal noise ...
02-Sep-2026 19:39:31 2026-09-02 23:39:32        WARN        simobserve::noise::casa        Copying noise_sd/noise_sd.aca.tp.sd.ms to noise_sd/noise_sd.aca.tp.noisy.sd.ms and adding thermal noise ...
02-Sep-2026 19:39:31 test_task_simobserve.py::simobserve_noise::testNZ_sdMan_tint
02-Sep-2026 19:39:31 Test SD thermal noise (tsys-manual): integration='2s'
02-Sep-2026 19:39:31
02-Sep-2026 19:39:31 PASSED
02-Sep-2026 19:39:31
02-Sep-2026 19:39:31 test_task_simobserve.py::simobserve_badinputs::testBad_Tground
02-Sep-2026 19:39:31 Test bad t_ground
02-Sep-2026 19:39:31 SKIPPED (Allowed t_ground values are not checked in casatasks)
02-Sep-2026 19:39:31
02-Sep-2026 19:39:31 test_task_simobserve.py::simobserve_badinputs::testBad_Tsky
02-Sep-2026 19:39:31 Test bad t_sky
02-Sep-2026 19:39:31 SKIPPED (Allowed t_sky values are not checked in casatasks)
02-Sep-2026 19:39:31
02-Sep-2026 19:39:32 2026-09-02 23:39:33        SEVERE        simobserve::::casa        Task simobserve raised an exception of class RuntimeError with the following message: Couldn't find antennalist: badname
02-Sep-2026 19:39:33 test_task_simobserve.py::simobserve_badinputs::testBad_antennalist
02-Sep-2026 19:39:33 Test bad antennalist name
02-Sep-2026 19:39:33
02-Sep-2026 19:39:33 PASSED
02-Sep-2026 19:39:33
02-Sep-2026 19:39:34 2026-09-02 23:39:34        WARN        simobserve::::        Illegal reference frame string.  Reference string set to DEFAULT
02-Sep-2026 19:39:34 Could not understand Direction frame...defaulting to J2000
02-Sep-2026 19:39:34 Could not understand Direction frame...defaulting to J2000
02-Sep-2026 19:39:35 2026-09-02 23:39:35        WARN        simobserve::noise::casa        Applying thermal noise ...
02-Sep-2026 19:39:35 2026-09-02 23:39:35        WARN        simobserve::noise::casa        Copying simobserve_bad/simobserve_bad.alma.out10.ms to simobserve_bad/simobserve_bad.alma.out10.noisy.ms and adding thermal noise ...
02-Sep-2026 19:39:35 2026-09-02 23:39:35        WARN        noise::CTPatchedInterp::interpolate        In caltable simobserve_bad.alma.out10.noisy.T.cal_sim_temp (Tf Jones):
02-Sep-2026 19:39:35 2026-09-02 23:39:35        WARN        noise::CTPatchedInterp::interpolate+         Insufficient solution channel sampling (nchan=1) for frequency-dependent LINEAR interpolation
02-Sep-2026 19:39:35 2026-09-02 23:39:35        WARN        noise::CTPatchedInterp::interpolate+         of calibration for MS spw=0; using NEAREST instead.
02-Sep-2026 19:39:35 test_task_simobserve.py::simobserve_badinputs::testBad_caldirection
02-Sep-2026 19:39:35 Test bad caldirection ('J3000' is defaulted to 'J2000')
02-Sep-2026 19:39:35
02-Sep-2026 19:39:35 PASSED
02-Sep-2026 19:39:35
02-Sep-2026 19:39:36 2026-09-02 23:39:37        SEVERE        simobserve::::casa        Task simobserve raised an exception of class Exception with the following message: can't interpret '5bad' as a CASA quantity
02-Sep-2026 19:39:36 test_task_simobserve.py::simobserve_badinputs::testBad_calflux
02-Sep-2026 19:39:36 Test bad calflux
02-Sep-2026 19:39:36
02-Sep-2026 19:39:36 PASSED
02-Sep-2026 19:39:36
02-Sep-2026 19:39:36 test_task_simobserve.py::simobserve_badinputs::testBad_comp_nchan
02-Sep-2026 19:39:36 Test bad comp_nchan
02-Sep-2026 19:39:36
02-Sep-2026 19:39:36 PASSED
02-Sep-2026 19:39:36
02-Sep-2026 19:39:36 2026-09-02 23:39:37        WARN        simobserve::simutil::casa        Your complist 'badname' could not be found.
02-Sep-2026 19:39:36 2026-09-02 23:39:37        SEVERE        simobserve::::casa        Task simobserve raised an exception of class Exception with the following message: No sky input found.  At least one of skymodel or complist must exist.
02-Sep-2026 19:39:36 test_task_simobserve.py::simobserve_badinputs::testBad_complist
02-Sep-2026 19:39:36 Test bad complist name
02-Sep-2026 19:39:36
02-Sep-2026 19:39:36 PASSED
02-Sep-2026 19:39:36
02-Sep-2026 19:39:38 2026-09-02 23:39:38        SEVERE        simobserve::::casa        Task simobserve raised an exception of class RuntimeError with the following message: Quantum::operator- unequal units 'GHz, 'arcsec'
02-Sep-2026 19:39:38 test_task_simobserve.py::simobserve_badinputs::testBad_compwidth
02-Sep-2026 19:39:38 Test bad compwidth
02-Sep-2026 19:39:38
02-Sep-2026 19:39:38 PASSED
02-Sep-2026 19:39:38
02-Sep-2026 19:39:39 2026-09-02 23:39:39        WARN        simobserve::::        Illegal reference frame string.  Reference string set to DEFAULT
02-Sep-2026 19:39:39 2026-09-02 23:39:39        WARN        simobserve::::        Illegal reference frame string.  Reference string set to DEFAULT
02-Sep-2026 19:39:39 Could not understand Direction frame...defaulting to J2000
02-Sep-2026 19:39:40 2026-09-02 23:39:40        WARN        simobserve::::        Illegal reference frame string.  Reference string set to DEFAULT
02-Sep-2026 19:39:40 2026-09-02 23:39:40        WARN        simobserve::noise::casa        Applying thermal noise ...
02-Sep-2026 19:39:40 2026-09-02 23:39:40        WARN        simobserve::noise::casa        Copying simobserve_bad/simobserve_bad.alma.out10.ms to simobserve_bad/simobserve_bad.alma.out10.noisy.ms and adding thermal noise ...
02-Sep-2026 19:39:40 2026-09-02 23:39:40        WARN        noise::CTPatchedInterp::interpolate        In caltable simobserve_bad.alma.out10.noisy.T.cal_sim_temp (Tf Jones):
02-Sep-2026 19:39:40 2026-09-02 23:39:40        WARN        noise::CTPatchedInterp::interpolate+         Insufficient solution channel sampling (nchan=1) for frequency-dependent LINEAR interpolation
02-Sep-2026 19:39:40 2026-09-02 23:39:40        WARN        noise::CTPatchedInterp::interpolate+         of calibration for MS spw=0; using NEAREST instead.
02-Sep-2026 19:39:40 test_task_simobserve.py::simobserve_badinputs::testBad_direction
02-Sep-2026 19:39:40 Test bad direction ('J3000' is defaulted to 'J2000')
02-Sep-2026 19:39:40
02-Sep-2026 19:39:40 PASSED
02-Sep-2026 19:39:40
02-Sep-2026 19:39:40 test_task_simobserve.py::simobserve_badinputs::testBad_graphics
02-Sep-2026 19:39:40 Test bad graphics selection
02-Sep-2026 19:39:40 SKIPPED (Allowed graphics values are not checked in casatasks)
02-Sep-2026 19:39:40
02-Sep-2026 19:39:42 2026-09-02 23:39:42        SEVERE        simobserve::::casa        Task simobserve raised an exception of class Exception with the following message: Cannot interpret your hourangle parameter badname as a time quantity e.g. '5h', 30min'
02-Sep-2026 19:39:42 test_task_simobserve.py::simobserve_badinputs::testBad_hourangle
02-Sep-2026 19:39:42 Test bad hourangle
02-Sep-2026 19:39:42
02-Sep-2026 19:39:42 PASSED
02-Sep-2026 19:39:42
02-Sep-2026 19:39:42 2026-09-02 23:39:42        SEVERE        simobserve::::casa        Task simobserve raised an exception of class ValueError with the following message: could not convert string to float: '5bad'
02-Sep-2026 19:39:42 test_task_simobserve.py::simobserve_badinputs::testBad_inbright
02-Sep-2026 19:39:42 Test bad inbright
02-Sep-2026 19:39:42
02-Sep-2026 19:39:42 PASSED
02-Sep-2026 19:39:42
02-Sep-2026 19:39:42 2026-09-02 23:39:42        SEVERE                Error in QuantumHolder::fromString with input string "5bad": Illegal input units or format
02-Sep-2026 19:39:42 2026-09-02 23:39:42        SEVERE        +         in converting quantity
02-Sep-2026 19:39:42 2026-09-02 23:39:42        SEVERE                Exception Reported: Error in QuantumHolder::fromString with input string "5bad": Illegal input units or format
02-Sep-2026 19:39:42 2026-09-02 23:39:42        SEVERE        +         in converting quantity
02-Sep-2026 19:39:42 2026-09-02 23:39:42        SEVERE        simobserve::::casa        Task simobserve raised an exception of class RuntimeError with the following message: Error in QuantumHolder::fromString with input string "5bad": Illegal input units or format
02-Sep-2026 19:39:42 2026-09-02 23:39:42        SEVERE        simobserve::::casa+         in converting quantity
02-Sep-2026 19:39:42 test_task_simobserve.py::simobserve_badinputs::testBad_incell
02-Sep-2026 19:39:42 Test bad incell
02-Sep-2026 19:39:42
02-Sep-2026 19:39:42 PASSED
02-Sep-2026 19:39:42
02-Sep-2026 19:39:44 2026-09-02 23:39:45        WARN        simobserve::noise::casa        Applying thermal noise ...
02-Sep-2026 19:39:44 2026-09-02 23:39:45        WARN        simobserve::noise::casa        Copying simobserve_bad/simobserve_bad.alma.out10.ms to simobserve_bad/simobserve_bad.alma.out10.noisy.ms and adding thermal noise ...
02-Sep-2026 19:39:44 2026-09-02 23:39:45        WARN        noise::CTPatchedInterp::interpolate        In caltable simobserve_bad.alma.out10.noisy.T.cal_sim_temp (Tf Jones):
02-Sep-2026 19:39:44 2026-09-02 23:39:45        WARN        noise::CTPatchedInterp::interpolate+         Insufficient solution channel sampling (nchan=1) for frequency-dependent LINEAR interpolation
02-Sep-2026 19:39:44 2026-09-02 23:39:45        WARN        noise::CTPatchedInterp::interpolate+         of calibration for MS spw=0; using NEAREST instead.
02-Sep-2026 19:39:44 test_task_simobserve.py::simobserve_badinputs::testBad_incenter
02-Sep-2026 19:39:44 Test bad incenter
02-Sep-2026 19:39:44
02-Sep-2026 19:39:44 PASSED
02-Sep-2026 19:39:44
02-Sep-2026 19:39:44 2026-09-02 23:39:45        WARN        simobserve::::        Illegal reference frame string.  Reference string set to DEFAULT
02-Sep-2026 19:39:44 2026-09-02 23:39:45        WARN        simobserve::::        Illegal reference frame string.  Reference string set to DEFAULT
02-Sep-2026 19:39:45 2026-09-02 23:39:46        WARN        simobserve::::        Illegal reference frame string.  Reference string set to DEFAULT
02-Sep-2026 19:39:46 Could not understand Direction frame...defaulting to J2000
02-Sep-2026 19:39:46 2026-09-02 23:39:47        WARN        simobserve::::        Illegal reference frame string.  Reference string set to DEFAULT
02-Sep-2026 19:39:47 2026-09-02 23:39:47        WARN        simobserve::noise::casa        Applying thermal noise ...
02-Sep-2026 19:39:47 2026-09-02 23:39:47        WARN        simobserve::noise::casa        Copying simobserve_bad/simobserve_bad.alma.out10.ms to simobserve_bad/simobserve_bad.alma.out10.noisy.ms and adding thermal noise ...
02-Sep-2026 19:39:47 2026-09-02 23:39:47        WARN        noise::CTPatchedInterp::interpolate        In caltable simobserve_bad.alma.out10.noisy.T.cal_sim_temp (Tf Jones):
02-Sep-2026 19:39:47 2026-09-02 23:39:47        WARN        noise::CTPatchedInterp::interpolate+         Insufficient solution channel sampling (nchan=1) for frequency-dependent LINEAR interpolation
02-Sep-2026 19:39:47 2026-09-02 23:39:47        WARN        noise::CTPatchedInterp::interpolate+         of calibration for MS spw=0; using NEAREST instead.
02-Sep-2026 19:39:47 test_task_simobserve.py::simobserve_badinputs::testBad_indirection
02-Sep-2026 19:39:47 Test bad indirection ('J3000' is defaulted to 'J2000')
02-Sep-2026 19:39:47
02-Sep-2026 19:39:47 PASSED
02-Sep-2026 19:39:47
02-Sep-2026 19:39:48 2026-09-02 23:39:49        SEVERE        simobserve::::        Exception Reported: (/private/var/folders/60/83wxljbx2vlfbx_hy0yfv8rc0000gn/T/build-via-sdist-p6cmjsts/casatools-6.7.7.6a14194.dev5/src/tools/simulator/simulator_cmpt.cc : 221) Failed AlwaysAssert qIntTime.getValue("s")>=0
02-Sep-2026 19:39:48 2026-09-02 23:39:49        SEVERE        simobserve::::casa        Task simobserve raised an exception of class RuntimeError with the following message: (/private/var/folders/60/83wxljbx2vlfbx_hy0yfv8rc0000gn/T/build-via-sdist-p6cmjsts/casatools-6.7.7.6a14194.dev5/src/tools/simulator/simulator_cmpt.cc : 221) Failed AlwaysAssert qIntTime.getValue("s")>=0
02-Sep-2026 19:39:48 test_task_simobserve.py::simobserve_badinputs::testBad_integration
02-Sep-2026 19:39:48 Test bad integration
02-Sep-2026 19:39:48
02-Sep-2026 19:39:48 PASSED
02-Sep-2026 19:39:48
02-Sep-2026 19:39:51 2026-09-02 23:39:51        WARN        simobserve::noise::casa        Applying thermal noise ...
02-Sep-2026 19:39:51 2026-09-02 23:39:51        WARN        simobserve::noise::casa        Copying simobserve_bad/simobserve_bad.alma.out10.ms to simobserve_bad/simobserve_bad.alma.out10.noisy.ms and adding thermal noise ...
02-Sep-2026 19:39:51 2026-09-02 23:39:51        WARN        noise::CTPatchedInterp::interpolate        In caltable simobserve_bad.alma.out10.noisy.T.cal_sim_temp (Tf Jones):
02-Sep-2026 19:39:51 2026-09-02 23:39:51        WARN        noise::CTPatchedInterp::interpolate+         Insufficient solution channel sampling (nchan=1) for frequency-dependent LINEAR interpolation
02-Sep-2026 19:39:51 2026-09-02 23:39:51        WARN        noise::CTPatchedInterp::interpolate+         of calibration for MS spw=0; using NEAREST instead.
02-Sep-2026 19:39:51 test_task_simobserve.py::simobserve_badinputs::testBad_inwidth
02-Sep-2026 19:39:51 Test bad inwidth
02-Sep-2026 19:39:51
02-Sep-2026 19:39:51 PASSED
02-Sep-2026 19:39:51
02-Sep-2026 19:39:51 test_task_simobserve.py::simobserve_badinputs::testBad_leakage
02-Sep-2026 19:39:51 Test bad leakage
02-Sep-2026 19:39:51 SKIPPED (Allowed leakage values are not checked in casatasks)
02-Sep-2026 19:39:51
02-Sep-2026 19:39:52 2026-09-02 23:39:53        SEVERE        simobserve::::casa        Task simobserve raised an exception of class Exception with the following message: can't interpret '5bad' as a CASA quantity
02-Sep-2026 19:39:52 test_task_simobserve.py::simobserve_badinputs::testBad_mapsize
02-Sep-2026 19:39:52 Test bad mapsize
02-Sep-2026 19:39:52
02-Sep-2026 19:39:52 PASSED
02-Sep-2026 19:39:52
02-Sep-2026 19:39:52 test_task_simobserve.py::simobserve_badinputs::testBad_maptype
02-Sep-2026 19:39:52 Test bad maptype
02-Sep-2026 19:39:52 SKIPPED (Allowed maptype values are not checked in casatasks.)
02-Sep-2026 19:39:52
02-Sep-2026 19:39:52 test_task_simobserve.py::simobserve_badinputs::testBad_noisetype
02-Sep-2026 19:39:52 Test bad thermalnoise type
02-Sep-2026 19:39:52 SKIPPED (Allowed noisetype values are not checked in casatasks.)
02-Sep-2026 19:39:52
02-Sep-2026 19:39:52 test_task_simobserve.py::simobserve_badinputs::testBad_obsmode
02-Sep-2026 19:39:52 Test bad obsmode
02-Sep-2026 19:39:52 SKIPPED (Allowed obsmode types are not checked in casatasks)
02-Sep-2026 19:39:52
02-Sep-2026 19:39:53 2026-09-02 23:39:54        SEVERE        simobserve::::casa        Task simobserve raised an exception of class RuntimeError with the following message: Can't find pointing file badname
02-Sep-2026 19:39:53 test_task_simobserve.py::simobserve_badinputs::testBad_ptgfile
02-Sep-2026 19:39:53 Test bad ptgfile name
02-Sep-2026 19:39:53
02-Sep-2026 19:39:53 PASSED
02-Sep-2026 19:39:53
02-Sep-2026 19:39:53 test_task_simobserve.py::simobserve_badinputs::testBad_pwv
02-Sep-2026 19:39:53 Test bad user_pwv
02-Sep-2026 19:39:53 SKIPPED (Allowed user_pwv values are not checked in casatasks)
02-Sep-2026 19:39:53
02-Sep-2026 19:39:55 2026-09-02 23:39:55        SEVERE        simobserve::::casa        Task simobserve raised an exception of class RuntimeError with the following message: Invalid reference date 05/21
02-Sep-2026 19:39:55 test_task_simobserve.py::simobserve_badinputs::testBad_refdate
02-Sep-2026 19:39:55 Test bad refdate
02-Sep-2026 19:39:55
02-Sep-2026 19:39:55 PASSED
02-Sep-2026 19:39:55
02-Sep-2026 19:39:55 test_task_simobserve.py::simobserve_badinputs::testBad_sdant
02-Sep-2026 19:39:55 Test bad sdant (non-numeric sdant)
02-Sep-2026 19:39:55
02-Sep-2026 19:39:55 PASSED
02-Sep-2026 19:39:55
02-Sep-2026 19:39:56 2026-09-02 23:39:57        SEVERE        simobserve::::casa        Task simobserve raised an exception of class RuntimeError with the following message: Couldn't find antennalist: badname
02-Sep-2026 19:39:56 test_task_simobserve.py::simobserve_badinputs::testBad_sdantlist
02-Sep-2026 19:39:56 Test bad sdantlist name
02-Sep-2026 19:39:56
02-Sep-2026 19:39:56 PASSED
02-Sep-2026 19:39:56
02-Sep-2026 19:39:56 2026-09-02 23:39:57        WARN        simobserve::simutil::casa        Your skymodel 'badname' could not be found.
02-Sep-2026 19:39:56 2026-09-02 23:39:57        SEVERE        simobserve::::casa        Task simobserve raised an exception of class Exception with the following message: No sky input found.  At least one of skymodel or complist must exist.
02-Sep-2026 19:39:56 test_task_simobserve.py::simobserve_badinputs::testBad_skymodel
02-Sep-2026 19:39:56 Test bad skymodel name
02-Sep-2026 19:39:56
02-Sep-2026 19:39:56 PASSED
02-Sep-2026 19:39:56
02-Sep-2026 19:39:57 2026-09-02 23:39:58        SEVERE        simobserve::::casa        Task simobserve raised an exception of class Exception with the following message: can't interpret '5bad' as a CASA quantity
02-Sep-2026 19:39:57 test_task_simobserve.py::simobserve_badinputs::testBad_spacing
02-Sep-2026 19:39:57 Test bad pointingspacing
02-Sep-2026 19:39:57
02-Sep-2026 19:39:57 PASSED
02-Sep-2026 19:39:57
02-Sep-2026 19:39:57 test_task_simobserve.py::simobserve_badinputs::testBad_tau0
02-Sep-2026 19:39:57 Test bad tau0
02-Sep-2026 19:39:57 SKIPPED (Allowed tau0 values are not checked in casatasks)
02-Sep-2026 19:39:57
02-Sep-2026 19:39:59 2026-09-02 23:40:00        SEVERE        simobserve::::casa        Task simobserve raised an exception of class ValueError with the following message: Negative totaltime is not allowed.
02-Sep-2026 19:39:59 test_task_simobserve.py::simobserve_badinputs::testBad_totaltime
02-Sep-2026 19:39:59 Test bad totaltime
02-Sep-2026 19:39:59
02-Sep-2026 19:39:59 PASSED
02-Sep-2026 19:39:59
02-Sep-2026 19:39:59 2026-09-02 23:40:00        SEVERE        simobserve::::casa        Task simobserve raised an exception of class Exception with the following message: At least one of skymodel or complist must be set.
02-Sep-2026 19:39:59 test_task_simobserve.py::simobserve_badinputs::test_default
02-Sep-2026 19:39:59 Test Default parameter set. Neigher skymodel nor complist
02-Sep-2026 19:39:59
02-Sep-2026 19:39:59 PASSED
02-Sep-2026 19:39:59
02-Sep-2026 19:39:59 2026-09-02 23:40:00        SEVERE        simobserve::::casa        Task simobserve raised an exception of class FileNotFoundError with the following message: [Errno 2] No such file or directory: ''
02-Sep-2026 19:39:59 test_task_simobserve.py::simobserve_badinputs::test_noProject
02-Sep-2026 19:39:59 Test no project name
02-Sep-2026 19:39:59
02-Sep-2026 19:39:59 PASSED
02-Sep-2026 19:39:59
02-Sep-2026 19:39:59 2026-09-02 23:40:00        SEVERE        simutil::componentlist::open        Exception Reported: core5ps.skymodel is non existant or is not a componentlist table
02-Sep-2026 19:39:59 2026-09-02 23:40:00        SEVERE        simobserve::::casa        Task simobserve raised an exception of class RuntimeError with the following message: core5ps.skymodel is non existant or is not a componentlist table
02-Sep-2026 19:39:59 test_task_simobserve.py::simobserve_badinputs::test_notComp
02-Sep-2026 19:39:59 Test non-components list complist
02-Sep-2026 19:39:59
02-Sep-2026 19:39:59 PASSED
02-Sep-2026 19:39:59
02-Sep-2026 19:39:59 2026-09-02 23:40:00        SEVERE        image::newimagefromfile (file /private/var/folders/60/83wxljbx2vlfbx_hy0yfv8rc0000gn/T/build-via-sdist-p6cmjsts/casatools-6.7.7.6a14194.dev5/src/tools/image/image_cmpt.cc, line 4110)        Exception Reported: Exception: Unable to open image core5ps.clist.
02-Sep-2026 19:39:59 2026-09-02 23:40:00        SEVERE        image::newimagefromfile (file /private/var/folders/60/83wxljbx2vlfbx_hy0yfv8rc0000gn/T/build-via-sdist-p6cmjsts/casatools-6.7.7.6a14194.dev5/src/tools/image/image_cmpt.cc, line 4110)+        ... thrown by static ITUPLE casa::ImageFactory::fromFile(const String &, Bool) at File: /Users/casaci/bamboohome/xml-data/build-dir/CASASPECS-DBC248-BPO15AP312/casa6/casatools/src/code/imageanalysis/ImageAnalysis/ImageFactory2.cc, line: 289
02-Sep-2026 19:39:59 2026-09-02 23:40:00        SEVERE        simobserve::::casa        Task simobserve raised an exception of class RuntimeError with the following message: Exception: Unable to open image core5ps.clist.
02-Sep-2026 19:39:59 2026-09-02 23:40:00        SEVERE        simobserve::::casa+        ... thrown by static ITUPLE casa::ImageFactory::fromFile(const String &, Bool) at File: /Users/casaci/bamboohome/xml-data/build-dir/CASASPECS-DBC248-BPO15AP312/casa6/casatools/src/code/imageanalysis/ImageAnalysis/ImageFactory2.cc, line: 289
02-Sep-2026 19:39:59 test_task_simobserve.py::simobserve_badinputs::test_notImage
02-Sep-2026 19:39:59 Test non-image skymodel
02-Sep-2026 19:39:59
02-Sep-2026 19:39:59 PASSED
02-Sep-2026 19:39:59
02-Sep-2026 19:40:00 2026-09-02 23:40:01        SEVERE        simobserve::::casa        Task simobserve raised an exception of class Exception with the following message: No valid lines found in pointing file
02-Sep-2026 19:40:00 test_task_simobserve.py::simobserve_badinputs::test_notPtgfile
02-Sep-2026 19:40:00 Test nonconforming ptgfile
02-Sep-2026 19:40:00
02-Sep-2026 19:40:00 PASSED
02-Sep-2026 19:40:00
02-Sep-2026 19:40:01 2026-09-02 23:40:02        SEVERE        simobserve::::casa        Task simobserve raised an exception of class RuntimeError with the following message: correlator = ACASpec is not allowed for telescope = ALMA. Allowed values: BLC BLC_4x4bit
02-Sep-2026 19:40:01 test_task_simobserve.py::simobserve_correlator_ALMA::test_correlator_ACASpec_With_ALMA
02-Sep-2026 19:40:01 Test: correlator = ACASpec is not allowed for telescope = ALMA.
02-Sep-2026 19:40:01
02-Sep-2026 19:40:01 PASSED
02-Sep-2026 19:40:01
02-Sep-2026 19:40:02 2026-09-02 23:40:03        SEVERE        simobserve::::casa        Task simobserve raised an exception of class RuntimeError with the following message: correlator = ACA is not allowed for telescope = ALMA. Allowed values: BLC BLC_4x4bit
02-Sep-2026 19:40:02 test_task_simobserve.py::simobserve_correlator_ALMA::test_correlator_ACA_With_ALMA
02-Sep-2026 19:40:02 Test: correlator = ACA is not allowed for telescope = ALMA.
02-Sep-2026 19:40:02
02-Sep-2026 19:40:02 PASSED
02-Sep-2026 19:40:02
02-Sep-2026 19:40:04 test_task_simobserve.py::simobserve_correlator_ALMA::test_correlator_BLC_4x4bit_With_ALMA
02-Sep-2026 19:40:04 Test: correlator = BLC_4x4bitfor telescope = ALMA.
02-Sep-2026 19:40:04
02-Sep-2026 19:40:04 PASSED
02-Sep-2026 19:40:04
02-Sep-2026 19:40:06 test_task_simobserve.py::simobserve_correlator_ALMA::test_correlator_BLC_With_ALMA
02-Sep-2026 19:40:06 Test: correlator = BLC for telescope = ALMA.
02-Sep-2026 19:40:06
02-Sep-2026 19:40:06 PASSED
02-Sep-2026 19:40:06
02-Sep-2026 19:40:08 test_task_simobserve.py::simobserve_correlator_ALMASD::test_correlator_ACASpec_With_ALMASD
02-Sep-2026 19:40:08 Test: correlator = ACASpec obsmode = sd 
02-Sep-2026 19:40:08
02-Sep-2026 19:40:08 PASSED
02-Sep-2026 19:40:08
02-Sep-2026 19:40:11 test_task_simobserve.py::simobserve_correlator_ALMASD::test_correlator_ACA_With_ALMASD
02-Sep-2026 19:40:11 Test: correlator = ACA obsmode = sd 
02-Sep-2026 19:40:11
02-Sep-2026 19:40:11 PASSED
02-Sep-2026 19:40:11
02-Sep-2026 19:40:12 2026-09-02 23:40:12        SEVERE        simobserve::::casa        Task simobserve raised an exception of class RuntimeError with the following message: correlator = BLC_4x4bit is not allowed for telescope = ALMASD. Allowed values: ACASpec ACA
02-Sep-2026 19:40:12 test_task_simobserve.py::simobserve_correlator_ALMASD::test_correlator_BLC_4x4bit_With_ALMASD
02-Sep-2026 19:40:12 Test: correlator = BLC_4x4bit is not allowed for obsmode = sd 
02-Sep-2026 19:40:12
02-Sep-2026 19:40:12 PASSED
02-Sep-2026 19:40:12
02-Sep-2026 19:40:13 2026-09-02 23:40:14        SEVERE        simobserve::::casa        Task simobserve raised an exception of class RuntimeError with the following message: correlator = BLC is not allowed for telescope = ALMASD. Allowed values: ACASpec ACA
02-Sep-2026 19:40:13 test_task_simobserve.py::simobserve_correlator_ALMASD::test_correlator_BLC_With_ALMASD
02-Sep-2026 19:40:13 Test: correlator = BLC is not allowed for obsmode = sd 
02-Sep-2026 19:40:13
02-Sep-2026 19:40:13 PASSED
02-Sep-2026 19:40:13
02-Sep-2026 19:40:14 test_task_simobserve.py::simobserve_correlator_ACA::test_correlator_ACASpec_With_ACA
02-Sep-2026 19:40:14 Failing task since return code of [/Users/casaci/bamboohome/temp/CASASPECS-DEVTESTFULLPY312110-TTAAM14P-1-ScriptBuildTask-7299810318470079955.sh] was 143 while expected 0
02-Sep-2026 19:40:14 Finished task 'Test wheel' with result: Failed
02-Sep-2026 19:40:14 Running post build plugin 'Docker Container Cleanup'
02-Sep-2026 19:40:14 Running post build plugin 'NCover Results Collector'
02-Sep-2026 19:40:14 Force Stop build feature is enabled for current plan. Either Bamboo has detected the build has hung or it has been manually stopped.
02-Sep-2026 19:40:14 Attempting to generate stack trace and terminate spawned sub-processes of process id: 691
02-Sep-2026 19:40:14 Running post build plugin 'Build Results Label Collector'
02-Sep-2026 19:40:14 Running post build plugin 'Clover Results Collector'
02-Sep-2026 19:40:14 Running post build plugin 'npm Cache Cleanup'
02-Sep-2026 19:40:14 Running post build plugin 'Artifact Copier'
02-Sep-2026 19:40:14 Publishing an artifact: requirements.txt
02-Sep-2026 19:40:14 Found related process: pid: 83859 ppid: 1 pgid: 677 %cpu: 0.0 %mem: 0.1 cmd: /opt/local/Library/Frameworks/Python.framework/Versions/3.12/Resources/Python.app/Contents/MacOS/Python
02-Sep-2026 19:40:14 getStackTraceAndKillRelatedProcesses for 1 processes
02-Sep-2026 19:40:14 Executing kill -3 83859
02-Sep-2026 19:40:14 Finished publishing of artifact Non required job artifact Http Compression On : [requirements.txt], patterns: [requirements.txt] anchored at: [wheeldirectory/] in 82.10 ms
02-Sep-2026 19:40:14 Publishing an artifact: Workdir
02-Sep-2026 19:40:14 Failing as no matching files has been found and empty artifacts are not allowed.
02-Sep-2026 19:40:14 Unable to publish artifact [Workdir]:
02-Sep-2026 19:40:14 The artifact hasn't been successfully published after 14.77 ms
02-Sep-2026 19:40:14 Finalising the build...
02-Sep-2026 19:40:14 Stopping timer.
02-Sep-2026 19:40:14 Build CASASPECS-DEVTESTFULLPY312110-TTAAM14P-1 completed.
02-Sep-2026 19:40:14 Running on server: post build plugin 'Build Hanging Detection Configuration'
02-Sep-2026 19:40:14 Running on server: post build plugin 'NCover Results Collector'
02-Sep-2026 19:40:14 Running on server: post build plugin 'Build Labeller'
02-Sep-2026 19:40:14 Running on server: post build plugin 'Clover Delta Calculator'
02-Sep-2026 19:40:14 Running on server: post build plugin 'Maven Dependencies Postprocessor'
02-Sep-2026 19:40:14 All post build plugins have finished
02-Sep-2026 19:40:15 Generating build results summary...
02-Sep-2026 19:40:15 Saving build results to disk...
02-Sep-2026 19:40:15 Store variable context...
02-Sep-2026 19:40:15 Finished building CASASPECS-DEVTESTFULLPY312110-TTAAM14P-1.
02-Sep-2026 19:40:19 Killing: 83859
02-Sep-2026 19:40:19 Executing kill 83859
02-Sep-2026 19:40:24 Force Stop build feature is enabled for current plan. Either Bamboo has detected the build has hung or it has been manually stopped.
02-Sep-2026 19:40:24 Has finished generating stack trace and terminating spawned sub-processes of process id: 691

Older logs

Filename Actions
plan-163709792-TTAAM14P-1.log.1 Download or view