Build: #1 failed
Job: Test Tools macOS 15 Py3.12 was successful
Build log
The build generated 53,425 lines of output. The output is too long and has been truncated to the last 1,000 lines. Download or view full build log.
| 02-Sep-2026 10:46:24 | test_tool_msmetadata.py::msmetadata_test::test_bandwidths |
| 02-Sep-2026 10:46:24 | Test bandwidths() |
| 02-Sep-2026 10:46:24 | PASSED |
| 02-Sep-2026 10:46:24 | |
| 02-Sep-2026 10:46:24 | 2026-09-02 14:46:25 INFO msmetadata_cmpt.cc::open Performing internal consistency checks on /opt/casa/data/casatestdata/unittest/msmetadata/MSMetaData.ms... |
| 02-Sep-2026 10:46:24 | test_tool_msmetadata.py::msmetadata_test::test_chanavgspws |
| 02-Sep-2026 10:46:24 | Test chanavgspws() |
| 02-Sep-2026 10:46:24 | PASSED |
| 02-Sep-2026 10:46:24 | |
| 02-Sep-2026 10:46:24 | 2026-09-02 14:46:25 INFO msmetadata_cmpt.cc::open Performing internal consistency checks on /opt/casa/data/casatestdata/unittest/msmetadata/MSMetaData.ms... |
| 02-Sep-2026 10:46:24 | test_tool_msmetadata.py::msmetadata_test::test_chaneffbws |
| 02-Sep-2026 10:46:24 | Test chaneffbws() |
| 02-Sep-2026 10:46:24 | PASSED |
| 02-Sep-2026 10:46:24 | |
| 02-Sep-2026 10:46:24 | 2026-09-02 14:46:25 INFO msmetadata_cmpt.cc::open Performing internal consistency checks on /opt/casa/data/casatestdata/unittest/msmetadata/MSMetaData.ms... |
| 02-Sep-2026 10:46:24 | test_tool_msmetadata.py::msmetadata_test::test_chanres |
| 02-Sep-2026 10:46:24 | Test chanres() |
| 02-Sep-2026 10:46:24 | PASSED |
| 02-Sep-2026 10:46:24 | |
| 02-Sep-2026 10:46:24 | 2026-09-02 14:46:25 INFO msmetadata_cmpt.cc::open Performing internal consistency checks on /opt/casa/data/casatestdata/unittest/msmetadata/MSMetaData.ms... |
| 02-Sep-2026 10:46:24 | 2026-09-02 14:46:25 SEVERE msmetadata_cmpt.cc::chanwidths Exception Reported: Exception: Spectral window ID 50 out of range, must be nonnegative and less than or equal to 39. |
| 02-Sep-2026 10:46:24 | 2026-09-02 14:46:25 SEVERE msmetadata_cmpt.cc::chanwidths+ ... thrown by void casac::msmetadata::_checkSpwId(int, bool) const at File: /private/var/folders/60/83wxljbx2vlfbx_hy0yfv8rc0000gn/T/build-via-sdist-togn0tdc/casatools-6.7.7.7a14875.dev1/src/tools/msmetadata/msmetadata_cmpt.cc, line: 2449 |
| 02-Sep-2026 10:46:24 | 2026-09-02 14:46:25 SEVERE msmetadata_cmpt.cc::chanwidths Exception Reported: Exception: Spectral window ID -2 out of range, must be nonnegative and less than or equal to 39. |
| 02-Sep-2026 10:46:24 | 2026-09-02 14:46:25 SEVERE msmetadata_cmpt.cc::chanwidths+ ... thrown by void casac::msmetadata::_checkSpwId(int, bool) const at File: /private/var/folders/60/83wxljbx2vlfbx_hy0yfv8rc0000gn/T/build-via-sdist-togn0tdc/casatools-6.7.7.7a14875.dev1/src/tools/msmetadata/msmetadata_cmpt.cc, line: 2449 |
| 02-Sep-2026 10:46:24 | 2026-09-02 14:46:25 SEVERE msmetadata_cmpt.cc::chanwidths Exception Reported: Tool is not attached to an MS. Use open() |
| 02-Sep-2026 10:46:24 | 2026-09-02 14:46:25 SEVERE msmetadata_cmpt.cc::chanfreqs Exception Reported: Tool is not attached to an MS. Use open() |
| 02-Sep-2026 10:46:24 | 2026-09-02 14:46:25 SEVERE msmetadata_cmpt.cc::meanfreq Exception Reported: Tool is not attached to an MS. Use open() |
| 02-Sep-2026 10:46:24 | 2026-09-02 14:46:25 SEVERE msmetadata_cmpt.cc::sideband Exception Reported: Tool is not attached to an MS. Use open() |
| 02-Sep-2026 10:46:24 | 2026-09-02 14:46:25 SEVERE msmetadata_cmpt.cc::effexposuretime Exception Reported: Tool is not attached to an MS. Use open() |
| 02-Sep-2026 10:46:24 | test_tool_msmetadata.py::msmetadata_test::test_chanwidths |
| 02-Sep-2026 10:46:24 | Test chanwidths() |
| 02-Sep-2026 10:46:24 | PASSED |
| 02-Sep-2026 10:46:24 | |
| 02-Sep-2026 10:46:24 | 2026-09-02 14:46:25 INFO msmetadata_cmpt.cc::open Performing internal consistency checks on /opt/casa/data/casatestdata/unittest/msmetadata/MSMetaData.ms... |
| 02-Sep-2026 10:46:24 | test_tool_msmetadata.py::msmetadata_test::test_corrbit |
| 02-Sep-2026 10:46:24 | Test corrbit() |
| 02-Sep-2026 10:46:24 | PASSED |
| 02-Sep-2026 10:46:24 | |
| 02-Sep-2026 10:46:24 | 2026-09-02 14:46:25 INFO msmetadata_cmpt.cc::open Performing internal consistency checks on /opt/casa/data/casatestdata/unittest/msmetadata/MSMetaData.ms... |
| 02-Sep-2026 10:46:24 | 2026-09-02 14:46:25 SEVERE msmetadata_cmpt.cc::corrprodsforpol Exception Reported: Exception: Polarization ID cannot be negative. |
| 02-Sep-2026 10:46:24 | 2026-09-02 14:46:25 SEVERE msmetadata_cmpt.cc::corrprodsforpol+ ... thrown by void casac::msmetadata::_checkPolId(int, bool) const at File: /private/var/folders/60/83wxljbx2vlfbx_hy0yfv8rc0000gn/T/build-via-sdist-togn0tdc/casatools-6.7.7.7a14875.dev1/src/tools/msmetadata/msmetadata_cmpt.cc, line: 2459 |
| 02-Sep-2026 10:46:24 | 2026-09-02 14:46:25 SEVERE msmetadata_cmpt.cc::corrprodsforpol Exception Reported: Exception: Polarization ID 2 out of range, must be less than 2. |
| 02-Sep-2026 10:46:24 | 2026-09-02 14:46:25 SEVERE msmetadata_cmpt.cc::corrprodsforpol+ ... thrown by void casac::msmetadata::_checkPolId(int, bool) const at File: /private/var/folders/60/83wxljbx2vlfbx_hy0yfv8rc0000gn/T/build-via-sdist-togn0tdc/casatools-6.7.7.7a14875.dev1/src/tools/msmetadata/msmetadata_cmpt.cc, line: 2458 |
| 02-Sep-2026 10:46:24 | test_tool_msmetadata.py::msmetadata_test::test_corrprodsforpol |
| 02-Sep-2026 10:46:24 | Test msmetadata.corrprodssforpol() |
| 02-Sep-2026 10:46:24 | PASSED |
| 02-Sep-2026 10:46:24 | |
| 02-Sep-2026 10:46:24 | 2026-09-02 14:46:25 INFO msmetadata_cmpt.cc::open Performing internal consistency checks on /opt/casa/data/casatestdata/unittest/msmetadata/MSMetaData.ms... |
| 02-Sep-2026 10:46:24 | 2026-09-02 14:46:25 SEVERE msmetadata_cmpt.cc::corrtypesforpol Exception Reported: Exception: Polarization ID cannot be negative. |
| 02-Sep-2026 10:46:24 | 2026-09-02 14:46:25 SEVERE msmetadata_cmpt.cc::corrtypesforpol+ ... thrown by void casac::msmetadata::_checkPolId(int, bool) const at File: /private/var/folders/60/83wxljbx2vlfbx_hy0yfv8rc0000gn/T/build-via-sdist-togn0tdc/casatools-6.7.7.7a14875.dev1/src/tools/msmetadata/msmetadata_cmpt.cc, line: 2459 |
| 02-Sep-2026 10:46:24 | 2026-09-02 14:46:25 SEVERE msmetadata_cmpt.cc::corrtypesforpol Exception Reported: Exception: Polarization ID 2 out of range, must be less than 2. |
| 02-Sep-2026 10:46:24 | 2026-09-02 14:46:25 SEVERE msmetadata_cmpt.cc::corrtypesforpol+ ... thrown by void casac::msmetadata::_checkPolId(int, bool) const at File: /private/var/folders/60/83wxljbx2vlfbx_hy0yfv8rc0000gn/T/build-via-sdist-togn0tdc/casatools-6.7.7.7a14875.dev1/src/tools/msmetadata/msmetadata_cmpt.cc, line: 2458 |
| 02-Sep-2026 10:46:24 | test_tool_msmetadata.py::msmetadata_test::test_corrtypesforpol |
| 02-Sep-2026 10:46:24 | Test msmetadata.corrtypesforpol() |
| 02-Sep-2026 10:46:24 | PASSED |
| 02-Sep-2026 10:46:24 | |
| 02-Sep-2026 10:46:24 | 2026-09-02 14:46:25 INFO msmetadata_cmpt.cc::open Performing internal consistency checks on /opt/casa/data/casatestdata/unittest/msmetadata/MSMetaData.ms... |
| 02-Sep-2026 10:46:24 | test_tool_msmetadata.py::msmetadata_test::test_datadescids |
| 02-Sep-2026 10:46:24 | Test datadescids() |
| 02-Sep-2026 10:46:24 | PASSED |
| 02-Sep-2026 10:46:24 | |
| 02-Sep-2026 10:46:24 | 2026-09-02 14:46:25 INFO msmetadata_cmpt.cc::open Performing internal consistency checks on /opt/casa/data/casatestdata/unittest/msmetadata/MSMetaData.ms... |
| 02-Sep-2026 10:46:24 | 2026-09-02 14:46:25 SEVERE msmetadata_cmpt.cc::exposuretime Exception Reported: Exception: MS has no data description ID for spectral window ID 0 and polarization ID 0. |
| 02-Sep-2026 10:46:24 | 2026-09-02 14:46:25 SEVERE msmetadata_cmpt.cc::exposuretime+ ... thrown by record *casac::msmetadata::exposuretime(long, long, long, long, long) at File: /private/var/folders/60/83wxljbx2vlfbx_hy0yfv8rc0000gn/T/build-via-sdist-togn0tdc/casatools-6.7.7.7a14875.dev1/src/tools/msmetadata/msmetadata_cmpt.cc, line: 821 |
| 02-Sep-2026 10:46:24 | 2026-09-02 14:46:25 INFO MSMetaData::_computeScanAndSubScanProperties Computing scan and subscan properties... |
| 02-Sep-2026 10:46:24 | test_tool_msmetadata.py::msmetadata_test::test_exposuretime |
| 02-Sep-2026 10:46:24 | Test exposuretime() |
| 02-Sep-2026 10:46:24 | PASSED |
| 02-Sep-2026 10:46:24 | |
| 02-Sep-2026 10:46:24 | 2026-09-02 14:46:25 INFO msmetadata_cmpt.cc::open Performing internal consistency checks on /opt/casa/data/casatestdata/unittest/msmetadata/MSMetaData.ms... |
| 02-Sep-2026 10:46:24 | test_tool_msmetadata.py::msmetadata_test::test_fdmspws |
| 02-Sep-2026 10:46:24 | Test fdmspws() |
| 02-Sep-2026 10:46:24 | PASSED |
| 02-Sep-2026 10:46:24 | |
| 02-Sep-2026 10:46:24 | 2026-09-02 14:46:25 INFO msmetadata_cmpt.cc::open Performing internal consistency checks on /opt/casa/data/casatestdata/unittest/msmetadata/MSMetaData.ms... |
| 02-Sep-2026 10:46:24 | test_tool_msmetadata.py::msmetadata_test::test_fieldnames |
| 02-Sep-2026 10:46:24 | PASSED |
| 02-Sep-2026 10:46:24 | |
| 02-Sep-2026 10:46:24 | 2026-09-02 14:46:25 INFO msmetadata_cmpt.cc::open Performing internal consistency checks on /opt/casa/data/casatestdata/unittest/msmetadata/MSMetaData.ms... |
| 02-Sep-2026 10:46:24 | test_tool_msmetadata.py::msmetadata_test::test_fieldsforintent |
| 02-Sep-2026 10:46:24 | Test fieldsforintent() |
| 02-Sep-2026 10:46:24 | PASSED |
| 02-Sep-2026 10:46:24 | |
| 02-Sep-2026 10:46:24 | 2026-09-02 14:46:25 INFO msmetadata_cmpt.cc::open Performing internal consistency checks on /opt/casa/data/casatestdata/unittest/msmetadata/MSMetaData.ms... |
| 02-Sep-2026 10:46:24 | test_tool_msmetadata.py::msmetadata_test::test_fieldsforname |
| 02-Sep-2026 10:46:24 | Test fieldforname() |
| 02-Sep-2026 10:46:24 | PASSED |
| 02-Sep-2026 10:46:24 | |
| 02-Sep-2026 10:46:24 | 2026-09-02 14:46:25 INFO msmetadata_cmpt.cc::open Performing internal consistency checks on /opt/casa/data/casatestdata/unittest/msmetadata/MSMetaData.ms... |
| 02-Sep-2026 10:46:24 | 2026-09-02 14:46:25 INFO MSMetaData::_computeScanAndSubScanProperties Computing scan and subscan properties... |
| 02-Sep-2026 10:46:24 | 2026-09-02 14:46:25 SEVERE msmetadata_cmpt.cc::fieldsforscans Exception Reported: Exception: When asmap is true, both obsid and arrayid must be nonnegative. |
| 02-Sep-2026 10:46:24 | 2026-09-02 14:46:25 SEVERE msmetadata_cmpt.cc::fieldsforscans+ ... thrown by variant *casac::msmetadata::fieldsforscans(const vector<long> &, const bool, long, long, bool) at File: /private/var/folders/60/83wxljbx2vlfbx_hy0yfv8rc0000gn/T/build-via-sdist-togn0tdc/casatools-6.7.7.7a14875.dev1/src/tools/msmetadata/msmetadata_cmpt.cc, line: 947 |
| 02-Sep-2026 10:46:24 | test_tool_msmetadata.py::msmetadata_test::test_fieldsforscan |
| 02-Sep-2026 10:46:24 | Test fieldsforscan() and fieldsforscans() |
| 02-Sep-2026 10:46:24 | PASSED |
| 02-Sep-2026 10:46:24 | |
| 02-Sep-2026 10:46:24 | 2026-09-02 14:46:25 INFO msmetadata_cmpt.cc::open Performing internal consistency checks on /opt/casa/data/casatestdata/unittest/msmetadata/MSMetaData.ms... |
| 02-Sep-2026 10:46:24 | test_tool_msmetadata.py::msmetadata_test::test_fieldsforsource |
| 02-Sep-2026 10:46:24 | Test fieldsforsource() and fieldsforsources() |
| 02-Sep-2026 10:46:24 | PASSED |
| 02-Sep-2026 10:46:24 | |
| 02-Sep-2026 10:46:24 | 2026-09-02 14:46:25 INFO msmetadata_cmpt.cc::open Performing internal consistency checks on /opt/casa/data/casatestdata/unittest/msmetadata/MSMetaData.ms... |
| 02-Sep-2026 10:46:24 | 2026-09-02 14:46:25 INFO MSMetaData::_computeScanAndSubScanProperties Computing scan and subscan properties... |
| 02-Sep-2026 10:46:24 | test_tool_msmetadata.py::msmetadata_test::test_fieldsforspw |
| 02-Sep-2026 10:46:24 | Test fieldsforspw() |
| 02-Sep-2026 10:46:24 | PASSED |
| 02-Sep-2026 10:46:24 | |
| 02-Sep-2026 10:46:24 | 2026-09-02 14:46:25 INFO msmetadata_cmpt.cc::open Performing internal consistency checks on /opt/casa/data/casatestdata/unittest/msmetadata/MSMetaData.ms... |
| 02-Sep-2026 10:46:24 | test_tool_msmetadata.py::msmetadata_test::test_fieldsfortimes |
| 02-Sep-2026 10:46:24 | Test fieldsfortimes() |
| 02-Sep-2026 10:46:24 | PASSED |
| 02-Sep-2026 10:46:24 | |
| 02-Sep-2026 10:46:24 | 2026-09-02 14:46:25 INFO msmetadata_cmpt.cc::open Performing internal consistency checks on /opt/casa/data/casatestdata/unittest/msmetadata/MSMetaData.ms... |
| 02-Sep-2026 10:46:24 | test_tool_msmetadata.py::msmetadata_test::test_intents |
| 02-Sep-2026 10:46:24 | Test intents() |
| 02-Sep-2026 10:46:24 | PASSED |
| 02-Sep-2026 10:46:24 | |
| 02-Sep-2026 10:46:24 | 2026-09-02 14:46:25 INFO msmetadata_cmpt.cc::open Performing internal consistency checks on /opt/casa/data/casatestdata/unittest/msmetadata/MSMetaData.ms... |
| 02-Sep-2026 10:46:24 | test_tool_msmetadata.py::msmetadata_test::test_intentsforfield |
| 02-Sep-2026 10:46:24 | Test intentsforfield() |
| 02-Sep-2026 10:46:24 | PASSED |
| 02-Sep-2026 10:46:24 | |
| 02-Sep-2026 10:46:24 | 2026-09-02 14:46:25 INFO msmetadata_cmpt.cc::open Performing internal consistency checks on /opt/casa/data/casatestdata/unittest/msmetadata/MSMetaData.ms... |
| 02-Sep-2026 10:46:24 | 2026-09-02 14:46:25 INFO MSMetaData::_computeScanAndSubScanProperties Computing scan and subscan properties... |
| 02-Sep-2026 10:46:24 | test_tool_msmetadata.py::msmetadata_test::test_intentsforscan |
| 02-Sep-2026 10:46:24 | Test intentsforscan() |
| 02-Sep-2026 10:46:24 | PASSED |
| 02-Sep-2026 10:46:24 | |
| 02-Sep-2026 10:46:24 | 2026-09-02 14:46:25 INFO msmetadata_cmpt.cc::open Performing internal consistency checks on /opt/casa/data/casatestdata/unittest/msmetadata/MSMetaData.ms... |
| 02-Sep-2026 10:46:24 | test_tool_msmetadata.py::msmetadata_test::test_intentsforspw |
| 02-Sep-2026 10:46:24 | Test intentsforspw() |
| 02-Sep-2026 10:46:24 | PASSED |
| 02-Sep-2026 10:46:24 | |
| 02-Sep-2026 10:46:24 | 2026-09-02 14:46:25 INFO msmetadata_cmpt.cc::open Performing internal consistency checks on /opt/casa/data/casatestdata/unittest/msmetadata/MSMetaData.ms... |
| 02-Sep-2026 10:46:24 | test_tool_msmetadata.py::msmetadata_test::test_name |
| 02-Sep-2026 10:46:24 | Test name(), CAS-6817 |
| 02-Sep-2026 10:46:24 | PASSED |
| 02-Sep-2026 10:46:24 | |
| 02-Sep-2026 10:46:24 | 2026-09-02 14:46:25 INFO msmetadata_cmpt.cc::open Performing internal consistency checks on /opt/casa/data/casatestdata/unittest/msmetadata/MSMetaData.ms... |
| 02-Sep-2026 10:46:24 | test_tool_msmetadata.py::msmetadata_test::test_namesforfields |
| 02-Sep-2026 10:46:24 | Test namesforfields() |
| 02-Sep-2026 10:46:24 | PASSED |
| 02-Sep-2026 10:46:24 | |
| 02-Sep-2026 10:46:24 | 2026-09-02 14:46:25 INFO msmetadata_cmpt.cc::open Performing internal consistency checks on /opt/casa/data/casatestdata/unittest/msmetadata/MSMetaData.ms... |
| 02-Sep-2026 10:46:24 | 2026-09-02 14:46:25 SEVERE msmetadata_cmpt.cc::namesforspws Exception Reported: Exception: Spectral window ID must be nonnegative.. |
| 02-Sep-2026 10:46:24 | 2026-09-02 14:46:25 SEVERE msmetadata_cmpt.cc::namesforspws+ ... thrown by vector<string> casac::msmetadata::namesforspws(const variant &) at File: /private/var/folders/60/83wxljbx2vlfbx_hy0yfv8rc0000gn/T/build-via-sdist-togn0tdc/casatools-6.7.7.7a14875.dev1/src/tools/msmetadata/msmetadata_cmpt.cc, line: 1171 |
| 02-Sep-2026 10:46:24 | 2026-09-02 14:46:25 SEVERE msmetadata_cmpt.cc::namesforspws Exception Reported: Exception: All spectral window IDs must be nonnegative.. |
| 02-Sep-2026 10:46:24 | 2026-09-02 14:46:25 SEVERE msmetadata_cmpt.cc::namesforspws+ ... thrown by vector<string> casac::msmetadata::namesforspws(const variant &) at File: /private/var/folders/60/83wxljbx2vlfbx_hy0yfv8rc0000gn/T/build-via-sdist-togn0tdc/casatools-6.7.7.7a14875.dev1/src/tools/msmetadata/msmetadata_cmpt.cc, line: 1184 |
| 02-Sep-2026 10:46:24 | 2026-09-02 14:46:25 SEVERE msmetadata_cmpt.cc::namesforspws Exception Reported: Exception: Spectral window ID must be less than total number of spws. |
| 02-Sep-2026 10:46:24 | 2026-09-02 14:46:25 SEVERE msmetadata_cmpt.cc::namesforspws+ ... thrown by vector<string> casac::msmetadata::namesforspws(const variant &) at File: /private/var/folders/60/83wxljbx2vlfbx_hy0yfv8rc0000gn/T/build-via-sdist-togn0tdc/casatools-6.7.7.7a14875.dev1/src/tools/msmetadata/msmetadata_cmpt.cc, line: 1175 |
| 02-Sep-2026 10:46:24 | 2026-09-02 14:46:25 SEVERE msmetadata_cmpt.cc::namesforspws Exception Reported: Exception: All spectral window IDs must be less than the total number of spws. |
| 02-Sep-2026 10:46:24 | 2026-09-02 14:46:25 SEVERE msmetadata_cmpt.cc::namesforspws+ ... thrown by vector<string> casac::msmetadata::namesforspws(const variant &) at File: /private/var/folders/60/83wxljbx2vlfbx_hy0yfv8rc0000gn/T/build-via-sdist-togn0tdc/casatools-6.7.7.7a14875.dev1/src/tools/msmetadata/msmetadata_cmpt.cc, line: 1189 |
| 02-Sep-2026 10:46:24 | test_tool_msmetadata.py::msmetadata_test::test_namesforspws |
| 02-Sep-2026 10:46:24 | Test namesforspws() |
| 02-Sep-2026 10:46:24 | PASSED |
| 02-Sep-2026 10:46:24 | |
| 02-Sep-2026 10:46:24 | 2026-09-02 14:46:25 INFO msmetadata_cmpt.cc::open Performing internal consistency checks on /opt/casa/data/casatestdata/unittest/msmetadata/MSMetaData.ms... |
| 02-Sep-2026 10:46:24 | test_tool_msmetadata.py::msmetadata_test::test_nantennas |
| 02-Sep-2026 10:46:24 | Test nantennas() |
| 02-Sep-2026 10:46:24 | PASSED |
| 02-Sep-2026 10:46:24 | |
| 02-Sep-2026 10:46:24 | 2026-09-02 14:46:25 INFO msmetadata_cmpt.cc::open Performing internal consistency checks on /opt/casa/data/casatestdata/unittest/msmetadata/MSMetaData.ms... |
| 02-Sep-2026 10:46:24 | test_tool_msmetadata.py::msmetadata_test::test_narrays |
| 02-Sep-2026 10:46:24 | Test narrays() |
| 02-Sep-2026 10:46:24 | PASSED |
| 02-Sep-2026 10:46:24 | |
| 02-Sep-2026 10:46:24 | 2026-09-02 14:46:25 INFO msmetadata_cmpt.cc::open Performing internal consistency checks on /opt/casa/data/casatestdata/unittest/msmetadata/MSMetaData.ms... |
| 02-Sep-2026 10:46:24 | test_tool_msmetadata.py::msmetadata_test::test_nbaselines |
| 02-Sep-2026 10:46:24 | Verify nbaselines() |
| 02-Sep-2026 10:46:24 | PASSED |
| 02-Sep-2026 10:46:24 | |
| 02-Sep-2026 10:46:24 | 2026-09-02 14:46:25 INFO msmetadata_cmpt.cc::open Performing internal consistency checks on /opt/casa/data/casatestdata/unittest/msmetadata/MSMetaData.ms... |
| 02-Sep-2026 10:46:24 | test_tool_msmetadata.py::msmetadata_test::test_ncorrforpol |
| 02-Sep-2026 10:46:24 | Test msmetadata.ncorrforpol() |
| 02-Sep-2026 10:46:24 | PASSED |
| 02-Sep-2026 10:46:24 | |
| 02-Sep-2026 10:46:24 | 2026-09-02 14:46:25 INFO msmetadata_cmpt.cc::open Performing internal consistency checks on /opt/casa/data/casatestdata/unittest/msmetadata/MSMetaData.ms... |
| 02-Sep-2026 10:46:24 | test_tool_msmetadata.py::msmetadata_test::test_nfields |
| 02-Sep-2026 10:46:24 | Test nfields() |
| 02-Sep-2026 10:46:24 | PASSED |
| 02-Sep-2026 10:46:24 | |
| 02-Sep-2026 10:46:24 | 2026-09-02 14:46:25 INFO msmetadata_cmpt.cc::open Performing internal consistency checks on /opt/casa/data/casatestdata/unittest/msmetadata/MSMetaData.ms... |
| 02-Sep-2026 10:46:24 | test_tool_msmetadata.py::msmetadata_test::test_nobservations |
| 02-Sep-2026 10:46:24 | Test nobservations() |
| 02-Sep-2026 10:46:24 | PASSED |
| 02-Sep-2026 10:46:24 | |
| 02-Sep-2026 10:46:24 | 2026-09-02 14:46:25 INFO msmetadata_cmpt.cc::open Performing internal consistency checks on /opt/casa/data/casatestdata/unittest/msmetadata/MSMetaData.ms... |
| 02-Sep-2026 10:46:24 | 2026-09-02 14:46:25 INFO MSMetaData::_computeScanAndSubScanProperties Computing scan and subscan properties... |
| 02-Sep-2026 10:46:24 | test_tool_msmetadata.py::msmetadata_test::test_nscans |
| 02-Sep-2026 10:46:24 | Test nscans() |
| 02-Sep-2026 10:46:24 | PASSED |
| 02-Sep-2026 10:46:24 | |
| 02-Sep-2026 10:46:24 | 2026-09-02 14:46:25 INFO msmetadata_cmpt.cc::open Performing internal consistency checks on /opt/casa/data/casatestdata/unittest/msmetadata/MSMetaData.ms... |
| 02-Sep-2026 10:46:24 | test_tool_msmetadata.py::msmetadata_test::test_nsources |
| 02-Sep-2026 10:46:24 | PASSED |
| 02-Sep-2026 10:46:24 | |
| 02-Sep-2026 10:46:24 | 2026-09-02 14:46:25 INFO msmetadata_cmpt.cc::open Performing internal consistency checks on /opt/casa/data/casatestdata/unittest/msmetadata/MSMetaData.ms... |
| 02-Sep-2026 10:46:24 | test_tool_msmetadata.py::msmetadata_test::test_nspw |
| 02-Sep-2026 10:46:24 | Test nspw() |
| 02-Sep-2026 10:46:24 | PASSED |
| 02-Sep-2026 10:46:24 | |
| 02-Sep-2026 10:46:24 | 2026-09-02 14:46:25 INFO msmetadata_cmpt.cc::open Performing internal consistency checks on /opt/casa/data/casatestdata/unittest/msmetadata/MSMetaData.ms... |
| 02-Sep-2026 10:46:24 | test_tool_msmetadata.py::msmetadata_test::test_nstates |
| 02-Sep-2026 10:46:24 | Test nstates() |
| 02-Sep-2026 10:46:24 | PASSED |
| 02-Sep-2026 10:46:24 | |
| 02-Sep-2026 10:46:24 | 2026-09-02 14:46:25 INFO msmetadata_cmpt.cc::open Performing internal consistency checks on /opt/casa/data/casatestdata/unittest/msmetadata/MSMetaData.ms... |
| 02-Sep-2026 10:46:24 | test_tool_msmetadata.py::msmetadata_test::test_nvis |
| 02-Sep-2026 10:46:24 | Test nvis() |
| 02-Sep-2026 10:46:24 | PASSED |
| 02-Sep-2026 10:46:24 | |
| 02-Sep-2026 10:46:24 | 2026-09-02 14:46:25 INFO msmetadata_cmpt.cc::open Performing internal consistency checks on /opt/casa/data/casatestdata/unittest/msmetadata/MSMetaData.ms... |
| 02-Sep-2026 10:46:24 | test_tool_msmetadata.py::msmetadata_test::test_observers |
| 02-Sep-2026 10:46:24 | Test msmetadata.observers() |
| 02-Sep-2026 10:46:24 | PASSED |
| 02-Sep-2026 10:46:24 | |
| 02-Sep-2026 10:46:24 | 2026-09-02 14:46:25 INFO msmetadata_cmpt.cc::open Performing internal consistency checks on /opt/casa/data/casatestdata/unittest/msmetadata/MSMetaData.ms... |
| 02-Sep-2026 10:46:24 | test_tool_msmetadata.py::msmetadata_test::test_pointingdirection |
| 02-Sep-2026 10:46:24 | Test pointingdirection(), CAS-5878 |
| 02-Sep-2026 10:46:24 | PASSED |
| 02-Sep-2026 10:46:24 | |
| 02-Sep-2026 10:46:24 | 2026-09-02 14:46:25 INFO msmetadata_cmpt.cc::open Performing internal consistency checks on /opt/casa/data/casatestdata/unittest/msmetadata/MSMetaData.ms... |
| 02-Sep-2026 10:46:24 | test_tool_msmetadata.py::msmetadata_test::test_polidfordatadesc |
| 02-Sep-2026 10:46:24 | Test msmetadata.polidfordatadesc() |
| 02-Sep-2026 10:46:24 | PASSED |
| 02-Sep-2026 10:46:24 | |
| 02-Sep-2026 10:46:24 | 2026-09-02 14:46:25 INFO msmetadata_cmpt.cc::open Performing internal consistency checks on /opt/casa/data/casatestdata/unittest/msmetadata/MSMetaData.ms... |
| 02-Sep-2026 10:46:24 | test_tool_msmetadata.py::msmetadata_test::test_projects |
| 02-Sep-2026 10:46:24 | Test msmetadata.projects() |
| 02-Sep-2026 10:46:24 | PASSED |
| 02-Sep-2026 10:46:24 | |
| 02-Sep-2026 10:46:24 | 2026-09-02 14:46:25 INFO msmetadata_cmpt.cc::open Performing internal consistency checks on /opt/casa/data/casatestdata/unittest/msmetadata/MSMetaData.ms... |
| 02-Sep-2026 10:46:24 | test_tool_msmetadata.py::msmetadata_test::test_propermotions |
| 02-Sep-2026 10:46:24 | Test msmetadata.propermotions() |
| 02-Sep-2026 10:46:24 | PASSED |
| 02-Sep-2026 10:46:24 | |
| 02-Sep-2026 10:46:24 | 2026-09-02 14:46:25 INFO msmetadata_cmpt.cc::open Performing internal consistency checks on /opt/casa/data/casatestdata/unittest/msmetadata/MSMetaData.ms... |
| 02-Sep-2026 10:46:24 | test_tool_msmetadata.py::msmetadata_test::test_refdir |
| 02-Sep-2026 10:46:24 | Test msmetadata.refdir() |
| 02-Sep-2026 10:46:24 | PASSED |
| 02-Sep-2026 10:46:24 | |
| 02-Sep-2026 10:46:24 | 2026-09-02 14:46:25 INFO msmetadata_cmpt.cc::open Performing internal consistency checks on /opt/casa/data/casatestdata/unittest/msmetadata/MSMetaData.ms... |
| 02-Sep-2026 10:46:24 | test_tool_msmetadata.py::msmetadata_test::test_reffreq |
| 02-Sep-2026 10:46:24 | Test msmetadata.reffreq |
| 02-Sep-2026 10:46:24 | PASSED |
| 02-Sep-2026 10:46:24 | |
| 02-Sep-2026 10:46:24 | 2026-09-02 14:46:25 INFO msmetadata_cmpt.cc::open Performing internal consistency checks on /opt/casa/data/casatestdata/unittest/msmetadata/MSMetaData.ms... |
| 02-Sep-2026 10:46:24 | 2026-09-02 14:46:25 SEVERE msmetadata_cmpt.cc::restfreqs Exception Reported: Exception: sourceid cannot be negative. |
| 02-Sep-2026 10:46:24 | 2026-09-02 14:46:25 SEVERE msmetadata_cmpt.cc::restfreqs+ ... thrown by variant *casac::msmetadata::restfreqs(long, long) at File: /private/var/folders/60/83wxljbx2vlfbx_hy0yfv8rc0000gn/T/build-via-sdist-togn0tdc/casatools-6.7.7.7a14875.dev1/src/tools/msmetadata/msmetadata_cmpt.cc, line: 1521 |
| 02-Sep-2026 10:46:24 | 2026-09-02 14:46:25 SEVERE msmetadata_cmpt.cc::restfreqs Exception Reported: Exception: Spectral window ID -1 out of range, must be nonnegative and less than or equal to 39. |
| 02-Sep-2026 10:46:24 | 2026-09-02 14:46:25 SEVERE msmetadata_cmpt.cc::restfreqs+ ... thrown by void casac::msmetadata::_checkSpwId(int, bool) const at File: /private/var/folders/60/83wxljbx2vlfbx_hy0yfv8rc0000gn/T/build-via-sdist-togn0tdc/casatools-6.7.7.7a14875.dev1/src/tools/msmetadata/msmetadata_cmpt.cc, line: 2449 |
| 02-Sep-2026 10:46:24 | 2026-09-02 14:46:25 SEVERE msmetadata_cmpt.cc::restfreqs Exception Reported: Exception: SOURCE table does not contain a row with SOURCE_ID=50 and SPECTRAL_WINDOW_ID=0. |
| 02-Sep-2026 10:46:24 | 2026-09-02 14:46:25 SEVERE msmetadata_cmpt.cc::restfreqs+ ... thrown by variant *casac::msmetadata::restfreqs(long, long) at File: /private/var/folders/60/83wxljbx2vlfbx_hy0yfv8rc0000gn/T/build-via-sdist-togn0tdc/casatools-6.7.7.7a14875.dev1/src/tools/msmetadata/msmetadata_cmpt.cc, line: 1531 |
| 02-Sep-2026 10:46:24 | 2026-09-02 14:46:25 SEVERE msmetadata_cmpt.cc::restfreqs Exception Reported: Exception: Spectral window ID 50 out of range, must be nonnegative and less than or equal to 39. |
| 02-Sep-2026 10:46:24 | 2026-09-02 14:46:25 SEVERE msmetadata_cmpt.cc::restfreqs+ ... thrown by void casac::msmetadata::_checkSpwId(int, bool) const at File: /private/var/folders/60/83wxljbx2vlfbx_hy0yfv8rc0000gn/T/build-via-sdist-togn0tdc/casatools-6.7.7.7a14875.dev1/src/tools/msmetadata/msmetadata_cmpt.cc, line: 2449 |
| 02-Sep-2026 10:46:24 | test_tool_msmetadata.py::msmetadata_test::test_restfreqs |
| 02-Sep-2026 10:46:24 | Test restfreqs() |
| 02-Sep-2026 10:46:24 | PASSED |
| 02-Sep-2026 10:46:24 | |
| 02-Sep-2026 10:46:24 | 2026-09-02 14:46:25 INFO msmetadata_cmpt.cc::open Performing internal consistency checks on /opt/casa/data/casatestdata/unittest/msmetadata/MSMetaData.ms... |
| 02-Sep-2026 10:46:25 | 2026-09-02 14:46:25 INFO msmetadata_cmpt.cc::open Performing internal consistency checks on /opt/casa/data/casatestdata/unittest/msmetadata/uid___A002_Xa1f062_X37e3.ms... |
| 02-Sep-2026 10:46:25 | 2026-09-02 14:46:25 INFO msmetadata_cmpt.cc::open Performing internal consistency checks on /opt/casa/data/casatestdata/unittest/msmetadata/uid___A002_X7b13df_X68f.ms... |
| 02-Sep-2026 10:46:25 | test_tool_msmetadata.py::msmetadata_test::test_rxbands |
| 02-Sep-2026 10:46:25 | CAS-13973 test rxbands() method |
| 02-Sep-2026 10:46:25 | PASSED |
| 02-Sep-2026 10:46:25 | |
| 02-Sep-2026 10:46:25 | 2026-09-02 14:46:25 INFO msmetadata_cmpt.cc::open Performing internal consistency checks on /opt/casa/data/casatestdata/unittest/msmetadata/MSMetaData.ms... |
| 02-Sep-2026 10:46:25 | 2026-09-02 14:46:25 INFO MSMetaData::_computeScanAndSubScanProperties Computing scan and subscan properties... |
| 02-Sep-2026 10:46:25 | test_tool_msmetadata.py::msmetadata_test::test_scannumbers |
| 02-Sep-2026 10:46:25 | Test scannumbers() |
| 02-Sep-2026 10:46:25 | PASSED |
| 02-Sep-2026 10:46:25 | |
| 02-Sep-2026 10:46:25 | 2026-09-02 14:46:25 INFO msmetadata_cmpt.cc::open Performing internal consistency checks on /opt/casa/data/casatestdata/unittest/msmetadata/MSMetaData.ms... |
| 02-Sep-2026 10:46:25 | 2026-09-02 14:46:25 INFO MSMetaData::_computeScanAndSubScanProperties Computing scan and subscan properties... |
| 02-Sep-2026 10:46:25 | test_tool_msmetadata.py::msmetadata_test::test_scansforfield |
| 02-Sep-2026 10:46:25 | Test scansforfield() and scansforfields() |
| 02-Sep-2026 10:46:25 | PASSED |
| 02-Sep-2026 10:46:25 | |
| 02-Sep-2026 10:46:25 | 2026-09-02 14:46:25 INFO msmetadata_cmpt.cc::open Performing internal consistency checks on /opt/casa/data/casatestdata/unittest/msmetadata/MSMetaData.ms... |
| 02-Sep-2026 10:46:25 | 2026-09-02 14:46:25 INFO MSMetaData::_computeScanAndSubScanProperties Computing scan and subscan properties... |
| 02-Sep-2026 10:46:25 | test_tool_msmetadata.py::msmetadata_test::test_scansforintent |
| 02-Sep-2026 10:46:25 | Test scansforintent() |
| 02-Sep-2026 10:46:25 | PASSED |
| 02-Sep-2026 10:46:25 | |
| 02-Sep-2026 10:46:25 | 2026-09-02 14:46:25 INFO msmetadata_cmpt.cc::open Performing internal consistency checks on /opt/casa/data/casatestdata/unittest/msmetadata/MSMetaData.ms... |
| 02-Sep-2026 10:46:25 | 2026-09-02 14:46:25 INFO MSMetaData::_computeScanAndSubScanProperties Computing scan and subscan properties... |
| 02-Sep-2026 10:46:25 | test_tool_msmetadata.py::msmetadata_test::test_scansforspw |
| 02-Sep-2026 10:46:25 | Test scansforspw() and scansforspws() |
| 02-Sep-2026 10:46:25 | PASSED |
| 02-Sep-2026 10:46:25 | |
| 02-Sep-2026 10:46:25 | 2026-09-02 14:46:25 INFO msmetadata_cmpt.cc::open Performing internal consistency checks on /opt/casa/data/casatestdata/unittest/msmetadata/MSMetaData.ms... |
| 02-Sep-2026 10:46:25 | 2026-09-02 14:46:25 INFO MSMetaData::_computeScanAndSubScanProperties Computing scan and subscan properties... |
| 02-Sep-2026 10:46:25 | test_tool_msmetadata.py::msmetadata_test::test_scansforstate |
| 02-Sep-2026 10:46:25 | Test scansforstate() |
| 02-Sep-2026 10:46:25 | PASSED |
| 02-Sep-2026 10:46:25 | |
| 02-Sep-2026 10:46:25 | 2026-09-02 14:46:25 INFO msmetadata_cmpt.cc::open Performing internal consistency checks on /opt/casa/data/casatestdata/unittest/msmetadata/MSMetaData.ms... |
| 02-Sep-2026 10:46:25 | 2026-09-02 14:46:25 INFO MSMetaData::_computeScanAndSubScanProperties Computing scan and subscan properties... |
| 02-Sep-2026 10:46:25 | test_tool_msmetadata.py::msmetadata_test::test_scansfortimes |
| 02-Sep-2026 10:46:25 | Test scansfortimes() |
| 02-Sep-2026 10:46:25 | PASSED |
| 02-Sep-2026 10:46:25 | |
| 02-Sep-2026 10:46:25 | 2026-09-02 14:46:25 INFO msmetadata_cmpt.cc::open Performing internal consistency checks on /opt/casa/data/casatestdata/unittest/msmetadata/MSMetaData.ms... |
| 02-Sep-2026 10:46:25 | test_tool_msmetadata.py::msmetadata_test::test_schedule |
| 02-Sep-2026 10:46:25 | Test msmetadata.schedule() |
| 02-Sep-2026 10:46:25 | PASSED |
| 02-Sep-2026 10:46:25 | |
| 02-Sep-2026 10:46:25 | 2026-09-02 14:46:25 INFO msmetadata_cmpt.cc::open Performing internal consistency checks on /opt/casa/data/casatestdata/unittest/msmetadata/MSMetaData.ms... |
| 02-Sep-2026 10:46:25 | test_tool_msmetadata.py::msmetadata_test::test_sideband |
| 02-Sep-2026 10:46:25 | PASSED |
| 02-Sep-2026 10:46:25 | |
| 02-Sep-2026 10:46:25 | 2026-09-02 14:46:25 INFO msmetadata_cmpt.cc::open Performing internal consistency checks on /opt/casa/data/casatestdata/unittest/msmetadata/MSMetaData.ms... |
| 02-Sep-2026 10:46:25 | test_tool_msmetadata.py::msmetadata_test::test_sourcedirs |
| 02-Sep-2026 10:46:25 | Test msmetadata.sourcedirs() |
| 02-Sep-2026 10:46:25 | PASSED |
| 02-Sep-2026 10:46:25 | |
| 02-Sep-2026 10:46:25 | 2026-09-02 14:46:25 INFO msmetadata_cmpt.cc::open Performing internal consistency checks on /opt/casa/data/casatestdata/unittest/msmetadata/MSMetaData.ms... |
| 02-Sep-2026 10:46:25 | 2026-09-02 14:46:25 SEVERE msmetadata_cmpt.cc::sourceidforfield Exception Reported: Exception: Antenna ID -1 out of range, must be less than 6. |
| 02-Sep-2026 10:46:25 | 2026-09-02 14:46:25 SEVERE msmetadata_cmpt.cc::sourceidforfield+ ... thrown by void casac::msmetadata::_checkFieldId(int, bool) const at File: /private/var/folders/60/83wxljbx2vlfbx_hy0yfv8rc0000gn/T/build-via-sdist-togn0tdc/casatools-6.7.7.7a14875.dev1/src/tools/msmetadata/msmetadata_cmpt.cc, line: 2430 |
| 02-Sep-2026 10:46:25 | 2026-09-02 14:46:25 SEVERE msmetadata_cmpt.cc::sourceidforfield Exception Reported: Exception: Antenna ID 6 out of range, must be less than 6. |
| 02-Sep-2026 10:46:25 | 2026-09-02 14:46:25 SEVERE msmetadata_cmpt.cc::sourceidforfield+ ... thrown by void casac::msmetadata::_checkFieldId(int, bool) const at File: /private/var/folders/60/83wxljbx2vlfbx_hy0yfv8rc0000gn/T/build-via-sdist-togn0tdc/casatools-6.7.7.7a14875.dev1/src/tools/msmetadata/msmetadata_cmpt.cc, line: 2430 |
| 02-Sep-2026 10:46:25 | test_tool_msmetadata.py::msmetadata_test::test_sourceidforfield |
| 02-Sep-2026 10:46:25 | Test msmetadata.sourceidforfield() |
| 02-Sep-2026 10:46:25 | PASSED |
| 02-Sep-2026 10:46:25 | |
| 02-Sep-2026 10:46:25 | 2026-09-02 14:46:25 INFO msmetadata_cmpt.cc::open Performing internal consistency checks on /opt/casa/data/casatestdata/unittest/msmetadata/MSMetaData.ms... |
| 02-Sep-2026 10:46:25 | test_tool_msmetadata.py::msmetadata_test::test_sourceidsfromsourcetable |
| 02-Sep-2026 10:46:25 | Test msmetadata.sourceidsfromsourcetable() |
| 02-Sep-2026 10:46:25 | PASSED |
| 02-Sep-2026 10:46:25 | |
| 02-Sep-2026 10:46:25 | 2026-09-02 14:46:25 INFO msmetadata_cmpt.cc::open Performing internal consistency checks on /opt/casa/data/casatestdata/unittest/msmetadata/MSMetaData.ms... |
| 02-Sep-2026 10:46:25 | test_tool_msmetadata.py::msmetadata_test::test_sourcenames |
| 02-Sep-2026 10:46:25 | Test msmetadata.sourcenames() |
| 02-Sep-2026 10:46:25 | PASSED |
| 02-Sep-2026 10:46:25 | |
| 02-Sep-2026 10:46:25 | 2026-09-02 14:46:25 INFO msmetadata_cmpt.cc::open Performing internal consistency checks on /opt/casa/data/casatestdata/unittest/msmetadata/MSMetaData.ms... |
| 02-Sep-2026 10:46:25 | test_tool_msmetadata.py::msmetadata_test::test_spwfordatadesc |
| 02-Sep-2026 10:46:25 | Test msmetadata.spwfordatadesc() |
| 02-Sep-2026 10:46:25 | PASSED |
| 02-Sep-2026 10:46:25 | |
| 02-Sep-2026 10:46:25 | 2026-09-02 14:46:25 INFO msmetadata_cmpt.cc::open Performing internal consistency checks on /opt/casa/data/casatestdata/unittest/msmetadata/MSMetaData.ms... |
| 02-Sep-2026 10:46:25 | test_tool_msmetadata.py::msmetadata_test::test_spwsforbasebands |
| 02-Sep-2026 10:46:25 | Test spwsforbasebands() |
| 02-Sep-2026 10:46:25 | PASSED |
| 02-Sep-2026 10:46:25 | |
| 02-Sep-2026 10:46:25 | 2026-09-02 14:46:25 INFO msmetadata_cmpt.cc::open Performing internal consistency checks on /opt/casa/data/casatestdata/unittest/msmetadata/MSMetaData.ms... |
| 02-Sep-2026 10:46:25 | 2026-09-02 14:46:25 INFO MSMetaData::_computeScanAndSubScanProperties Computing scan and subscan properties... |
| 02-Sep-2026 10:46:25 | test_tool_msmetadata.py::msmetadata_test::test_spwsforfield |
| 02-Sep-2026 10:46:25 | Test spwsforfield() and spwsforfields() |
| 02-Sep-2026 10:46:25 | PASSED |
| 02-Sep-2026 10:46:25 | |
| 02-Sep-2026 10:46:25 | 2026-09-02 14:46:25 INFO msmetadata_cmpt.cc::open Performing internal consistency checks on /opt/casa/data/casatestdata/unittest/msmetadata/MSMetaData.ms... |
| 02-Sep-2026 10:46:25 | test_tool_msmetadata.py::msmetadata_test::test_spwsforintent |
| 02-Sep-2026 10:46:25 | Test spwsforintent() |
| 02-Sep-2026 10:46:25 | PASSED |
| 02-Sep-2026 10:46:25 | |
| 02-Sep-2026 10:46:25 | 2026-09-02 14:46:25 INFO msmetadata_cmpt.cc::open Performing internal consistency checks on /opt/casa/data/casatestdata/unittest/msmetadata/MSMetaData.ms... |
| 02-Sep-2026 10:46:25 | 2026-09-02 14:46:25 WARN msmetadata_cmpt.cc::spwsfornames Specified spw named blah is not present in MS |
| 02-Sep-2026 10:46:25 | test_tool_msmetadata.py::msmetadata_test::test_spwsfornames |
| 02-Sep-2026 10:46:25 | Test spwsfornames() |
| 02-Sep-2026 10:46:25 | PASSED |
| 02-Sep-2026 10:46:25 | |
| 02-Sep-2026 10:46:25 | 2026-09-02 14:46:25 INFO msmetadata_cmpt.cc::open Performing internal consistency checks on /opt/casa/data/casatestdata/unittest/msmetadata/MSMetaData.ms... |
| 02-Sep-2026 10:46:25 | 2026-09-02 14:46:25 INFO MSMetaData::_computeScanAndSubScanProperties Computing scan and subscan properties... |
| 02-Sep-2026 10:46:25 | test_tool_msmetadata.py::msmetadata_test::test_spwsforscan |
| 02-Sep-2026 10:46:25 | Test spwsforscan() and spwsforscans() |
| 02-Sep-2026 10:46:25 | PASSED |
| 02-Sep-2026 10:46:25 | |
| 02-Sep-2026 10:46:25 | 2026-09-02 14:46:25 INFO msmetadata_cmpt.cc::open Performing internal consistency checks on /opt/casa/data/casatestdata/unittest/msmetadata/MSMetaData.ms... |
| 02-Sep-2026 10:46:25 | 2026-09-02 14:46:25 INFO MSMetaData::_computeScanAndSubScanProperties Computing scan and subscan properties... |
| 02-Sep-2026 10:46:25 | test_tool_msmetadata.py::msmetadata_test::test_statesforscan |
| 02-Sep-2026 10:46:25 | Test statesforscan() and statesforscans() |
| 02-Sep-2026 10:46:25 | PASSED |
| 02-Sep-2026 10:46:25 | |
| 02-Sep-2026 10:46:25 | 2026-09-02 14:46:25 INFO msmetadata_cmpt.cc::open Performing internal consistency checks on /opt/casa/data/casatestdata/unittest/msmetadata/MSMetaData.ms... |
| 02-Sep-2026 10:46:25 | 2026-09-02 14:46:25 INFO msmetadata_cmpt.cc::open Performing internal consistency checks on /opt/casa/data/casatestdata/unittest/msmetadata/uid___A002_Xa1f062_X37e3.ms... |
| 02-Sep-2026 10:46:25 | test_tool_msmetadata.py::msmetadata_test::test_subwindows |
| 02-Sep-2026 10:46:25 | CAS-13973 test subwindows() method |
| 02-Sep-2026 10:46:25 | PASSED |
| 02-Sep-2026 10:46:25 | |
| 02-Sep-2026 10:46:25 | 2026-09-02 14:46:25 INFO msmetadata_cmpt.cc::open Performing internal consistency checks on /opt/casa/data/casatestdata/unittest/msmetadata/MSMetaData.ms... |
| 02-Sep-2026 10:46:25 | 2026-09-02 14:46:25 INFO msmetadata_cmpt.cc::open Performing internal consistency checks on /opt/casa/data/casatestdata/unittest/msmetadata/uid___A002_Xd7be9d_X4838-spw16-18-20-22.ms... |
| 02-Sep-2026 10:46:25 | test_tool_msmetadata.py::msmetadata_test::test_tdm_fdm |
| 02-Sep-2026 10:46:25 | Verify change to algorithm used for FDM and TDM windows CAS-13362 |
| 02-Sep-2026 10:46:25 | PASSED |
| 02-Sep-2026 10:46:25 | |
| 02-Sep-2026 10:46:25 | 2026-09-02 14:46:25 INFO msmetadata_cmpt.cc::open Performing internal consistency checks on /opt/casa/data/casatestdata/unittest/msmetadata/MSMetaData.ms... |
| 02-Sep-2026 10:46:25 | test_tool_msmetadata.py::msmetadata_test::test_tdmspws |
| 02-Sep-2026 10:46:25 | Test tdmspws() |
| 02-Sep-2026 10:46:25 | PASSED |
| 02-Sep-2026 10:46:25 | |
| 02-Sep-2026 10:46:25 | 2026-09-02 14:46:25 INFO msmetadata_cmpt.cc::open Performing internal consistency checks on /opt/casa/data/casatestdata/unittest/msmetadata/MSMetaData.ms... |
| 02-Sep-2026 10:46:25 | test_tool_msmetadata.py::msmetadata_test::test_telescopenames |
| 02-Sep-2026 10:46:25 | Test observatorynames() |
| 02-Sep-2026 10:46:25 | PASSED |
| 02-Sep-2026 10:46:25 | |
| 02-Sep-2026 10:46:25 | 2026-09-02 14:46:25 INFO msmetadata_cmpt.cc::open Performing internal consistency checks on /opt/casa/data/casatestdata/unittest/msmetadata/MSMetaData.ms... |
| 02-Sep-2026 10:46:25 | test_tool_msmetadata.py::msmetadata_test::test_timerforobs |
| 02-Sep-2026 10:46:25 | Test msmetadata.timerforobs() |
| 02-Sep-2026 10:46:25 | PASSED |
| 02-Sep-2026 10:46:25 | |
| 02-Sep-2026 10:46:25 | 2026-09-02 14:46:25 INFO msmetadata_cmpt.cc::open Performing internal consistency checks on /opt/casa/data/casatestdata/unittest/msmetadata/MSMetaData.ms... |
| 02-Sep-2026 10:46:25 | test_tool_msmetadata.py::msmetadata_test::test_timesforfield |
| 02-Sep-2026 10:46:25 | Test timesforfield() |
| 02-Sep-2026 10:46:25 | PASSED |
| 02-Sep-2026 10:46:25 | |
| 02-Sep-2026 10:46:25 | 2026-09-02 14:46:25 INFO msmetadata_cmpt.cc::open Performing internal consistency checks on /opt/casa/data/casatestdata/unittest/msmetadata/MSMetaData.ms... |
| 02-Sep-2026 10:46:25 | test_tool_msmetadata.py::msmetadata_test::test_timesforintent |
| 02-Sep-2026 10:46:25 | Test timesforintent(), CAS-6919 |
| 02-Sep-2026 10:46:25 | PASSED |
| 02-Sep-2026 10:46:25 | |
| 02-Sep-2026 10:46:25 | 2026-09-02 14:46:25 INFO msmetadata_cmpt.cc::open Performing internal consistency checks on /opt/casa/data/casatestdata/unittest/msmetadata/MSMetaData.ms... |
| 02-Sep-2026 10:46:25 | 2026-09-02 14:46:25 INFO MSMetaData::_computeScanAndSubScanProperties Computing scan and subscan properties... |
| 02-Sep-2026 10:46:25 | test_tool_msmetadata.py::msmetadata_test::test_timesforscan |
| 02-Sep-2026 10:46:25 | Test timesforscan() |
| 02-Sep-2026 10:46:25 | PASSED |
| 02-Sep-2026 10:46:25 | |
| 02-Sep-2026 10:46:25 | 2026-09-02 14:46:25 INFO msmetadata_cmpt.cc::open Performing internal consistency checks on /opt/casa/data/casatestdata/unittest/msmetadata/MSMetaData.ms... |
| 02-Sep-2026 10:46:25 | 2026-09-02 14:46:25 INFO MSMetaData::_computeScanAndSubScanProperties Computing scan and subscan properties... |
| 02-Sep-2026 10:46:25 | test_tool_msmetadata.py::msmetadata_test::test_timesforscans |
| 02-Sep-2026 10:46:25 | Test timesforscans() |
| 02-Sep-2026 10:46:25 | PASSED |
| 02-Sep-2026 10:46:25 | |
| 02-Sep-2026 10:46:25 | 2026-09-02 14:46:25 INFO msmetadata_cmpt.cc::open Performing internal consistency checks on /opt/casa/data/casatestdata/unittest/msmetadata/MSMetaData.ms... |
| 02-Sep-2026 10:46:25 | 2026-09-02 14:46:25 INFO MSMetaData::_computeScanAndSubScanProperties Computing scan and subscan properties... |
| 02-Sep-2026 10:46:25 | test_tool_msmetadata.py::msmetadata_test::test_timesforspws |
| 02-Sep-2026 10:46:25 | Verify timesforspws() |
| 02-Sep-2026 10:46:25 | PASSED |
| 02-Sep-2026 10:46:25 | |
| 02-Sep-2026 10:46:25 | 2026-09-02 14:46:25 INFO msmetadata_cmpt.cc::open Performing internal consistency checks on /opt/casa/data/casatestdata/unittest/msmetadata/MSMetaData.ms... |
| 02-Sep-2026 10:46:25 | 2026-09-02 14:46:25 SEVERE msmetadata_cmpt.cc::transitions Exception Reported: Exception: sourceid cannot be negative. |
| 02-Sep-2026 10:46:25 | 2026-09-02 14:46:25 SEVERE msmetadata_cmpt.cc::transitions+ ... thrown by variant *casac::msmetadata::transitions(long, long) at File: /private/var/folders/60/83wxljbx2vlfbx_hy0yfv8rc0000gn/T/build-via-sdist-togn0tdc/casatools-6.7.7.7a14875.dev1/src/tools/msmetadata/msmetadata_cmpt.cc, line: 2272 |
| 02-Sep-2026 10:46:25 | 2026-09-02 14:46:25 SEVERE msmetadata_cmpt.cc::transitions Exception Reported: Exception: Spectral window ID -1 out of range, must be nonnegative and less than or equal to 39. |
| 02-Sep-2026 10:46:25 | 2026-09-02 14:46:25 SEVERE msmetadata_cmpt.cc::transitions+ ... thrown by void casac::msmetadata::_checkSpwId(int, bool) const at File: /private/var/folders/60/83wxljbx2vlfbx_hy0yfv8rc0000gn/T/build-via-sdist-togn0tdc/casatools-6.7.7.7a14875.dev1/src/tools/msmetadata/msmetadata_cmpt.cc, line: 2449 |
| 02-Sep-2026 10:46:25 | 2026-09-02 14:46:25 SEVERE msmetadata_cmpt.cc::transitions Exception Reported: Exception: SOURCE table does not contain a row with SOURCE_ID=50 and SPECTRAL_WINDOW_ID=0. |
| 02-Sep-2026 10:46:25 | 2026-09-02 14:46:25 SEVERE msmetadata_cmpt.cc::transitions+ ... thrown by variant *casac::msmetadata::transitions(long, long) at File: /private/var/folders/60/83wxljbx2vlfbx_hy0yfv8rc0000gn/T/build-via-sdist-togn0tdc/casatools-6.7.7.7a14875.dev1/src/tools/msmetadata/msmetadata_cmpt.cc, line: 2282 |
| 02-Sep-2026 10:46:25 | 2026-09-02 14:46:25 SEVERE msmetadata_cmpt.cc::transitions Exception Reported: Exception: Spectral window ID 50 out of range, must be nonnegative and less than or equal to 39. |
| 02-Sep-2026 10:46:25 | 2026-09-02 14:46:25 SEVERE msmetadata_cmpt.cc::transitions+ ... thrown by void casac::msmetadata::_checkSpwId(int, bool) const at File: /private/var/folders/60/83wxljbx2vlfbx_hy0yfv8rc0000gn/T/build-via-sdist-togn0tdc/casatools-6.7.7.7a14875.dev1/src/tools/msmetadata/msmetadata_cmpt.cc, line: 2449 |
| 02-Sep-2026 10:46:25 | test_tool_msmetadata.py::msmetadata_test::test_transitions |
| 02-Sep-2026 10:46:25 | Test transitions() |
| 02-Sep-2026 10:46:25 | PASSED |
| 02-Sep-2026 10:46:25 | |
| 02-Sep-2026 10:46:25 | 2026-09-02 14:46:25 INFO msmetadata_cmpt.cc::open Performing internal consistency checks on /opt/casa/data/casatestdata/unittest/msmetadata/MSMetaData.ms... |
| 02-Sep-2026 10:46:25 | test_tool_msmetadata.py::msmetadata_test::test_wvrspws |
| 02-Sep-2026 10:46:25 | Test wvrspws() |
| 02-Sep-2026 10:46:25 | PASSED |
| 02-Sep-2026 10:46:25 | |
| 02-Sep-2026 10:46:25 | - generated xml file: /Users/casaci/bamboohome/xml-data/build-dir/CASASPECS-DEVTESTFULLPY312109-TTAM14P/casa6/casatestutils/nosedir/xml/test_tool_msmetadata/nose.xml - |
| 02-Sep-2026 10:46:25 | ======================== 85 passed, 1 warning in 3.10s ========================= |
| 02-Sep-2026 10:46:25 | ============================= test session starts ============================== |
| 02-Sep-2026 10:46:25 | platform darwin -- Python 3.12.8, pytest-9.1.1, pluggy-1.6.0 -- /Users/casaci/bamboohome/xml-data/build-dir/CASASPECS-DEVTESTFULLPY312109-TTAM14P/casa6testenv/bin/python |
| 02-Sep-2026 10:46:25 | cachedir: .pytest_cache |
| 02-Sep-2026 10:46:25 | rootdir: /Users/casaci/bamboohome/xml-data/build-dir/CASASPECS-DEVTESTFULLPY312109-TTAM14P/casa6/casatestutils/nosedir/test_tool_logsink |
| 02-Sep-2026 10:46:25 | configfile: pytest.ini |
| 02-Sep-2026 10:46:27 | collecting ... collected 4 items |
| 02-Sep-2026 10:46:27 | |
| 02-Sep-2026 10:46:27 | |
| 02-Sep-2026 10:46:27 | test_tool_logsink.py::LogsinkTest::test_getorigin_initial_origin |
| 02-Sep-2026 10:46:27 | Check the initial value of logsink.origin by getorigin. |
| 02-Sep-2026 10:46:27 | PASSED |
| 02-Sep-2026 10:46:27 | |
| 02-Sep-2026 10:46:27 | test_tool_logsink.py::LogsinkTest::test_getorigin_set_nullvalues |
| 02-Sep-2026 10:46:27 | Check that the null values set logsink.origin can get correctly by getorigin. |
| 02-Sep-2026 10:46:27 | SUBPASSED(origin='\x00') |
| 02-Sep-2026 10:46:27 | test_tool_logsink.py::LogsinkTest::test_getorigin_set_nullvalues SUBPASSED(origin='') |
| 02-Sep-2026 10:46:27 | test_tool_logsink.py::LogsinkTest::test_getorigin_set_nullvalues SUBPASSED(origin=None) |
| 02-Sep-2026 10:46:27 | test_tool_logsink.py::LogsinkTest::test_getorigin_set_nullvalues PASSED |
| 02-Sep-2026 10:46:27 | |
| 02-Sep-2026 10:46:27 | test_tool_logsink.py::LogsinkTest::test_getorigin_set_num |
| 02-Sep-2026 10:46:27 | Check that the numeric values set logsink.origin can get correctly by getorigin. |
| 02-Sep-2026 10:46:27 | SUBPASSED(origin=1) |
| 02-Sep-2026 10:46:27 | test_tool_logsink.py::LogsinkTest::test_getorigin_set_num SUBPASSED(origin=3.141592653589793) |
| 02-Sep-2026 10:46:27 | test_tool_logsink.py::LogsinkTest::test_getorigin_set_num SUBPASSED(origin=(1+1j)) |
| 02-Sep-2026 10:46:27 | test_tool_logsink.py::LogsinkTest::test_getorigin_set_num PASSED |
| 02-Sep-2026 10:46:27 | |
| 02-Sep-2026 10:46:27 | test_tool_logsink.py::LogsinkTest::test_getorigin_set_strings |
| 02-Sep-2026 10:46:27 | Check that the string values set logsink.origin can get correctly by getorigin. |
| 02-Sep-2026 10:46:27 | SUBPASSED(origin='test') |
| 02-Sep-2026 10:46:27 | test_tool_logsink.py::LogsinkTest::test_getorigin_set_strings SUBPASSED(origin='test\n') |
| 02-Sep-2026 10:46:27 | test_tool_logsink.py::LogsinkTest::test_getorigin_set_strings PASSED |
| 02-Sep-2026 10:46:27 | |
| 02-Sep-2026 10:46:27 | - generated xml file: /Users/casaci/bamboohome/xml-data/build-dir/CASASPECS-DEVTESTFULLPY312109-TTAM14P/casa6/casatestutils/nosedir/xml/test_tool_logsink/nose.xml - |
| 02-Sep-2026 10:46:27 | =============== 4 passed, 1 warning, 8 subtests passed in 1.42s ================ |
| 02-Sep-2026 10:46:27 | ============================= test session starts ============================== |
| 02-Sep-2026 10:46:27 | platform darwin -- Python 3.12.8, pytest-9.1.1, pluggy-1.6.0 -- /Users/casaci/bamboohome/xml-data/build-dir/CASASPECS-DEVTESTFULLPY312109-TTAM14P/casa6testenv/bin/python |
| 02-Sep-2026 10:46:27 | cachedir: .pytest_cache |
| 02-Sep-2026 10:46:27 | rootdir: /Users/casaci/bamboohome/xml-data/build-dir/CASASPECS-DEVTESTFULLPY312109-TTAM14P/casa6/casatestutils/nosedir/test_tool_ms_createmultims |
| 02-Sep-2026 10:46:27 | configfile: pytest.ini |
| 02-Sep-2026 10:46:28 | collecting ... collected 1 item |
| 02-Sep-2026 10:46:28 | |
| 02-Sep-2026 10:46:28 | |
| 02-Sep-2026 10:46:28 | 2026-09-02 14:46:29 INFO ms::createmultims Copying subtables from part1.ms to the other MMS members. |
| 02-Sep-2026 10:46:30 | 2026-09-02 14:46:30 INFO name:: No table opened. |
| 02-Sep-2026 10:46:30 | 2026-09-02 14:46:30 INFO name:: No table opened. |
| 02-Sep-2026 10:46:30 | test_tool_ms_createmultims.py::test_createmultims::test1 |
| 02-Sep-2026 10:46:30 | Test_createmultims 1: 4 parts, same sources but different spws |
| 02-Sep-2026 10:46:30 | Copying part1.ms |
| 02-Sep-2026 10:46:30 | Copying part2-mod.ms |
| 02-Sep-2026 10:46:30 | Copying part2-mod2.ms |
| 02-Sep-2026 10:46:30 | Copying part2.ms |
| 02-Sep-2026 10:46:30 | Copying part3.ms |
| 02-Sep-2026 10:46:30 | Copying part4.ms |
| 02-Sep-2026 10:46:30 | PASSED |
| 02-Sep-2026 10:46:30 | |
| 02-Sep-2026 10:46:30 | - generated xml file: /Users/casaci/bamboohome/xml-data/build-dir/CASASPECS-DEVTESTFULLPY312109-TTAM14P/casa6/casatestutils/nosedir/xml/test_tool_ms_createmultims/nose.xml - |
| 02-Sep-2026 10:46:30 | ========================= 1 passed, 1 warning in 3.23s ========================= |
| 02-Sep-2026 10:46:30 | ============================= test session starts ============================== |
| 02-Sep-2026 10:46:30 | platform darwin -- Python 3.12.8, pytest-9.1.1, pluggy-1.6.0 -- /Users/casaci/bamboohome/xml-data/build-dir/CASASPECS-DEVTESTFULLPY312109-TTAM14P/casa6testenv/bin/python |
| 02-Sep-2026 10:46:30 | cachedir: .pytest_cache |
| 02-Sep-2026 10:46:30 | rootdir: /Users/casaci/bamboohome/xml-data/build-dir/CASASPECS-DEVTESTFULLPY312109-TTAM14P/casa6/casatestutils/nosedir/test_tool_componentlist |
| 02-Sep-2026 10:46:30 | configfile: pytest.ini |
| 02-Sep-2026 10:46:31 | collecting ... collected 4 items |
| 02-Sep-2026 10:46:31 | |
| 02-Sep-2026 10:46:31 | |
| 02-Sep-2026 10:46:31 | test_tool_componentlist.py::componentlist_test::test_getfluxerror |
| 02-Sep-2026 10:46:31 | Test cl.getfluxerror() |
| 02-Sep-2026 10:46:31 | PASSED |
| 02-Sep-2026 10:46:31 | |
| 02-Sep-2026 10:46:31 | 2026-09-02 14:46:32 WARN componentlist::close componentlist closed |
| 02-Sep-2026 10:46:31 | 2026-09-02 14:46:32 WARN componentlist::close componentlist closed |
| 02-Sep-2026 10:46:31 | test_tool_componentlist.py::componentlist_test::test_plp |
| 02-Sep-2026 10:46:31 | Test adding/updating plp spectral component |
| 02-Sep-2026 10:46:31 | PASSED |
| 02-Sep-2026 10:46:31 | |
| 02-Sep-2026 10:46:31 | 2026-09-02 14:46:32 INFO componentlist::summarize SUMMARY OF COMPONENT |
| 02-Sep-2026 10:46:31 | 2026-09-02 14:46:32 INFO componentlist::summarize+ Shape: Gaussian |
| 02-Sep-2026 10:46:31 | 2026-09-02 14:46:32 INFO componentlist::summarize+ Flux density: [(1,0), (0,0), (0,0), (0,0)] Jy +/- [(0,0), (0,0), (0,0), (0,0)] |
| 02-Sep-2026 10:46:31 | 2026-09-02 14:46:32 INFO componentlist::summarize+ Spectral model: Constant |
| 02-Sep-2026 10:46:31 | 2026-09-02 14:46:32 INFO componentlist::summarize+ Position: Position --- |
| 02-Sep-2026 10:46:31 | 2026-09-02 14:46:32 INFO componentlist::summarize+ --- long: 10:30:00.000 (fixed) |
| 02-Sep-2026 10:46:31 | 2026-09-02 14:46:32 INFO componentlist::summarize+ --- lat: - 20.00.00.00 (fixed) |
| 02-Sep-2026 10:46:31 | 2026-09-02 14:46:32 INFO componentlist::summarize+ |
| 02-Sep-2026 10:46:31 | 2026-09-02 14:46:32 INFO componentlist::summarize+ Size: |
| 02-Sep-2026 10:46:31 | 2026-09-02 14:46:32 INFO componentlist::summarize+ --- major axis FWHM: 4.00 arcsec (fixed) |
| 02-Sep-2026 10:46:31 | 2026-09-02 14:46:32 INFO componentlist::summarize+ --- minor axis FWHM: 2.00 arcsec (fixed) |
| 02-Sep-2026 10:46:31 | 2026-09-02 14:46:32 INFO componentlist::summarize+ --- position angle: 30.0deg (fixed) |
| 02-Sep-2026 10:46:31 | 2026-09-02 14:46:32 SEVERE componentlist::summarize Exception Reported: List has only 1 components, but zero-based component 1 specified. Please specify a component less than 1 |
| 02-Sep-2026 10:46:31 | test_tool_componentlist.py::componentlist_test::test_summarize |
| 02-Sep-2026 10:46:31 | Test the cl.summarize() method |
| 02-Sep-2026 10:46:31 | PASSED |
| 02-Sep-2026 10:46:31 | |
| 02-Sep-2026 10:46:31 | 2026-09-02 14:46:32 SEVERE componentlist::putkeyword Exception Reported: Exception: A table is not attached to this ComponentList. |
| 02-Sep-2026 10:46:31 | 2026-09-02 14:46:32 SEVERE componentlist::putkeyword+ ... thrown by void casa::ComponentList::putKeyword(const String &, const variant &) at File: /Users/casaci/bamboohome/xml-data/build-dir/CASASPECS-DBC256-BPO15AP312/casa6/casatools/src/code/components/ComponentModels/ComponentList.cc, line: 1238 |
| 02-Sep-2026 10:46:31 | 2026-09-02 14:46:32 SEVERE componentlist::getkeyword Exception Reported: Exception: A table is not attached to this ComponentList. |
| 02-Sep-2026 10:46:31 | 2026-09-02 14:46:32 SEVERE componentlist::getkeyword+ ... thrown by variant *casa::ComponentList::getKeyword(const String &) const at File: /Users/casaci/bamboohome/xml-data/build-dir/CASASPECS-DBC256-BPO15AP312/casa6/casatools/src/code/components/ComponentModels/ComponentList.cc, line: 1248 |
| 02-Sep-2026 10:46:31 | 2026-09-02 14:46:32 SEVERE componentlist::haskeyword Exception Reported: Exception: A table is not attached to this ComponentList. |
| 02-Sep-2026 10:46:31 | 2026-09-02 14:46:32 SEVERE componentlist::haskeyword+ ... thrown by bool casa::ComponentList::hasKeyword(const String &) const at File: /Users/casaci/bamboohome/xml-data/build-dir/CASASPECS-DBC256-BPO15AP312/casa6/casatools/src/code/components/ComponentModels/ComponentList.cc, line: 1233 |
| 02-Sep-2026 10:46:31 | 2026-09-02 14:46:32 SEVERE componentlist::putkeyword Exception Reported: Exception: A table is not attached to this ComponentList. |
| 02-Sep-2026 10:46:31 | 2026-09-02 14:46:32 SEVERE componentlist::putkeyword+ ... thrown by void casa::ComponentList::putKeyword(const String &, const variant &) at File: /Users/casaci/bamboohome/xml-data/build-dir/CASASPECS-DBC256-BPO15AP312/casa6/casatools/src/code/components/ComponentModels/ComponentList.cc, line: 1238 |
| 02-Sep-2026 10:46:31 | 2026-09-02 14:46:32 SEVERE componentlist::getkeyword Exception Reported: Exception: A table is not attached to this ComponentList. |
| 02-Sep-2026 10:46:31 | 2026-09-02 14:46:32 SEVERE componentlist::getkeyword+ ... thrown by variant *casa::ComponentList::getKeyword(const String &) const at File: /Users/casaci/bamboohome/xml-data/build-dir/CASASPECS-DBC256-BPO15AP312/casa6/casatools/src/code/components/ComponentModels/ComponentList.cc, line: 1248 |
| 02-Sep-2026 10:46:31 | 2026-09-02 14:46:32 SEVERE componentlist::haskeyword Exception Reported: Exception: A table is not attached to this ComponentList. |
| 02-Sep-2026 10:46:31 | 2026-09-02 14:46:32 SEVERE componentlist::haskeyword+ ... thrown by bool casa::ComponentList::hasKeyword(const String &) const at File: /Users/casaci/bamboohome/xml-data/build-dir/CASASPECS-DBC256-BPO15AP312/casa6/casatools/src/code/components/ComponentModels/ComponentList.cc, line: 1233 |
| 02-Sep-2026 10:46:31 | test_tool_componentlist.py::componentlist_test::test_table_keyword_interface |
| 02-Sep-2026 10:46:31 | Test putting, getting, querying table keywords |
| 02-Sep-2026 10:46:31 | PASSED |
| 02-Sep-2026 10:46:31 | |
| 02-Sep-2026 10:46:31 | - generated xml file: /Users/casaci/bamboohome/xml-data/build-dir/CASASPECS-DEVTESTFULLPY312109-TTAM14P/casa6/casatestutils/nosedir/xml/test_tool_componentlist/nose.xml - |
| 02-Sep-2026 10:46:31 | ========================= 4 passed, 1 warning in 1.41s ========================= |
| 02-Sep-2026 10:46:32 | ============================= test session starts ============================== |
| 02-Sep-2026 10:46:32 | platform darwin -- Python 3.12.8, pytest-9.1.1, pluggy-1.6.0 -- /Users/casaci/bamboohome/xml-data/build-dir/CASASPECS-DEVTESTFULLPY312109-TTAM14P/casa6testenv/bin/python |
| 02-Sep-2026 10:46:32 | cachedir: .pytest_cache |
| 02-Sep-2026 10:46:32 | rootdir: /Users/casaci/bamboohome/xml-data/build-dir/CASASPECS-DEVTESTFULLPY312109-TTAM14P/casa6/casatestutils/nosedir/test_tool_quanta |
| 02-Sep-2026 10:46:32 | configfile: pytest.ini |
| 02-Sep-2026 10:46:33 | collecting ... collected 9 items |
| 02-Sep-2026 10:46:33 | |
| 02-Sep-2026 10:46:33 | |
| 02-Sep-2026 10:46:33 | 2026-09-02 14:46:33 SEVERE Exception Reported: Error in QuantumHolder::fromString with input string "bogus": Illegal input units or format |
| 02-Sep-2026 10:46:33 | 2026-09-02 14:46:33 SEVERE + in converting quantity |
| 02-Sep-2026 10:46:33 | test_tool_quanta.py::quanta_convert_test::test_exceptions |
| 02-Sep-2026 10:46:33 | Test various exception cases |
| 02-Sep-2026 10:46:33 | PASSED |
| 02-Sep-2026 10:46:33 | |
| 02-Sep-2026 10:46:34 | test_tool_quanta.py::quanta_convert_test::test_valid |
| 02-Sep-2026 10:46:34 | Test specifying the quantity as a scalar |
| 02-Sep-2026 10:46:34 | PASSED |
| 02-Sep-2026 10:46:34 | |
| 02-Sep-2026 10:46:34 | test_tool_quanta.py::quanta_convert_test::test_value_as_string |
| 02-Sep-2026 10:46:34 | Test specifying value as a string |
| 02-Sep-2026 10:46:34 | PASSED |
| 02-Sep-2026 10:46:34 | |
| 02-Sep-2026 10:46:34 | 2026-09-02 14:46:34 SEVERE Error in QuantumHolder::fromString with input string "blah": Illegal input units or format |
| 02-Sep-2026 10:46:34 | 2026-09-02 14:46:34 SEVERE + in converting quantity |
| 02-Sep-2026 10:46:34 | 2026-09-02 14:46:34 SEVERE Exception Reported: Error in QuantumHolder::fromString with input string "blah": Illegal input units or format |
| 02-Sep-2026 10:46:34 | 2026-09-02 14:46:34 SEVERE + in converting quantity |
| 02-Sep-2026 10:46:34 | 2026-09-02 14:46:34 SEVERE Error in QuantumHolder::fromString with input string "blah": Illegal input units or format |
| 02-Sep-2026 10:46:34 | 2026-09-02 14:46:34 SEVERE + in converting quantity |
| 02-Sep-2026 10:46:34 | 2026-09-02 14:46:34 SEVERE Exception Reported: Error in QuantumHolder::fromString with input string "blah": Illegal input units or format |
| 02-Sep-2026 10:46:34 | 2026-09-02 14:46:34 SEVERE + in converting quantity |
| 02-Sep-2026 10:46:34 | 2026-09-02 14:46:34 SEVERE Exception Reported: Unit::check Illegal unit string 'zz' |
| 02-Sep-2026 10:46:34 | 2026-09-02 14:46:34 SEVERE Exception Reported: Unit::check Illegal unit string 'zz' |
| 02-Sep-2026 10:46:34 | test_tool_quanta.py::quanta_quantity_test::test_exceptions |
| 02-Sep-2026 10:46:34 | Test various exception cases |
| 02-Sep-2026 10:46:34 | PASSED |
| 02-Sep-2026 10:46:34 | |
| 02-Sep-2026 10:46:34 | test_tool_quanta.py::quanta_quantity_test::test_multidimensional_arra_value |
| 02-Sep-2026 10:46:34 | Test specifying the quantity as a multidimensional array |
| 02-Sep-2026 10:46:34 | PASSED |
| 02-Sep-2026 10:46:34 | |
| 02-Sep-2026 10:46:34 | test_tool_quanta.py::quanta_quantity_test::test_scalar_value |
| 02-Sep-2026 10:46:34 | Test specifying the quantity as a scalar |
| 02-Sep-2026 10:46:34 | PASSED |
| 02-Sep-2026 10:46:34 | |
| 02-Sep-2026 10:46:34 | test_tool_quanta.py::quanta_quantity_test::test_value_as_record |
| 02-Sep-2026 10:46:34 | Test value as record (eg already a quantity). |
| 02-Sep-2026 10:46:34 | This is essentially a reflection operator. |
| 02-Sep-2026 10:46:34 | PASSED |
| 02-Sep-2026 10:46:34 | |
| 02-Sep-2026 10:46:34 | test_tool_quanta.py::quanta_quantity_test::test_value_as_string |
| 02-Sep-2026 10:46:34 | Test specifying value as a string |
| 02-Sep-2026 10:46:34 | PASSED |
| 02-Sep-2026 10:46:34 | |
| 02-Sep-2026 10:46:34 | test_tool_quanta.py::quanta_quantity_test::test_vector_value |
| 02-Sep-2026 10:46:34 | Test specifying the quantity as a vector |
| 02-Sep-2026 10:46:34 | PASSED |
| 02-Sep-2026 10:46:34 | |
| 02-Sep-2026 10:46:34 | - generated xml file: /Users/casaci/bamboohome/xml-data/build-dir/CASASPECS-DEVTESTFULLPY312109-TTAM14P/casa6/casatestutils/nosedir/xml/test_tool_quanta/nose.xml - |
| 02-Sep-2026 10:46:34 | ========================= 9 passed, 1 warning in 2.30s ========================= |
| 02-Sep-2026 10:46:34 | |
| 02-Sep-2026 10:46:34 | |
| 02-Sep-2026 10:46:34 | Setting Working Directory: /Users/casaci/bamboohome/xml-data/build-dir/CASASPECS-DEVTESTFULLPY312109-TTAM14P/casa6/casatestutils/nosedir/test_tool_calanalysis/ |
| 02-Sep-2026 10:46:34 | Test Directory: /Users/casaci/bamboohome/xml-data/build-dir/CASASPECS-DEVTESTFULLPY312109-TTAM14P/casa6/casatestutils/nosedir/test_tool_calanalysis |
| 02-Sep-2026 10:46:34 | |
| 02-Sep-2026 10:46:34 | Running Command: pytest --junitxml=/Users/casaci/bamboohome/xml-data/build-dir/CASASPECS-DEVTESTFULLPY312109-TTAM14P/casa6/casatestutils/nosedir/xml/test_tool_calanalysis/nose.xml -s --disable-pytest-warnings --verbose -ra --tb=short /Users/casaci/bamboohome/xml-data/build-dir/CASASPECS-DEVTESTFULLPY312109-TTAM14P/casa6/casatestutils/nosedir/test_tool_calanalysis/ |
| 02-Sep-2026 10:46:34 | |
| 02-Sep-2026 10:46:34 | Setting Working Directory: /Users/casaci/bamboohome/xml-data/build-dir/CASASPECS-DEVTESTFULLPY312109-TTAM14P/casa6/casatestutils/nosedir/test_tool_image/ |
| 02-Sep-2026 10:46:34 | Test Directory: /Users/casaci/bamboohome/xml-data/build-dir/CASASPECS-DEVTESTFULLPY312109-TTAM14P/casa6/casatestutils/nosedir/test_tool_image |
| 02-Sep-2026 10:46:34 | |
| 02-Sep-2026 10:46:34 | Running Command: pytest --junitxml=/Users/casaci/bamboohome/xml-data/build-dir/CASASPECS-DEVTESTFULLPY312109-TTAM14P/casa6/casatestutils/nosedir/xml/test_tool_image/nose.xml -s --disable-pytest-warnings --verbose -ra --tb=short /Users/casaci/bamboohome/xml-data/build-dir/CASASPECS-DEVTESTFULLPY312109-TTAM14P/casa6/casatestutils/nosedir/test_tool_image/ |
| 02-Sep-2026 10:46:34 | |
| 02-Sep-2026 10:46:34 | Setting Working Directory: /Users/casaci/bamboohome/xml-data/build-dir/CASASPECS-DEVTESTFULLPY312109-TTAM14P/casa6/casatestutils/nosedir/test_tool_image_fitprofile/ |
| 02-Sep-2026 10:46:34 | Test Directory: /Users/casaci/bamboohome/xml-data/build-dir/CASASPECS-DEVTESTFULLPY312109-TTAM14P/casa6/casatestutils/nosedir/test_tool_image_fitprofile |
| 02-Sep-2026 10:46:34 | |
| 02-Sep-2026 10:46:34 | Running Command: pytest --junitxml=/Users/casaci/bamboohome/xml-data/build-dir/CASASPECS-DEVTESTFULLPY312109-TTAM14P/casa6/casatestutils/nosedir/xml/test_tool_image_fitprofile/nose.xml -s --disable-pytest-warnings --verbose -ra --tb=short /Users/casaci/bamboohome/xml-data/build-dir/CASASPECS-DEVTESTFULLPY312109-TTAM14P/casa6/casatestutils/nosedir/test_tool_image_fitprofile/ |
| 02-Sep-2026 10:46:34 | |
| 02-Sep-2026 10:46:34 | Setting Working Directory: /Users/casaci/bamboohome/xml-data/build-dir/CASASPECS-DEVTESTFULLPY312109-TTAM14P/casa6/casatestutils/nosedir/test_tool_measures/ |
| 02-Sep-2026 10:46:34 | Test Directory: /Users/casaci/bamboohome/xml-data/build-dir/CASASPECS-DEVTESTFULLPY312109-TTAM14P/casa6/casatestutils/nosedir/test_tool_measures |
| 02-Sep-2026 10:46:34 | |
| 02-Sep-2026 10:46:34 | Running Command: pytest --junitxml=/Users/casaci/bamboohome/xml-data/build-dir/CASASPECS-DEVTESTFULLPY312109-TTAM14P/casa6/casatestutils/nosedir/xml/test_tool_measures/nose.xml -s --disable-pytest-warnings --verbose -ra --tb=short /Users/casaci/bamboohome/xml-data/build-dir/CASASPECS-DEVTESTFULLPY312109-TTAM14P/casa6/casatestutils/nosedir/test_tool_measures/ |
| 02-Sep-2026 10:46:34 | |
| 02-Sep-2026 10:46:34 | Setting Working Directory: /Users/casaci/bamboohome/xml-data/build-dir/CASASPECS-DEVTESTFULLPY312109-TTAM14P/casa6/casatestutils/nosedir/test_tool_simulator/ |
| 02-Sep-2026 10:46:34 | Test Directory: /Users/casaci/bamboohome/xml-data/build-dir/CASASPECS-DEVTESTFULLPY312109-TTAM14P/casa6/casatestutils/nosedir/test_tool_simulator |
| 02-Sep-2026 10:46:34 | |
| 02-Sep-2026 10:46:34 | Running Command: pytest --junitxml=/Users/casaci/bamboohome/xml-data/build-dir/CASASPECS-DEVTESTFULLPY312109-TTAM14P/casa6/casatestutils/nosedir/xml/test_tool_simulator/nose.xml -s --disable-pytest-warnings --verbose -ra --tb=short /Users/casaci/bamboohome/xml-data/build-dir/CASASPECS-DEVTESTFULLPY312109-TTAM14P/casa6/casatestutils/nosedir/test_tool_simulator/ |
| 02-Sep-2026 10:46:34 | |
| 02-Sep-2026 10:46:34 | Setting Working Directory: /Users/casaci/bamboohome/xml-data/build-dir/CASASPECS-DEVTESTFULLPY312109-TTAM14P/casa6/casatestutils/nosedir/test_tool_synthesisutils/ |
| 02-Sep-2026 10:46:34 | Test Directory: /Users/casaci/bamboohome/xml-data/build-dir/CASASPECS-DEVTESTFULLPY312109-TTAM14P/casa6/casatestutils/nosedir/test_tool_synthesisutils |
| 02-Sep-2026 10:46:34 | |
| 02-Sep-2026 10:46:34 | Running Command: pytest --junitxml=/Users/casaci/bamboohome/xml-data/build-dir/CASASPECS-DEVTESTFULLPY312109-TTAM14P/casa6/casatestutils/nosedir/xml/test_tool_synthesisutils/nose.xml -s --disable-pytest-warnings --verbose -ra --tb=short /Users/casaci/bamboohome/xml-data/build-dir/CASASPECS-DEVTESTFULLPY312109-TTAM14P/casa6/casatestutils/nosedir/test_tool_synthesisutils/ |
| 02-Sep-2026 10:46:34 | |
| 02-Sep-2026 10:46:34 | Setting Working Directory: /Users/casaci/bamboohome/xml-data/build-dir/CASASPECS-DEVTESTFULLPY312109-TTAM14P/casa6/casatestutils/nosedir/test_tool_vpmanager/ |
| 02-Sep-2026 10:46:34 | Test Directory: /Users/casaci/bamboohome/xml-data/build-dir/CASASPECS-DEVTESTFULLPY312109-TTAM14P/casa6/casatestutils/nosedir/test_tool_vpmanager |
| 02-Sep-2026 10:46:34 | |
| 02-Sep-2026 10:46:34 | Running Command: pytest --junitxml=/Users/casaci/bamboohome/xml-data/build-dir/CASASPECS-DEVTESTFULLPY312109-TTAM14P/casa6/casatestutils/nosedir/xml/test_tool_vpmanager/nose.xml -s --disable-pytest-warnings --verbose -ra --tb=short /Users/casaci/bamboohome/xml-data/build-dir/CASASPECS-DEVTESTFULLPY312109-TTAM14P/casa6/casatestutils/nosedir/test_tool_vpmanager/ |
| 02-Sep-2026 10:46:34 | |
| 02-Sep-2026 10:46:34 | Setting Working Directory: /Users/casaci/bamboohome/xml-data/build-dir/CASASPECS-DEVTESTFULLPY312109-TTAM14P/casa6/casatestutils/nosedir/test_tool_image_deviation/ |
| 02-Sep-2026 10:46:34 | Test Directory: /Users/casaci/bamboohome/xml-data/build-dir/CASASPECS-DEVTESTFULLPY312109-TTAM14P/casa6/casatestutils/nosedir/test_tool_image_deviation |
| 02-Sep-2026 10:46:34 | |
| 02-Sep-2026 10:46:34 | Running Command: pytest --junitxml=/Users/casaci/bamboohome/xml-data/build-dir/CASASPECS-DEVTESTFULLPY312109-TTAM14P/casa6/casatestutils/nosedir/xml/test_tool_image_deviation/nose.xml -s --disable-pytest-warnings --verbose -ra --tb=short /Users/casaci/bamboohome/xml-data/build-dir/CASASPECS-DEVTESTFULLPY312109-TTAM14P/casa6/casatestutils/nosedir/test_tool_image_deviation/ |
| 02-Sep-2026 10:46:34 | |
| 02-Sep-2026 10:46:34 | Setting Working Directory: /Users/casaci/bamboohome/xml-data/build-dir/CASASPECS-DEVTESTFULLPY312109-TTAM14P/casa6/casatestutils/nosedir/test_tool_calibrater/ |
| 02-Sep-2026 10:46:34 | Test Directory: /Users/casaci/bamboohome/xml-data/build-dir/CASASPECS-DEVTESTFULLPY312109-TTAM14P/casa6/casatestutils/nosedir/test_tool_calibrater |
| 02-Sep-2026 10:46:34 | |
| 02-Sep-2026 10:46:34 | Running Command: pytest --junitxml=/Users/casaci/bamboohome/xml-data/build-dir/CASASPECS-DEVTESTFULLPY312109-TTAM14P/casa6/casatestutils/nosedir/xml/test_tool_calibrater/nose.xml -s --disable-pytest-warnings --verbose -ra --tb=short /Users/casaci/bamboohome/xml-data/build-dir/CASASPECS-DEVTESTFULLPY312109-TTAM14P/casa6/casatestutils/nosedir/test_tool_calibrater/ |
| 02-Sep-2026 10:46:34 | |
| 02-Sep-2026 10:46:34 | Setting Working Directory: /Users/casaci/bamboohome/xml-data/build-dir/CASASPECS-DEVTESTFULLPY312109-TTAM14P/casa6/casatestutils/nosedir/test_tool_image_rebin/ |
| 02-Sep-2026 10:46:34 | Test Directory: /Users/casaci/bamboohome/xml-data/build-dir/CASASPECS-DEVTESTFULLPY312109-TTAM14P/casa6/casatestutils/nosedir/test_tool_image_rebin |
| 02-Sep-2026 10:46:34 | |
| 02-Sep-2026 10:46:34 | Running Command: pytest --junitxml=/Users/casaci/bamboohome/xml-data/build-dir/CASASPECS-DEVTESTFULLPY312109-TTAM14P/casa6/casatestutils/nosedir/xml/test_tool_image_rebin/nose.xml -s --disable-pytest-warnings --verbose -ra --tb=short /Users/casaci/bamboohome/xml-data/build-dir/CASASPECS-DEVTESTFULLPY312109-TTAM14P/casa6/casatestutils/nosedir/test_tool_image_rebin/ |
| 02-Sep-2026 10:46:34 | |
| 02-Sep-2026 10:46:34 | Setting Working Directory: /Users/casaci/bamboohome/xml-data/build-dir/CASASPECS-DEVTESTFULLPY312109-TTAM14P/casa6/casatestutils/nosedir/test_tool_image_regrid/ |
| 02-Sep-2026 10:46:34 | Test Directory: /Users/casaci/bamboohome/xml-data/build-dir/CASASPECS-DEVTESTFULLPY312109-TTAM14P/casa6/casatestutils/nosedir/test_tool_image_regrid |
| 02-Sep-2026 10:46:34 | |
| 02-Sep-2026 10:46:34 | Running Command: pytest --junitxml=/Users/casaci/bamboohome/xml-data/build-dir/CASASPECS-DEVTESTFULLPY312109-TTAM14P/casa6/casatestutils/nosedir/xml/test_tool_image_regrid/nose.xml -s --disable-pytest-warnings --verbose -ra --tb=short /Users/casaci/bamboohome/xml-data/build-dir/CASASPECS-DEVTESTFULLPY312109-TTAM14P/casa6/casatestutils/nosedir/test_tool_image_regrid/ |
| 02-Sep-2026 10:46:34 | |
| 02-Sep-2026 10:46:34 | Setting Working Directory: /Users/casaci/bamboohome/xml-data/build-dir/CASASPECS-DEVTESTFULLPY312109-TTAM14P/casa6/casatestutils/nosedir/test_tool_imagepol/ |
| 02-Sep-2026 10:46:34 | Test Directory: /Users/casaci/bamboohome/xml-data/build-dir/CASASPECS-DEVTESTFULLPY312109-TTAM14P/casa6/casatestutils/nosedir/test_tool_imagepol |
| 02-Sep-2026 10:46:34 | |
| 02-Sep-2026 10:46:34 | Running Command: pytest --junitxml=/Users/casaci/bamboohome/xml-data/build-dir/CASASPECS-DEVTESTFULLPY312109-TTAM14P/casa6/casatestutils/nosedir/xml/test_tool_imagepol/nose.xml -s --disable-pytest-warnings --verbose -ra --tb=short /Users/casaci/bamboohome/xml-data/build-dir/CASASPECS-DEVTESTFULLPY312109-TTAM14P/casa6/casatestutils/nosedir/test_tool_imagepol/ |
| 02-Sep-2026 10:46:34 | |
| 02-Sep-2026 10:46:34 | Setting Working Directory: /Users/casaci/bamboohome/xml-data/build-dir/CASASPECS-DEVTESTFULLPY312109-TTAM14P/casa6/casatestutils/nosedir/test_tool_coordsys/ |
| 02-Sep-2026 10:46:34 | Test Directory: /Users/casaci/bamboohome/xml-data/build-dir/CASASPECS-DEVTESTFULLPY312109-TTAM14P/casa6/casatestutils/nosedir/test_tool_coordsys |
| 02-Sep-2026 10:46:34 | |
| 02-Sep-2026 10:46:34 | Running Command: pytest --junitxml=/Users/casaci/bamboohome/xml-data/build-dir/CASASPECS-DEVTESTFULLPY312109-TTAM14P/casa6/casatestutils/nosedir/xml/test_tool_coordsys/nose.xml -s --disable-pytest-warnings --verbose -ra --tb=short /Users/casaci/bamboohome/xml-data/build-dir/CASASPECS-DEVTESTFULLPY312109-TTAM14P/casa6/casatestutils/nosedir/test_tool_coordsys/ |
| 02-Sep-2026 10:46:34 | |
| 02-Sep-2026 10:46:34 | Setting Working Directory: /Users/casaci/bamboohome/xml-data/build-dir/CASASPECS-DEVTESTFULLPY312109-TTAM14P/casa6/casatestutils/nosedir/test_tool_sdm_toms/ |
| 02-Sep-2026 10:46:34 | Test Directory: /Users/casaci/bamboohome/xml-data/build-dir/CASASPECS-DEVTESTFULLPY312109-TTAM14P/casa6/casatestutils/nosedir/test_tool_sdm_toms |
| 02-Sep-2026 10:46:34 | |
| 02-Sep-2026 10:46:34 | Running Command: pytest --junitxml=/Users/casaci/bamboohome/xml-data/build-dir/CASASPECS-DEVTESTFULLPY312109-TTAM14P/casa6/casatestutils/nosedir/xml/test_tool_sdm_toms/nose.xml -s --disable-pytest-warnings --verbose -ra --tb=short /Users/casaci/bamboohome/xml-data/build-dir/CASASPECS-DEVTESTFULLPY312109-TTAM14P/casa6/casatestutils/nosedir/test_tool_sdm_toms/ |
| 02-Sep-2026 10:46:34 | |
| 02-Sep-2026 10:46:34 | Setting Working Directory: /Users/casaci/bamboohome/xml-data/build-dir/CASASPECS-DEVTESTFULLPY312109-TTAM14P/casa6/casatestutils/nosedir/test_tool_agentflagger/ |
| 02-Sep-2026 10:46:34 | Test Directory: /Users/casaci/bamboohome/xml-data/build-dir/CASASPECS-DEVTESTFULLPY312109-TTAM14P/casa6/casatestutils/nosedir/test_tool_agentflagger |
| 02-Sep-2026 10:46:34 | |
| 02-Sep-2026 10:46:34 | Running Command: pytest --junitxml=/Users/casaci/bamboohome/xml-data/build-dir/CASASPECS-DEVTESTFULLPY312109-TTAM14P/casa6/casatestutils/nosedir/xml/test_tool_agentflagger/nose.xml -s --disable-pytest-warnings --verbose -ra --tb=short /Users/casaci/bamboohome/xml-data/build-dir/CASASPECS-DEVTESTFULLPY312109-TTAM14P/casa6/casatestutils/nosedir/test_tool_agentflagger/ |
| 02-Sep-2026 10:46:34 | |
| 02-Sep-2026 10:46:34 | Setting Working Directory: /Users/casaci/bamboohome/xml-data/build-dir/CASASPECS-DEVTESTFULLPY312109-TTAM14P/casa6/casatestutils/nosedir/test_tool_ms/ |
| 02-Sep-2026 10:46:34 | Test Directory: /Users/casaci/bamboohome/xml-data/build-dir/CASASPECS-DEVTESTFULLPY312109-TTAM14P/casa6/casatestutils/nosedir/test_tool_ms |
| 02-Sep-2026 10:46:34 | |
| 02-Sep-2026 10:46:34 | Running Command: pytest --junitxml=/Users/casaci/bamboohome/xml-data/build-dir/CASASPECS-DEVTESTFULLPY312109-TTAM14P/casa6/casatestutils/nosedir/xml/test_tool_ms/nose.xml -s --disable-pytest-warnings --verbose -ra --tb=short /Users/casaci/bamboohome/xml-data/build-dir/CASASPECS-DEVTESTFULLPY312109-TTAM14P/casa6/casatestutils/nosedir/test_tool_ms/ |
| 02-Sep-2026 10:46:34 | |
| 02-Sep-2026 10:46:34 | Setting Working Directory: /Users/casaci/bamboohome/xml-data/build-dir/CASASPECS-DEVTESTFULLPY312109-TTAM14P/casa6/casatestutils/nosedir/test_tool_table/ |
| 02-Sep-2026 10:46:34 | Test Directory: /Users/casaci/bamboohome/xml-data/build-dir/CASASPECS-DEVTESTFULLPY312109-TTAM14P/casa6/casatestutils/nosedir/test_tool_table |
| 02-Sep-2026 10:46:34 | |
| 02-Sep-2026 10:46:34 | Running Command: pytest --junitxml=/Users/casaci/bamboohome/xml-data/build-dir/CASASPECS-DEVTESTFULLPY312109-TTAM14P/casa6/casatestutils/nosedir/xml/test_tool_table/nose.xml -s --disable-pytest-warnings --verbose -ra --tb=short /Users/casaci/bamboohome/xml-data/build-dir/CASASPECS-DEVTESTFULLPY312109-TTAM14P/casa6/casatestutils/nosedir/test_tool_table/ |
| 02-Sep-2026 10:46:34 | |
| 02-Sep-2026 10:46:34 | Setting Working Directory: /Users/casaci/bamboohome/xml-data/build-dir/CASASPECS-DEVTESTFULLPY312109-TTAM14P/casa6/casatestutils/nosedir/test_tool_image_subimage/ |
| 02-Sep-2026 10:46:34 | Test Directory: /Users/casaci/bamboohome/xml-data/build-dir/CASASPECS-DEVTESTFULLPY312109-TTAM14P/casa6/casatestutils/nosedir/test_tool_image_subimage |
| 02-Sep-2026 10:46:34 | |
| 02-Sep-2026 10:46:34 | Running Command: pytest --junitxml=/Users/casaci/bamboohome/xml-data/build-dir/CASASPECS-DEVTESTFULLPY312109-TTAM14P/casa6/casatestutils/nosedir/xml/test_tool_image_subimage/nose.xml -s --disable-pytest-warnings --verbose -ra --tb=short /Users/casaci/bamboohome/xml-data/build-dir/CASASPECS-DEVTESTFULLPY312109-TTAM14P/casa6/casatestutils/nosedir/test_tool_image_subimage/ |
| 02-Sep-2026 10:46:34 | |
| 02-Sep-2026 10:46:34 | Setting Working Directory: /Users/casaci/bamboohome/xml-data/build-dir/CASASPECS-DEVTESTFULLPY312109-TTAM14P/casa6/casatestutils/nosedir/test_tool_image_statistics/ |
| 02-Sep-2026 10:46:34 | Test Directory: /Users/casaci/bamboohome/xml-data/build-dir/CASASPECS-DEVTESTFULLPY312109-TTAM14P/casa6/casatestutils/nosedir/test_tool_image_statistics |
| 02-Sep-2026 10:46:34 | |
| 02-Sep-2026 10:46:34 | Running Command: pytest --junitxml=/Users/casaci/bamboohome/xml-data/build-dir/CASASPECS-DEVTESTFULLPY312109-TTAM14P/casa6/casatestutils/nosedir/xml/test_tool_image_statistics/nose.xml -s --disable-pytest-warnings --verbose -ra --tb=short /Users/casaci/bamboohome/xml-data/build-dir/CASASPECS-DEVTESTFULLPY312109-TTAM14P/casa6/casatestutils/nosedir/test_tool_image_statistics/ |
| 02-Sep-2026 10:46:34 | |
| 02-Sep-2026 10:46:34 | Setting Working Directory: /Users/casaci/bamboohome/xml-data/build-dir/CASASPECS-DEVTESTFULLPY312109-TTAM14P/casa6/casatestutils/nosedir/test_tool_msmetadata/ |
| 02-Sep-2026 10:46:34 | Test Directory: /Users/casaci/bamboohome/xml-data/build-dir/CASASPECS-DEVTESTFULLPY312109-TTAM14P/casa6/casatestutils/nosedir/test_tool_msmetadata |
| 02-Sep-2026 10:46:34 | |
| 02-Sep-2026 10:46:34 | Running Command: pytest --junitxml=/Users/casaci/bamboohome/xml-data/build-dir/CASASPECS-DEVTESTFULLPY312109-TTAM14P/casa6/casatestutils/nosedir/xml/test_tool_msmetadata/nose.xml -s --disable-pytest-warnings --verbose -ra --tb=short /Users/casaci/bamboohome/xml-data/build-dir/CASASPECS-DEVTESTFULLPY312109-TTAM14P/casa6/casatestutils/nosedir/test_tool_msmetadata/ |
| 02-Sep-2026 10:46:34 | |
| 02-Sep-2026 10:46:34 | Setting Working Directory: /Users/casaci/bamboohome/xml-data/build-dir/CASASPECS-DEVTESTFULLPY312109-TTAM14P/casa6/casatestutils/nosedir/test_tool_logsink/ |
| 02-Sep-2026 10:46:34 | Test Directory: /Users/casaci/bamboohome/xml-data/build-dir/CASASPECS-DEVTESTFULLPY312109-TTAM14P/casa6/casatestutils/nosedir/test_tool_logsink |
| 02-Sep-2026 10:46:34 | |
| 02-Sep-2026 10:46:34 | Running Command: pytest --junitxml=/Users/casaci/bamboohome/xml-data/build-dir/CASASPECS-DEVTESTFULLPY312109-TTAM14P/casa6/casatestutils/nosedir/xml/test_tool_logsink/nose.xml -s --disable-pytest-warnings --verbose -ra --tb=short /Users/casaci/bamboohome/xml-data/build-dir/CASASPECS-DEVTESTFULLPY312109-TTAM14P/casa6/casatestutils/nosedir/test_tool_logsink/ |
| 02-Sep-2026 10:46:34 | |
| 02-Sep-2026 10:46:34 | Setting Working Directory: /Users/casaci/bamboohome/xml-data/build-dir/CASASPECS-DEVTESTFULLPY312109-TTAM14P/casa6/casatestutils/nosedir/test_tool_ms_createmultims/ |
| 02-Sep-2026 10:46:34 | Test Directory: /Users/casaci/bamboohome/xml-data/build-dir/CASASPECS-DEVTESTFULLPY312109-TTAM14P/casa6/casatestutils/nosedir/test_tool_ms_createmultims |
| 02-Sep-2026 10:46:34 | |
| 02-Sep-2026 10:46:34 | Running Command: pytest --junitxml=/Users/casaci/bamboohome/xml-data/build-dir/CASASPECS-DEVTESTFULLPY312109-TTAM14P/casa6/casatestutils/nosedir/xml/test_tool_ms_createmultims/nose.xml -s --disable-pytest-warnings --verbose -ra --tb=short /Users/casaci/bamboohome/xml-data/build-dir/CASASPECS-DEVTESTFULLPY312109-TTAM14P/casa6/casatestutils/nosedir/test_tool_ms_createmultims/ |
| 02-Sep-2026 10:46:34 | |
| 02-Sep-2026 10:46:34 | Setting Working Directory: /Users/casaci/bamboohome/xml-data/build-dir/CASASPECS-DEVTESTFULLPY312109-TTAM14P/casa6/casatestutils/nosedir/test_tool_componentlist/ |
| 02-Sep-2026 10:46:34 | Test Directory: /Users/casaci/bamboohome/xml-data/build-dir/CASASPECS-DEVTESTFULLPY312109-TTAM14P/casa6/casatestutils/nosedir/test_tool_componentlist |
| 02-Sep-2026 10:46:34 | |
| 02-Sep-2026 10:46:34 | Running Command: pytest --junitxml=/Users/casaci/bamboohome/xml-data/build-dir/CASASPECS-DEVTESTFULLPY312109-TTAM14P/casa6/casatestutils/nosedir/xml/test_tool_componentlist/nose.xml -s --disable-pytest-warnings --verbose -ra --tb=short /Users/casaci/bamboohome/xml-data/build-dir/CASASPECS-DEVTESTFULLPY312109-TTAM14P/casa6/casatestutils/nosedir/test_tool_componentlist/ |
| 02-Sep-2026 10:46:34 | |
| 02-Sep-2026 10:46:34 | Setting Working Directory: /Users/casaci/bamboohome/xml-data/build-dir/CASASPECS-DEVTESTFULLPY312109-TTAM14P/casa6/casatestutils/nosedir/test_tool_quanta/ |
| 02-Sep-2026 10:46:34 | Test Directory: /Users/casaci/bamboohome/xml-data/build-dir/CASASPECS-DEVTESTFULLPY312109-TTAM14P/casa6/casatestutils/nosedir/test_tool_quanta |
| 02-Sep-2026 10:46:34 | |
| 02-Sep-2026 10:46:34 | Running Command: pytest --junitxml=/Users/casaci/bamboohome/xml-data/build-dir/CASASPECS-DEVTESTFULLPY312109-TTAM14P/casa6/casatestutils/nosedir/xml/test_tool_quanta/nose.xml -s --disable-pytest-warnings --verbose -ra --tb=short /Users/casaci/bamboohome/xml-data/build-dir/CASASPECS-DEVTESTFULLPY312109-TTAM14P/casa6/casatestutils/nosedir/test_tool_quanta/ |
| 02-Sep-2026 10:46:34 | a nosedir |
| 02-Sep-2026 10:46:34 | a nosedir/test_tool_msuvbinner |
| 02-Sep-2026 10:46:34 | a nosedir/test_tool_image_deviation |
| 02-Sep-2026 10:46:34 | a nosedir/test_tool_image |
| 02-Sep-2026 10:46:34 | a nosedir/test_tool_ms_statwt |
| 02-Sep-2026 10:46:34 | a nosedir/test_tool_image_pbcor |
| 02-Sep-2026 10:46:34 | a nosedir/test_tool_ms_createmultims |
| 02-Sep-2026 10:46:34 | a nosedir/test_tool_msmetadata |
| 02-Sep-2026 10:46:34 | a nosedir/test_tool_imagepol |
| 02-Sep-2026 10:46:34 | a nosedir/test_tool_componentlist |
| 02-Sep-2026 10:46:34 | a nosedir/test_tool_image_subimage |
| 02-Sep-2026 10:46:34 | a nosedir/test_tool_logsink |
| 02-Sep-2026 10:46:34 | a nosedir/test_tool_ms |
| 02-Sep-2026 10:46:34 | a nosedir/summary_of_failed.log |
| 02-Sep-2026 10:46:34 | a nosedir/test_tool_simulator |
| 02-Sep-2026 10:46:34 | a nosedir/test_tool_measures |
| 02-Sep-2026 10:46:34 | a nosedir/test_tool_coordsys |
| 02-Sep-2026 10:46:34 | a nosedir/test_tool_image_statistics |
| 02-Sep-2026 10:46:34 | a nosedir/xml |
| 02-Sep-2026 10:46:34 | a nosedir/test_tool_image_fitprofile |
| 02-Sep-2026 10:46:34 | a nosedir/test_tool_image_pv |
| 02-Sep-2026 10:46:34 | a nosedir/test_tool_sdm |
| 02-Sep-2026 10:46:34 | a nosedir/test_tool_agentflagger |
| 02-Sep-2026 10:46:34 | a nosedir/test_tool_image_transpose |
| 02-Sep-2026 10:46:34 | a nosedir/test_tool_image_collapse |
| 02-Sep-2026 10:46:34 | a nosedir/test_tool_synthesisutils |
| 02-Sep-2026 10:46:34 | a nosedir/test_tool_calanalysis |
| 02-Sep-2026 10:46:34 | a nosedir/test_tool_vpmanager |
| 02-Sep-2026 10:46:34 | a nosedir/test_tool_regionmanager |
| 02-Sep-2026 10:46:34 | a nosedir/test_tool_calibrater |
| 02-Sep-2026 10:46:34 | a nosedir/test_tool_quanta |
| 02-Sep-2026 10:46:34 | a nosedir/test_tool_linearmosaic |
| 02-Sep-2026 10:46:34 | a nosedir/test_tool_image_rebin |
| 02-Sep-2026 10:46:34 | a nosedir/test_tool_sdm_toms |
| 02-Sep-2026 10:46:34 | a nosedir/test_tool_image_regrid |
| 02-Sep-2026 10:46:34 | a nosedir/test_tool_table |
| 02-Sep-2026 10:46:34 | a nosedir/test_tool_table/conftest.py |
| 02-Sep-2026 10:46:34 | a nosedir/test_tool_table/test_tool_table.py |
| 02-Sep-2026 10:46:34 | a nosedir/test_tool_table/short_summary.log |
| 02-Sep-2026 10:46:34 | a nosedir/test_tool_table/casa-20260902-144413.log |
| 02-Sep-2026 10:46:34 | a nosedir/test_tool_image_regrid/conftest.py |
| 02-Sep-2026 10:46:34 | a nosedir/test_tool_image_regrid/test_tool_image_regrid.py |
| 02-Sep-2026 10:46:34 | a nosedir/test_tool_image_regrid/casa-20260902-144130.log |
| 02-Sep-2026 10:46:34 | a nosedir/test_tool_image_regrid/short_summary.log |
| 02-Sep-2026 10:46:34 | a nosedir/test_tool_sdm_toms/test_tool_sdm_toms.py |
| 02-Sep-2026 10:46:34 | a nosedir/test_tool_sdm_toms/conftest.py |
| 02-Sep-2026 10:46:34 | a nosedir/test_tool_sdm_toms/casa-20260902-144136.log |
| 02-Sep-2026 10:46:34 | a nosedir/test_tool_sdm_toms/short_summary.log |
| 02-Sep-2026 10:46:34 | a nosedir/test_tool_image_rebin/conftest.py |
| 02-Sep-2026 10:46:34 | a nosedir/test_tool_image_rebin/test_tool_image_rebin.py |
| 02-Sep-2026 10:46:34 | a nosedir/test_tool_image_rebin/casa-20260902-144128.log |
| 02-Sep-2026 10:46:34 | a nosedir/test_tool_image_rebin/short_summary.log |
| 02-Sep-2026 10:46:34 | a nosedir/test_tool_linearmosaic/conftest.py |
| 02-Sep-2026 10:46:34 | a nosedir/test_tool_linearmosaic/casa-20260902-143952.log |
| 02-Sep-2026 10:46:34 | a nosedir/test_tool_linearmosaic/test_tool_linearmosaic.py |
| 02-Sep-2026 10:46:34 | a nosedir/test_tool_linearmosaic/short_summary.log |
| 02-Sep-2026 10:46:34 | a nosedir/test_tool_quanta/casa-20260902-144633.log |
| 02-Sep-2026 10:46:34 | a nosedir/test_tool_quanta/conftest.py |
| 02-Sep-2026 10:46:34 | a nosedir/test_tool_quanta/test_tool_quanta.py |
| 02-Sep-2026 10:46:34 | a nosedir/test_tool_quanta/short_summary.log |
| 02-Sep-2026 10:46:34 | a nosedir/test_tool_calibrater/conftest.py |
| 02-Sep-2026 10:46:34 | a nosedir/test_tool_calibrater/test_tool_calibrater.py |
| 02-Sep-2026 10:46:34 | a nosedir/test_tool_calibrater/casa-20260902-144059.log |
| 02-Sep-2026 10:46:34 | a nosedir/test_tool_calibrater/short_summary.log |
| 02-Sep-2026 10:46:34 | a nosedir/test_tool_regionmanager/test_tool_regionmanager.py |
| 02-Sep-2026 10:46:34 | a nosedir/test_tool_regionmanager/conftest.py |
| 02-Sep-2026 10:46:34 | a nosedir/test_tool_regionmanager/short_summary.log |
| 02-Sep-2026 10:46:34 | a nosedir/test_tool_regionmanager/casa-20260902-144011.log |
| 02-Sep-2026 10:46:34 | a nosedir/test_tool_vpmanager/test_tool_vpmanager.py |
| 02-Sep-2026 10:46:34 | a nosedir/test_tool_vpmanager/conftest.py |
| 02-Sep-2026 10:46:34 | a nosedir/test_tool_vpmanager/casa-20260902-144054.log |
| 02-Sep-2026 10:46:34 | a nosedir/test_tool_vpmanager/short_summary.log |
| 02-Sep-2026 10:46:34 | a nosedir/test_tool_calanalysis/conftest.py |
| 02-Sep-2026 10:46:34 | a nosedir/test_tool_calanalysis/casa-20260902-144026.log |
| 02-Sep-2026 10:46:34 | a nosedir/test_tool_calanalysis/test_tool_calanalysis.py |
| 02-Sep-2026 10:46:34 | a nosedir/test_tool_calanalysis/short_summary.log |
| 02-Sep-2026 10:46:34 | a nosedir/test_tool_synthesisutils/conftest.py |
| 02-Sep-2026 10:46:34 | a nosedir/test_tool_synthesisutils/casa-20260902-144048.log |
| 02-Sep-2026 10:46:34 | a nosedir/test_tool_synthesisutils/test_tool_synthesisutils.py |
| 02-Sep-2026 10:46:34 | a nosedir/test_tool_synthesisutils/short_summary.log |
| 02-Sep-2026 10:46:34 | a nosedir/test_tool_image_collapse/conftest.py |
| 02-Sep-2026 10:46:34 | a nosedir/test_tool_image_collapse/short_summary.log |
| 02-Sep-2026 10:46:34 | a nosedir/test_tool_image_collapse/test_tool_image_collapse.py |
| 02-Sep-2026 10:46:34 | a nosedir/test_tool_image_collapse/casa-20260902-143959.log |
| 02-Sep-2026 10:46:34 | a nosedir/test_tool_image_transpose/conftest.py |
| 02-Sep-2026 10:46:34 | a nosedir/test_tool_image_transpose/test_tool_image_transpose.py |
| 02-Sep-2026 10:46:34 | a nosedir/test_tool_image_transpose/casa-20260902-144001.log |
| 02-Sep-2026 10:46:34 | a nosedir/test_tool_image_transpose/short_summary.log |
| 02-Sep-2026 10:46:34 | a nosedir/test_tool_agentflagger/casa-20260902-144356.log |
| 02-Sep-2026 10:46:34 | a nosedir/test_tool_agentflagger/conftest.py |
| 02-Sep-2026 10:46:34 | a nosedir/test_tool_agentflagger/short_summary.log |
| 02-Sep-2026 10:46:34 | a nosedir/test_tool_agentflagger/test_tool_agentflagger.py |
| 02-Sep-2026 10:46:34 | a nosedir/test_tool_sdm/conftest.py |
| 02-Sep-2026 10:46:34 | a nosedir/test_tool_sdm/short_summary.log |
| 02-Sep-2026 10:46:34 | a nosedir/test_tool_sdm/test_tool_sdm.py |
| 02-Sep-2026 10:46:34 | a nosedir/test_tool_sdm/casa-20260902-144005.log |
| 02-Sep-2026 10:46:34 | a nosedir/test_tool_image_pv/conftest.py |
| 02-Sep-2026 10:46:34 | a nosedir/test_tool_image_pv/short_summary.log |
| 02-Sep-2026 10:46:34 | a nosedir/test_tool_image_pv/test_tool_image_pv.py |
| 02-Sep-2026 10:46:34 | a nosedir/test_tool_image_pv/casa-20260902-144002.log |
| 02-Sep-2026 10:46:34 | a nosedir/test_tool_image_fitprofile/conftest.py |
| 02-Sep-2026 10:46:34 | a nosedir/test_tool_image_fitprofile/test_tool_image_fitprofile.py |
| 02-Sep-2026 10:46:34 | a nosedir/test_tool_image_fitprofile/short_summary.log |
| 02-Sep-2026 10:46:34 | a nosedir/test_tool_image_fitprofile/casa-20260902-144039.log |
| 02-Sep-2026 10:46:34 | a nosedir/xml/test_tool_msuvbinner |
| 02-Sep-2026 10:46:34 | a nosedir/xml/test_tool_image_deviation |
| 02-Sep-2026 10:46:34 | a nosedir/xml/test_tool_image |
| 02-Sep-2026 10:46:34 | a nosedir/xml/test_tool_ms_statwt |
| 02-Sep-2026 10:46:34 | a nosedir/xml/test_tool_image_pbcor |
| 02-Sep-2026 10:46:34 | a nosedir/xml/test_tool_ms_createmultims |
| 02-Sep-2026 10:46:34 | a nosedir/xml/test_tool_msmetadata |
| 02-Sep-2026 10:46:34 | a nosedir/xml/test_tool_imagepol |
| 02-Sep-2026 10:46:34 | a nosedir/xml/test_tool_componentlist |
| 02-Sep-2026 10:46:34 | a nosedir/xml/test_tool_image_subimage |
| 02-Sep-2026 10:46:34 | a nosedir/xml/test_tool_logsink |
| 02-Sep-2026 10:46:34 | a nosedir/xml/test_tool_ms |
| 02-Sep-2026 10:46:34 | a nosedir/xml/test_tool_simulator |
| 02-Sep-2026 10:46:34 | a nosedir/xml/test_tool_measures |
| 02-Sep-2026 10:46:34 | a nosedir/xml/test_tool_coordsys |
| 02-Sep-2026 10:46:34 | a nosedir/xml/test_tool_image_statistics |
| 02-Sep-2026 10:46:34 | a nosedir/xml/test_tool_image_fitprofile |
| 02-Sep-2026 10:46:34 | a nosedir/xml/test_tool_image_pv |
| 02-Sep-2026 10:46:34 | a nosedir/xml/test_tool_sdm |
| 02-Sep-2026 10:46:34 | a nosedir/xml/test_tool_agentflagger |
| 02-Sep-2026 10:46:34 | a nosedir/xml/test_tool_image_transpose |
| 02-Sep-2026 10:46:34 | a nosedir/xml/test_tool_image_collapse |
| 02-Sep-2026 10:46:34 | a nosedir/xml/test_tool_synthesisutils |
| 02-Sep-2026 10:46:34 | a nosedir/xml/test_tool_calanalysis |
| 02-Sep-2026 10:46:34 | a nosedir/xml/test_tool_vpmanager |
| 02-Sep-2026 10:46:34 | a nosedir/xml/test_tool_regionmanager |
| 02-Sep-2026 10:46:34 | a nosedir/xml/test_tool_calibrater |
| 02-Sep-2026 10:46:34 | a nosedir/xml/test_tool_quanta |
| 02-Sep-2026 10:46:34 | a nosedir/xml/test_tool_linearmosaic |
| 02-Sep-2026 10:46:34 | a nosedir/xml/test_tool_image_rebin |
| 02-Sep-2026 10:46:34 | a nosedir/xml/test_tool_sdm_toms |
| 02-Sep-2026 10:46:34 | a nosedir/xml/test_tool_image_regrid |
| 02-Sep-2026 10:46:34 | a nosedir/xml/test_tool_table |
| 02-Sep-2026 10:46:34 | a nosedir/xml/test_tool_table/nose.xml |
| 02-Sep-2026 10:46:34 | a nosedir/xml/test_tool_image_regrid/nose.xml |
| 02-Sep-2026 10:46:34 | a nosedir/xml/test_tool_sdm_toms/nose.xml |
| 02-Sep-2026 10:46:34 | a nosedir/xml/test_tool_image_rebin/nose.xml |
| 02-Sep-2026 10:46:34 | a nosedir/xml/test_tool_linearmosaic/nose.xml |
| 02-Sep-2026 10:46:34 | a nosedir/xml/test_tool_quanta/nose.xml |
| 02-Sep-2026 10:46:34 | a nosedir/xml/test_tool_calibrater/nose.xml |
| 02-Sep-2026 10:46:34 | a nosedir/xml/test_tool_regionmanager/nose.xml |
| 02-Sep-2026 10:46:34 | a nosedir/xml/test_tool_vpmanager/nose.xml |
| 02-Sep-2026 10:46:34 | a nosedir/xml/test_tool_calanalysis/nose.xml |
| 02-Sep-2026 10:46:34 | a nosedir/xml/test_tool_synthesisutils/nose.xml |
| 02-Sep-2026 10:46:34 | a nosedir/xml/test_tool_image_collapse/nose.xml |
| 02-Sep-2026 10:46:34 | a nosedir/xml/test_tool_image_transpose/nose.xml |
| 02-Sep-2026 10:46:34 | a nosedir/xml/test_tool_agentflagger/nose.xml |
| 02-Sep-2026 10:46:34 | a nosedir/xml/test_tool_sdm/nose.xml |
| 02-Sep-2026 10:46:34 | a nosedir/xml/test_tool_image_pv/nose.xml |
| 02-Sep-2026 10:46:34 | a nosedir/xml/test_tool_image_fitprofile/nose.xml |
| 02-Sep-2026 10:46:34 | a nosedir/xml/test_tool_image_statistics/nose.xml |
| 02-Sep-2026 10:46:34 | a nosedir/xml/test_tool_coordsys/nose.xml |
| 02-Sep-2026 10:46:34 | a nosedir/xml/test_tool_measures/nose.xml |
| 02-Sep-2026 10:46:34 | a nosedir/xml/test_tool_simulator/nose.xml |
| 02-Sep-2026 10:46:34 | a nosedir/xml/test_tool_ms/nose.xml |
| 02-Sep-2026 10:46:34 | a nosedir/xml/test_tool_logsink/nose.xml |
| 02-Sep-2026 10:46:34 | a nosedir/xml/test_tool_image_subimage/nose.xml |
| 02-Sep-2026 10:46:34 | a nosedir/xml/test_tool_componentlist/nose.xml |
| 02-Sep-2026 10:46:34 | a nosedir/xml/test_tool_imagepol/nose.xml |
| 02-Sep-2026 10:46:34 | a nosedir/xml/test_tool_msmetadata/nose.xml |
| 02-Sep-2026 10:46:34 | a nosedir/xml/test_tool_ms_createmultims/nose.xml |
| 02-Sep-2026 10:46:34 | a nosedir/xml/test_tool_image_pbcor/nose.xml |
| 02-Sep-2026 10:46:34 | a nosedir/xml/test_tool_ms_statwt/nose.xml |
| 02-Sep-2026 10:46:34 | a nosedir/xml/test_tool_image/nose.xml |
| 02-Sep-2026 10:46:34 | a nosedir/xml/test_tool_image_deviation/nose.xml |
| 02-Sep-2026 10:46:34 | a nosedir/xml/test_tool_msuvbinner/nose.xml |
| 02-Sep-2026 10:46:34 | a nosedir/test_tool_image_statistics/test_tool_image_statistics.py |
| 02-Sep-2026 10:46:34 | a nosedir/test_tool_image_statistics/conftest.py |
| 02-Sep-2026 10:46:34 | a nosedir/test_tool_image_statistics/short_summary.log |
| 02-Sep-2026 10:46:34 | a nosedir/test_tool_image_statistics/casa-20260902-144417.log |
| 02-Sep-2026 10:46:34 | a nosedir/test_tool_coordsys/conftest.py |
| 02-Sep-2026 10:46:34 | a nosedir/test_tool_coordsys/casa-20260902-144134.log |
| 02-Sep-2026 10:46:34 | a nosedir/test_tool_coordsys/test_tool_coordsys.py |
| 02-Sep-2026 10:46:34 | a nosedir/test_tool_coordsys/short_summary.log |
| 02-Sep-2026 10:46:34 | a nosedir/test_tool_measures/conftest.py |
| 02-Sep-2026 10:46:34 | a nosedir/test_tool_measures/casa-20260902-144045.log |
| 02-Sep-2026 10:46:34 | a nosedir/test_tool_measures/test_tool_measures.py |
| 02-Sep-2026 10:46:34 | a nosedir/test_tool_measures/short_summary.log |
| 02-Sep-2026 10:46:34 | a nosedir/test_tool_simulator/conftest.py |
| 02-Sep-2026 10:46:34 | a nosedir/test_tool_simulator/casa-20260902-144046.log |
| 02-Sep-2026 10:46:34 | a nosedir/test_tool_simulator/short_summary.log |
| 02-Sep-2026 10:46:34 | a nosedir/test_tool_simulator/test_tool_simulator.py |
| 02-Sep-2026 10:46:34 | a nosedir/test_tool_ms/conftest.py |
| 02-Sep-2026 10:46:34 | a nosedir/test_tool_ms/test_tool_ms.py |
| 02-Sep-2026 10:46:34 | a nosedir/test_tool_ms/short_summary.log |
| 02-Sep-2026 10:46:34 | a nosedir/test_tool_ms/casa-20260902-144402.log |
| 02-Sep-2026 10:46:34 | a nosedir/test_tool_logsink/casa-20260902-144627.log |
| 02-Sep-2026 10:46:34 | a nosedir/test_tool_logsink/conftest.py |
| 02-Sep-2026 10:46:34 | a nosedir/test_tool_logsink/test_tool_logsink.py |
| 02-Sep-2026 10:46:34 | a nosedir/test_tool_logsink/short_summary.log |
| 02-Sep-2026 10:46:34 | a nosedir/test_tool_image_subimage/conftest.py |
| 02-Sep-2026 10:46:34 | a nosedir/test_tool_image_subimage/short_summary.log |
| 02-Sep-2026 10:46:34 | a nosedir/test_tool_image_subimage/casa-20260902-144415.log |
| 02-Sep-2026 10:46:34 | a nosedir/test_tool_image_subimage/test_tool_image_subimage.py |
| 02-Sep-2026 10:46:34 | a nosedir/test_tool_componentlist/casa-20260902-144631.log |
| 02-Sep-2026 10:46:34 | a nosedir/test_tool_componentlist/conftest.py |
| 02-Sep-2026 10:46:34 | a nosedir/test_tool_componentlist/test_tool_componentlist.py |
| 02-Sep-2026 10:46:34 | a nosedir/test_tool_componentlist/short_summary.log |
| 02-Sep-2026 10:46:34 | a nosedir/test_tool_imagepol/conftest.py |
| 02-Sep-2026 10:46:34 | a nosedir/test_tool_imagepol/casa-20260902-144132.log |
| 02-Sep-2026 10:46:34 | a nosedir/test_tool_imagepol/short_summary.log |
| 02-Sep-2026 10:46:34 | a nosedir/test_tool_imagepol/test_tool_imagepol.py |
| 02-Sep-2026 10:46:34 | a nosedir/test_tool_msmetadata/conftest.py |
| 02-Sep-2026 10:46:34 | a nosedir/test_tool_msmetadata/casa-20260902-144623.log |
| 02-Sep-2026 10:46:34 | a nosedir/test_tool_msmetadata/test_tool_msmetadata.py |
| 02-Sep-2026 10:46:34 | a nosedir/test_tool_msmetadata/short_summary.log |
| 02-Sep-2026 10:46:34 | a nosedir/test_tool_ms_createmultims/conftest.py |
| 02-Sep-2026 10:46:34 | a nosedir/test_tool_ms_createmultims/test_tool_ms_createmultims.py |
| 02-Sep-2026 10:46:34 | a nosedir/test_tool_ms_createmultims/short_summary.log |
| 02-Sep-2026 10:46:34 | a nosedir/test_tool_ms_createmultims/casa-20260902-144628.log |
| 02-Sep-2026 10:46:34 | a nosedir/test_tool_image_pbcor/test_tool_image_pbcor.py |
| 02-Sep-2026 10:46:34 | a nosedir/test_tool_image_pbcor/conftest.py |
| 02-Sep-2026 10:46:34 | a nosedir/test_tool_image_pbcor/casa-20260902-144024.log |
| 02-Sep-2026 10:46:34 | a nosedir/test_tool_image_pbcor/short_summary.log |
| 02-Sep-2026 10:46:34 | a nosedir/test_tool_ms_statwt/conftest.py |
| 02-Sep-2026 10:46:34 | a nosedir/test_tool_ms_statwt/short_summary.log |
| 02-Sep-2026 10:46:34 | a nosedir/test_tool_ms_statwt/casa-20260902-144017.log |
| 02-Sep-2026 10:46:34 | a nosedir/test_tool_ms_statwt/test_tool_ms_statwt.py |
| 02-Sep-2026 10:46:34 | a nosedir/test_tool_image/conftest.py |
| 02-Sep-2026 10:46:34 | a nosedir/test_tool_image/test_tool_image.py |
| 02-Sep-2026 10:46:34 | a nosedir/test_tool_image/short_summary.log |
| 02-Sep-2026 10:46:34 | a nosedir/test_tool_image/casa-20260902-144028.log |
| 02-Sep-2026 10:46:34 | a nosedir/test_tool_image_deviation/conftest.py |
| 02-Sep-2026 10:46:34 | a nosedir/test_tool_image_deviation/casa-20260902-144057.log |
| 02-Sep-2026 10:46:34 | a nosedir/test_tool_image_deviation/test_tool_image_deviation.py |
| 02-Sep-2026 10:46:34 | a nosedir/test_tool_image_deviation/short_summary.log |
| 02-Sep-2026 10:46:34 | a nosedir/test_tool_msuvbinner/casa-20260902-143957.log |
| 02-Sep-2026 10:46:34 | a nosedir/test_tool_msuvbinner/conftest.py |
| 02-Sep-2026 10:46:34 | a nosedir/test_tool_msuvbinner/test_tool_msuvbinner.py |
| 02-Sep-2026 10:46:34 | a nosedir/test_tool_msuvbinner/short_summary.log |
| 02-Sep-2026 10:46:34 | Finished task 'Test wheel' with result: Success |
| 02-Sep-2026 10:46:34 | Starting task 'Parse tests' of type 'com.atlassian.bamboo.plugins.testresultparser:task.testresultparser.junit' |
| 02-Sep-2026 10:46:34 | Parsing test results under /Users/casaci/bamboohome/xml-data/build-dir/CASASPECS-DEVTESTFULLPY312109-TTAM14P... |
| 02-Sep-2026 10:46:34 | Finished task 'Parse tests' with result: Success |
| 02-Sep-2026 10:46:34 | Running post build plugin 'Docker Container Cleanup' |
| 02-Sep-2026 10:46:34 | Running post build plugin 'NCover Results Collector' |
| 02-Sep-2026 10:46:34 | Running post build plugin 'Build Results Label Collector' |
| 02-Sep-2026 10:46:34 | Running post build plugin 'Clover Results Collector' |
| 02-Sep-2026 10:46:34 | Running post build plugin 'npm Cache Cleanup' |
| 02-Sep-2026 10:46:34 | Running post build plugin 'Artifact Copier' |
| 02-Sep-2026 10:46:34 | Publishing an artifact: requirements.txt |
| 02-Sep-2026 10:46:35 | Finished publishing of artifact Non required job artifact Http Compression On : [requirements.txt], patterns: [requirements.txt] anchored at: [wheeldirectory/] in 654.4 ms |
| 02-Sep-2026 10:46:35 | Publishing an artifact: Workdir |
| 02-Sep-2026 10:46:35 | Finished publishing of artifact Non required job artifact Http Compression On : [Workdir], patterns: [work*.tar.gz] anchored at: [wheeldirectory/] in 19.64 ms |
| 02-Sep-2026 10:46:35 | Finalising the build... |
| 02-Sep-2026 10:46:35 | Stopping timer. |
| 02-Sep-2026 10:46:35 | Build CASASPECS-DEVTESTFULLPY312109-TTAM14P-1 completed. |
| 02-Sep-2026 10:46:36 | Running on server: post build plugin 'Build Hanging Detection Configuration' |
| 02-Sep-2026 10:46:36 | Running on server: post build plugin 'NCover Results Collector' |
| 02-Sep-2026 10:46:36 | Running on server: post build plugin 'Build Labeller' |
| 02-Sep-2026 10:46:36 | Running on server: post build plugin 'Clover Delta Calculator' |
| 02-Sep-2026 10:46:36 | Running on server: post build plugin 'Maven Dependencies Postprocessor' |
| 02-Sep-2026 10:46:36 | All post build plugins have finished |
| 02-Sep-2026 10:46:36 | Generating build results summary... |
| 02-Sep-2026 10:46:37 | Saving build results to disk... |
| 02-Sep-2026 10:46:37 | Store variable context... |
| 02-Sep-2026 10:46:37 | Finished building CASASPECS-DEVTESTFULLPY312109-TTAM14P-1. |