Build: #4 failed

Job: Test Tools Many Linux 2.28 failed

Stages & jobs

  1. Default Stage

  2. Test

Build log

The build generated 53,243 lines of output.   The output is too long and has been truncated to the last 1,000 lines. Download or view full build log.

21-Oct-2026 13:23:11 2026-10-21 17:23:11        INFO        BeamManipulator::set        Beam parameters:  Major          : 13 arcsec
21-Oct-2026 13:23:11 2026-10-21 17:23:11        INFO        BeamManipulator::set+          Minor          : 11 arcsec
21-Oct-2026 13:23:11 2026-10-21 17:23:11        INFO        BeamManipulator::set+          Position Angle : 90 deg
21-Oct-2026 13:23:11 2026-10-21 17:23:11        INFO        image::_casaQuantityFromVar         Will use values specified in major, minor, pa to set beam
21-Oct-2026 13:23:11 2026-10-21 17:23:11        INFO        BeamManipulator::set        Beam parameters:  Major          : 14 arcsec
21-Oct-2026 13:23:11 2026-10-21 17:23:11        INFO        BeamManipulator::set+          Minor          : 11.5 arcsec
21-Oct-2026 13:23:11 2026-10-21 17:23:11        INFO        BeamManipulator::set+          Position Angle : 91 deg
21-Oct-2026 13:23:11 2026-10-21 17:23:11        INFO        image::_casaQuantityFromVar         Will use values specified in major, minor, pa to set beam
21-Oct-2026 13:23:11 2026-10-21 17:23:11        INFO        BeamManipulator::set        Beam parameters:  Major          : 15 arcsec
21-Oct-2026 13:23:11 2026-10-21 17:23:11        INFO        BeamManipulator::set+          Minor          : 12 arcsec
21-Oct-2026 13:23:11 2026-10-21 17:23:11        INFO        BeamManipulator::set+          Position Angle : 92 deg
21-Oct-2026 13:23:11 2026-10-21 17:23:11        INFO        image::_casaQuantityFromVar         Will use values specified in major, minor, pa to set beam
21-Oct-2026 13:23:11 2026-10-21 17:23:11        INFO        BeamManipulator::set        Beam parameters:  Major          : 16 arcsec
21-Oct-2026 13:23:11 2026-10-21 17:23:11        INFO        BeamManipulator::set+          Minor          : 12.5 arcsec
21-Oct-2026 13:23:11 2026-10-21 17:23:11        INFO        BeamManipulator::set+          Position Angle : 93 deg
21-Oct-2026 13:23:11 2026-10-21 17:23:11        INFO        ImageRegion::fromRecord        Selected bounding box :
21-Oct-2026 13:23:11 2026-10-21 17:23:11        INFO        ImageRegion::fromRecord+            [1, 1, 1, 1] to [2, 2, 2, 2]  (00:00:16.000, -00.04.00.000, 1.415e+09Hz, Q to 00:00:12.000, -00.03.00.000, 1.415e+09Hz, U)
21-Oct-2026 13:23:11 2026-10-21 17:23:11        WARN        ImageCollapser::_doMultipleBeams        Input image has per plane beams but the collapse is not done exclusively along the direction axes. The output image will arbitrarily have a single beam which is the first beam available in the subimage.Thus, the image planes will not be convolved to a common restoring beam before collapsing. If, however, this is desired, then run the task imsmooth or the tool method ia.convolve2d() first, and use the output image of that as the input for collapsing.
21-Oct-2026 13:23:11 2026-10-21 17:23:11        INFO        name::        No table opened.
21-Oct-2026 13:23:11 2026-10-21 17:23:11        INFO        showcache::        The Table Cache is empty.
21-Oct-2026 13:23:11 2026-10-21 17:23:11        INFO        name::        No table opened.
21-Oct-2026 13:23:11 2026-10-21 17:23:11        INFO        name::        No table opened.
21-Oct-2026 13:23:11 test_tool_image_collapse.py::ia_collapse_test::test_beams
21-Oct-2026 13:23:11 test per plane beams
21-Oct-2026 13:23:11 PASSED
21-Oct-2026 13:23:11
21-Oct-2026 13:23:11 2026-10-21 17:23:11        INFO        ImageFactory::createImage        Created Temp image  of shape [2, 2, 2] with Complex valued pixels.
21-Oct-2026 13:23:11 2026-10-21 17:23:11        INFO        ImageRegion::fromRecord        Selected bounding box :
21-Oct-2026 13:23:11 2026-10-21 17:23:11        INFO        ImageRegion::fromRecord+            [0, 0, 0] to [1, 1, 1]  (00:00:04.000, -00.01.00.000, I to 00:00:00.000, +00.00.00.000, Q)
21-Oct-2026 13:23:11 2026-10-21 17:23:11        INFO        ImageRegion::fromRecord        Selected bounding box :
21-Oct-2026 13:23:11 2026-10-21 17:23:11        INFO        ImageRegion::fromRecord+            [0, 0, 0] to [1, 1, 0]  (00:00:04.000, -00.01.00.000, I to 00:00:00.000, +00.00.00.000, I)
21-Oct-2026 13:23:11 2026-10-21 17:23:11        INFO        ImageRegion::fromRecord        Selected bounding box :
21-Oct-2026 13:23:11 2026-10-21 17:23:11        INFO        ImageRegion::fromRecord+            [0, 0, 0] to [1, 1, 1]  (00:00:04.000, -00.01.00.000, I to 00:00:00.000, +00.00.00.000, Q)
21-Oct-2026 13:23:11 2026-10-21 17:23:11        INFO        ImageRegion::fromRecord        Selected bounding box :
21-Oct-2026 13:23:11 2026-10-21 17:23:11        INFO        ImageRegion::fromRecord+            [0, 0, 0] to [1, 1, 0]  (00:00:04.000, -00.01.00.000, I to 00:00:00.000, +00.00.00.000, I)
21-Oct-2026 13:23:11 2026-10-21 17:23:11        INFO        name::        No table opened.
21-Oct-2026 13:23:11 2026-10-21 17:23:11        INFO        showcache::        The Table Cache is empty.
21-Oct-2026 13:23:11 2026-10-21 17:23:11        INFO        name::        No table opened.
21-Oct-2026 13:23:11 2026-10-21 17:23:11        INFO        name::        No table opened.
21-Oct-2026 13:23:11 test_tool_image_collapse.py::ia_collapse_test::test_complex
21-Oct-2026 13:23:11 Test support for complex valued images
21-Oct-2026 13:23:11 PASSED
21-Oct-2026 13:23:11
21-Oct-2026 13:23:11 2026-10-21 17:23:11        SEVERE        image::open (file src/tools/image/image_cmpt.cc, line 4208)        Exception Reported: Exception: File mybogus.im does not exist..
21-Oct-2026 13:23:11 2026-10-21 17:23:11        SEVERE        image::open (file src/tools/image/image_cmpt.cc, line 4208)+        ... thrown by static void casa::ImageFactory::_checkInfile(const casacore::String&) at File: /source/casa6/casatools/src/code/imageanalysis/ImageAnalysis/ImageFactory2.cc, line: 375
21-Oct-2026 13:23:11 2026-10-21 17:23:11        INFO        FITSCoordinateUtil::fromFITSHeader        Neither SPECSYS nor VELREF keyword given, spectral reference frame not defined ...
21-Oct-2026 13:23:11 2026-10-21 17:23:11        SEVERE        image::collapse (file src/tools/image/image_cmpt.cc, line 712)        Exception Reported: Exception: Aggregate function name is not specified and it must be..
21-Oct-2026 13:23:11 2026-10-21 17:23:11        SEVERE        image::collapse (file src/tools/image/image_cmpt.cc, line 712)+        ... thrown by static casa::ImageCollapserData::AggregateType casa::ImageCollapserData::aggregateType(const casacore::String&) at File: /source/casa6/casatools/src/code/imageanalysis/ImageAnalysis/ImageCollapserData.cc, line: 65
21-Oct-2026 13:23:11 2026-10-21 17:23:11        INFO        FITSCoordinateUtil::fromFITSHeader        Neither SPECSYS nor VELREF keyword given, spectral reference frame not defined ...
21-Oct-2026 13:23:11 2026-10-21 17:23:11        SEVERE        image::collapse (file src/tools/image/image_cmpt.cc, line 712)        Exception Reported: Unknown aggregate function specified by bogus function at File: /source/casa6/casatools/src/code/imageanalysis/ImageAnalysis/ImageCollapserData.cc, line: 84
21-Oct-2026 13:23:11 2026-10-21 17:23:11        INFO        FITSCoordinateUtil::fromFITSHeader        Neither SPECSYS nor VELREF keyword given, spectral reference frame not defined ...
21-Oct-2026 13:23:11 2026-10-21 17:23:11        WARN                /home/casatest/casa6/casatestutils/nosedir/test_tool_image_collapse/collapse_in.fits is not a valid or readable table
21-Oct-2026 13:23:11 2026-10-21 17:23:11        SEVERE                Cannot read image /home/casatest/casa6/casatestutils/nosedir/test_tool_image_collapse/collapse_in.fits to get region bogus_region
21-Oct-2026 13:23:11 2026-10-21 17:23:11        SEVERE        image::collapse (file src/tools/image/image_cmpt.cc, line 712)        Exception Reported: Unable to open region file or region table description bogus_region in image /home/casatest/casa6/casatestutils/nosedir/test_tool_image_collapse/collapse_in.fits at File: /source/casa6/casatools/src/code/imageanalysis/Regions/CasacRegionManager.cc, line: 486
21-Oct-2026 13:23:11 2026-10-21 17:23:11        INFO        FITSCoordinateUtil::fromFITSHeader        Neither SPECSYS nor VELREF keyword given, spectral reference frame not defined ...
21-Oct-2026 13:23:11 2026-10-21 17:23:11        SEVERE        image::collapse (file src/tools/image/image_cmpt.cc, line 712)        Exception Reported: Exception: box not specified correctly.
21-Oct-2026 13:23:11 2026-10-21 17:23:11        SEVERE        image::collapse (file src/tools/image/image_cmpt.cc, line 712)+        ... thrown by casacore::Record casa::CasacRegionManager::fromBCS(casacore::String&, casacore::uInt&, casacore::String&, const casacore::Record* const&, const casacore::String&, const casacore::String&, casa::CasacRegionManager::StokesControl, const casacore::String&, const casacore::IPosition&, const casacore::String&, casacore::Bool) at File: /source/casa6/casatools/src/code/imageanalysis/Regions/CasacRegionManager.cc, line: 232
21-Oct-2026 13:23:11 2026-10-21 17:23:11        INFO        FITSCoordinateUtil::fromFITSHeader        Neither SPECSYS nor VELREF keyword given, spectral reference frame not defined ...
21-Oct-2026 13:23:11 2026-10-21 17:23:11        INFO        CasacRegionManager::_fromBCS        dAxisNum0=0 dAxisNum1=1x=1000 imShape[0]=3 y=1000 imShape[1]=3
21-Oct-2026 13:23:11 2026-10-21 17:23:11        SEVERE        CasacRegionManager::_fromBCS        trc in box spec is greater than or equal to number of direction coordinate pixels in the image
21-Oct-2026 13:23:11 2026-10-21 17:23:11        SEVERE        image::collapse (file src/tools/image/image_cmpt.cc, line 712)        Exception Reported: 2026-10-21 17:23:11        SEVERE        CasacRegionManager::_fromBCS        trc in box spec is greater than or equal to number of direction coordinate pixels in the image
21-Oct-2026 13:23:11 2026-10-21 17:23:11        INFO        FITSCoordinateUtil::fromFITSHeader        Neither SPECSYS nor VELREF keyword given, spectral reference frame not defined ...
21-Oct-2026 13:23:11 2026-10-21 17:23:11        SEVERE        CoordinateSystem::getWorldAxesOrder (file /source/casa6/casatools/casacore/coordinates/Coordinates/CoordinateSystem.cc, line 4663)        Multiple axes [right ascension,declination,frequency,stokes] match requested axis
21-Oct-2026 13:23:11 2026-10-21 17:23:11        SEVERE        image::collapse (file src/tools/image/image_cmpt.cc, line 712)        Exception Reported: 2026-10-21 17:23:11        SEVERE        CoordinateSystem::getWorldAxesOrder (file /source/casa6/casatools/casacore/coordinates/Coordinates/CoordinateSystem.cc, line 4663)        Multiple axes [right ascension,declination,frequency,stokes] match requested axis
21-Oct-2026 13:23:11 2026-10-21 17:23:11        INFO        FITSCoordinateUtil::fromFITSHeader        Neither SPECSYS nor VELREF keyword given, spectral reference frame not defined ...
21-Oct-2026 13:23:11 2026-10-21 17:23:11        SEVERE        image::collapse (file src/tools/image/image_cmpt.cc, line 712)        Exception Reported: Exception: Specified zero-based axis (10) must be less than the number of axes in /home/casatest/casa6/casatestutils/nosedir/test_tool_image_collapse/collapse_in.fits(4).
21-Oct-2026 13:23:11 2026-10-21 17:23:11        SEVERE        image::collapse (file src/tools/image/image_cmpt.cc, line 712)+        ... thrown by void casa::ImageCollapser<T>::_finishConstruction() [with T = float] at File: /source/casainstall/include/casacpp/imageanalysis/ImageAnalysis/ImageCollapser.tcc, line: 559
21-Oct-2026 13:23:11 2026-10-21 17:23:11        INFO        name::        No table opened.
21-Oct-2026 13:23:11 2026-10-21 17:23:11        INFO        showcache::        The Table Cache is empty.
21-Oct-2026 13:23:11 2026-10-21 17:23:11        INFO        name::        No table opened.
21-Oct-2026 13:23:11 2026-10-21 17:23:11        INFO        name::        No table opened.
21-Oct-2026 13:23:11 test_tool_image_collapse.py::ia_collapse_test::test_exceptions
21-Oct-2026 13:23:11 ia.collapse: Test various exception cases
21-Oct-2026 13:23:11 PASSED
21-Oct-2026 13:23:11
21-Oct-2026 13:23:11 2026-10-21 17:23:11        INFO        ImageFactory::createImage        Created Paged image 'flux_test.im' of shape [10, 10, 10] with float valued pixels.
21-Oct-2026 13:23:11 2026-10-21 17:23:11        INFO        ImageRegion::fromRecord        Selected bounding box :
21-Oct-2026 13:23:11 2026-10-21 17:23:11        INFO        ImageRegion::fromRecord+            [0, 0, 0] to [9, 9, 9]  (00:00:20.000, -00.05.00.000, 1.415e+09Hz to 23:59:44.000, +00.04.00.000, 1.415e+09Hz)
21-Oct-2026 13:23:11 2026-10-21 17:23:11        SEVERE        image::collapse (file src/tools/image/image_cmpt.cc, line 712)        Exception Reported: Unable to calculate flux density: [] at File: /source/casainstall/include/casacpp/imageanalysis/ImageAnalysis/ImageCollapser.tcc, line: 433
21-Oct-2026 13:23:11 2026-10-21 17:23:11        INFO        image::_casaQuantityFromVar         Will use values specified in major, minor, pa to set beam
21-Oct-2026 13:23:11 2026-10-21 17:23:11        INFO        BeamManipulator::set        Setting (global) restoring beam.
21-Oct-2026 13:23:11 2026-10-21 17:23:11        INFO        BeamManipulator::set        Beam parameters:  Major          : 3 arcmin
21-Oct-2026 13:23:11 2026-10-21 17:23:11        INFO        BeamManipulator::set+          Minor          : 3 arcmin
21-Oct-2026 13:23:11 2026-10-21 17:23:11        INFO        BeamManipulator::set+          Position Angle : 0 deg
21-Oct-2026 13:23:11 2026-10-21 17:23:11        INFO        ImageRegion::fromRecord        Selected bounding box :
21-Oct-2026 13:23:11 2026-10-21 17:23:11        INFO        ImageRegion::fromRecord+            [0, 0, 0] to [9, 9, 9]  (00:00:20.000, -00.05.00.000, 1.415e+09Hz to 23:59:44.000, +00.04.00.000, 1.415e+09Hz)
21-Oct-2026 13:23:11 2026-10-21 17:23:11        INFO        name::        No table opened.
21-Oct-2026 13:23:11 2026-10-21 17:23:11        INFO        showcache::        The Table Cache is empty.
21-Oct-2026 13:23:11 2026-10-21 17:23:11        INFO        name::        No table opened.
21-Oct-2026 13:23:11 2026-10-21 17:23:11        INFO        name::        No table opened.
21-Oct-2026 13:23:11 test_tool_image_collapse.py::ia_collapse_test::test_flux
21-Oct-2026 13:23:11 2026-10-21 17:23:11        INFO        ImageFactory::createImage        Created Temp image  of shape [20, 20, 20] with float valued pixels.
21-Oct-2026 13:23:11 Test flux function
21-Oct-2026 13:23:11 2026-10-21 17:23:11        INFO        ImageRegion::fromRecord        Selected bounding box :
21-Oct-2026 13:23:11 PASSED
21-Oct-2026 13:23:11 2026-10-21 17:23:11        INFO        ImageRegion::fromRecord+            [0, 0, 0] to [19, 19, 19]  (00:00:40.000, -00.10.00.001, 1.41499e+09Hz to 23:59:24.000, +00.09.00.001, 1.41501e+09Hz)
21-Oct-2026 13:23:11
21-Oct-2026 13:23:11 2026-10-21 17:23:11        INFO        ::::ImageFactory::createImage        Created Temp image  of shape [20, 20, 20] with float valued pixels.
21-Oct-2026 13:23:11 2026-10-21 17:23:11        INFO        ::::image::fromshape        Ran ia.fromshape
21-Oct-2026 13:23:11 2026-10-21 17:23:11        INFO        ::::image::fromshape        ia.fromshape(outfile="", shape=[20,20,20], csys={...}, linear=false, overwrite=false, log=true, type="f")
21-Oct-2026 13:23:11 2026-10-21 17:23:11        INFO        ::::image::collapse        Ran ia.collapse on Temporary_Image
21-Oct-2026 13:23:11 2026-10-21 17:23:11        INFO        ::::image::collapse        ia.collapse(function='mean', axes=2, outfile='', region='', box='', chans='', stokes='', mask='', overwrite=false, stretch=false)
21-Oct-2026 13:23:11 2026-10-21 17:23:11        INFO        name::        No table opened.
21-Oct-2026 13:23:11 2026-10-21 17:23:11        INFO        showcache::        The Table Cache is empty.
21-Oct-2026 13:23:11 2026-10-21 17:23:11        INFO        name::        No table opened.
21-Oct-2026 13:23:11 2026-10-21 17:23:11        INFO        name::        No table opened.
21-Oct-2026 13:23:11 test_tool_image_collapse.py::ia_collapse_test::test_history
21-Oct-2026 13:23:11 Test history record is written
21-Oct-2026 13:23:11 PASSED
21-Oct-2026 13:23:11
21-Oct-2026 13:23:11 2026-10-21 17:23:11        INFO        ImageFactory::createImage        Created Paged image 'median.im' of shape [3, 3, 3] with float valued pixels.
21-Oct-2026 13:23:11 2026-10-21 17:23:11        INFO        ImageRegion::fromRecord        Selected bounding box :
21-Oct-2026 13:23:11 2026-10-21 17:23:11        INFO        ImageRegion::fromRecord+            [0, 0, 0] to [2, 2, 2]  (00:00:04.000, -00.01.00.000, I to 23:59:56.000, +00.01.00.000, U)
21-Oct-2026 13:23:11 2026-10-21 17:23:12        INFO        ImageRegion::fromRecord        Selected bounding box :
21-Oct-2026 13:23:11 2026-10-21 17:23:12        INFO        ImageRegion::fromRecord+            [0, 0, 0] to [2, 2, 2]  (00:00:04.000, -00.01.00.000, I to 23:59:56.000, +00.01.00.000, U)
21-Oct-2026 13:23:11 2026-10-21 17:23:12        INFO        ImageFactory::createImage        Created Temp image  of shape [20, 20, 5] with float valued pixels.
21-Oct-2026 13:23:11 2026-10-21 17:23:12        INFO        AsciiRegionFileParser::_parse        Combined 1 image regions (which excludes any annotation regions)
21-Oct-2026 13:23:11 2026-10-21 17:23:12        INFO        AsciiRegionFileParser::_parse        The specified region will select all pixels that are included in the region. Full pixels will be included even when they are only partially covered by the region(s).
21-Oct-2026 13:23:11 2026-10-21 17:23:12        INFO        ImageRegion::fromRecord        Selected bounding box :
21-Oct-2026 13:23:11 2026-10-21 17:23:12        INFO        ImageRegion::fromRecord+            [5, 5, 0] to [15, 15, 4]  (00:00:20.000, -00.05.00.000, 1.415e+09Hz to 23:59:40.000, +00.05.00.000, 1.415e+09Hz)
21-Oct-2026 13:23:11 2026-10-21 17:23:12        INFO        name::        No table opened.
21-Oct-2026 13:23:11 2026-10-21 17:23:12        INFO        showcache::        The Table Cache is empty.
21-Oct-2026 13:23:11 2026-10-21 17:23:12        INFO        name::        No table opened.
21-Oct-2026 13:23:11 2026-10-21 17:23:12        INFO        name::        No table opened.
21-Oct-2026 13:23:11 test_tool_image_collapse.py::ia_collapse_test::test_median
21-Oct-2026 13:23:11 Test median when collapsing along multiple axes
21-Oct-2026 13:23:11 PASSED
21-Oct-2026 13:23:11
21-Oct-2026 13:23:11 2026-10-21 17:23:12        INFO        ImageFactory::createImage        Created Temp image  of shape [10, 10, 10] with float valued pixels.
21-Oct-2026 13:23:11 2026-10-21 17:23:12        INFO        ImageRegion::fromRecord        Selected bounding box :
21-Oct-2026 13:23:11 2026-10-21 17:23:12        INFO        ImageRegion::fromRecord+            [0, 4, 0] to [9, 6, 9]  (00:00:20.000, -00.01.00.000, 1.415e+09Hz to 23:59:44.000, +00.01.00.000, 1.415e+09Hz)
21-Oct-2026 13:23:11 2026-10-21 17:23:12        INFO        name::        No table opened.
21-Oct-2026 13:23:11 2026-10-21 17:23:12        INFO        showcache::        The Table Cache is empty.
21-Oct-2026 13:23:11 2026-10-21 17:23:12        INFO        name::        No table opened.
21-Oct-2026 13:23:11 2026-10-21 17:23:12        INFO        name::        No table opened.
21-Oct-2026 13:23:11 test_tool_image_collapse.py::ia_collapse_test::test_region
21-Oct-2026 13:23:11 ia.collapse(): Test region
21-Oct-2026 13:23:11 PASSED
21-Oct-2026 13:23:11
21-Oct-2026 13:23:11 2026-10-21 17:23:12        INFO        ImageFactory::createImage        Created Temp image  of shape [2, 2, 2] with float valued pixels.
21-Oct-2026 13:23:11 2026-10-21 17:23:12        INFO        ImageRegion::fromRecord        Selected bounding box :
21-Oct-2026 13:23:11 2026-10-21 17:23:12        INFO        ImageRegion::fromRecord+            [0, 0, 0] to [1, 1, 1]  (00:00:04.000, -00.01.00.000, I to 00:00:00.000, +00.00.00.000, Q)
21-Oct-2026 13:23:11 2026-10-21 17:23:12        INFO        ImageRegion::fromRecord        Selected bounding box :
21-Oct-2026 13:23:11 2026-10-21 17:23:12        INFO        ImageRegion::fromRecord+            [0, 0, 0] to [1, 1, 1]  (00:00:04.000, -00.01.00.000, I to 00:00:00.000, +00.00.00.000, Q)
21-Oct-2026 13:23:11 2026-10-21 17:23:12        INFO        name::        No table opened.
21-Oct-2026 13:23:11 2026-10-21 17:23:12        INFO        showcache::        The Table Cache is empty.
21-Oct-2026 13:23:11 2026-10-21 17:23:12        INFO        name::        No table opened.
21-Oct-2026 13:23:11 test_tool_image_collapse.py::ia_collapse_test::test_sqrtsum
21-Oct-2026 13:23:11 Test sqrtsum function
21-Oct-2026 13:23:11 PASSED
21-Oct-2026 13:23:11
21-Oct-2026 13:23:11 2026-10-21 17:23:12        INFO        name::        No table opened.
21-Oct-2026 13:23:11 2026-10-21 17:23:12        INFO        ImageFactory::createImage        Created Temp image  of shape [2, 2, 2] with float valued pixels.
21-Oct-2026 13:23:11 test_tool_image_collapse.py::ia_collapse_test::test_sqrtsum_npix
21-Oct-2026 13:23:11 Test sqrtsum function
21-Oct-2026 13:23:11 PASSED
21-Oct-2026 13:23:11
21-Oct-2026 13:23:11 2026-10-21 17:23:12        INFO        ImageRegion::fromRecord        Selected bounding box :
21-Oct-2026 13:23:11 2026-10-21 17:23:12        INFO        ImageRegion::fromRecord+            [0, 0, 0] to [1, 1, 1]  (00:00:04.000, -00.01.00.000, I to 00:00:00.000, +00.00.00.000, Q)
21-Oct-2026 13:23:11 2026-10-21 17:23:12        INFO        ImageRegion::fromRecord        Selected bounding box :
21-Oct-2026 13:23:11 2026-10-21 17:23:12        INFO        ImageRegion::fromRecord+            [0, 0, 0] to [1, 1, 1]  (00:00:04.000, -00.01.00.000, I to 00:00:00.000, +00.00.00.000, Q)
21-Oct-2026 13:23:11 2026-10-21 17:23:12        INFO        name::        No table opened.
21-Oct-2026 13:23:11 2026-10-21 17:23:12        INFO        showcache::        The Table Cache is empty.
21-Oct-2026 13:23:11 2026-10-21 17:23:12        INFO        name::        No table opened.
21-Oct-2026 13:23:11 2026-10-21 17:23:12        INFO        name::        No table opened.
21-Oct-2026 13:23:11 2026-10-21 17:23:12        INFO        ImageFactory::createImage        Created Temp image  of shape [2, 2, 2] with float valued pixels.
21-Oct-2026 13:23:11 2026-10-21 17:23:12        INFO        image::_casaQuantityFromVar         Will use values specified in major, minor, pa to set beam
21-Oct-2026 13:23:11 2026-10-21 17:23:12        INFO        BeamManipulator::set        Setting (global) restoring beam.
21-Oct-2026 13:23:11 2026-10-21 17:23:12        INFO        BeamManipulator::set        Beam parameters:  Major          : 3 arcmin
21-Oct-2026 13:23:11 2026-10-21 17:23:12        INFO        BeamManipulator::set+          Minor          : 3 arcmin
21-Oct-2026 13:23:11 2026-10-21 17:23:12        INFO        BeamManipulator::set+          Position Angle : 0 deg
21-Oct-2026 13:23:11 2026-10-21 17:23:12        INFO        ImageRegion::fromRecord        Selected bounding box :
21-Oct-2026 13:23:11 2026-10-21 17:23:12        INFO        ImageRegion::fromRecord+            [0, 0, 0] to [1, 1, 1]  (00:00:04.000, -00.01.00.000, I to 00:00:00.000, +00.00.00.000, Q)
21-Oct-2026 13:23:11 2026-10-21 17:23:12        INFO        ImageRegion::fromRecord        Selected bounding box :
21-Oct-2026 13:23:11 2026-10-21 17:23:12        INFO        ImageRegion::fromRecord+            [0, 0, 0] to [1, 1, 1]  (00:00:04.000, -00.01.00.000, I to 00:00:00.000, +00.00.00.000, Q)
21-Oct-2026 13:23:11 2026-10-21 17:23:12        INFO        name::        No table opened.
21-Oct-2026 13:23:11 2026-10-21 17:23:12        INFO        showcache::        The Table Cache is empty.
21-Oct-2026 13:23:11 2026-10-21 17:23:12        INFO        name::        No table opened.
21-Oct-2026 13:23:11 2026-10-21 17:23:12        INFO        name::        No table opened.
21-Oct-2026 13:23:11 test_tool_image_collapse.py::ia_collapse_test::test_sqrtsum_npix_beam
21-Oct-2026 13:23:11 Test sqrtsum function
21-Oct-2026 13:23:11 PASSED
21-Oct-2026 13:23:11
21-Oct-2026 13:23:11 2026-10-21 17:23:12        INFO        FITSCoordinateUtil::fromFITSHeader        Neither SPECSYS nor VELREF keyword given, spectral reference frame not defined ...
21-Oct-2026 13:23:11 2026-10-21 17:23:12        INFO        ImageFactory::createImage        Created Paged image 'ymask' of shape [3, 3, 1, 1] with float valued pixels.
21-Oct-2026 13:23:11 2026-10-21 17:23:12        INFO        FITSCoordinateUtil::fromFITSHeader        Neither SPECSYS nor VELREF keyword given, spectral reference frame not defined ...
21-Oct-2026 13:23:11 2026-10-21 17:23:12        INFO        ImageRegion::fromRecord        Selected bounding box :
21-Oct-2026 13:23:11 2026-10-21 17:23:12        INFO        ImageRegion::fromRecord+            [0, 0, 0, 0] to [2, 2, 2, 2]  (04:46:00.576, +44.50.12.522, 4.7351e+09Hz, I to 04:46:00.520, +44.50.13.123, 5.5351e+09Hz, U)
21-Oct-2026 13:23:11 2026-10-21 17:23:12        INFO        name::        No table opened.
21-Oct-2026 13:23:11 2026-10-21 17:23:12        INFO        showcache::        The Table Cache is empty.
21-Oct-2026 13:23:11 2026-10-21 17:23:12        INFO        name::        No table opened.
21-Oct-2026 13:23:11 2026-10-21 17:23:12        INFO        name::        No table opened.
21-Oct-2026 13:23:11 test_tool_image_collapse.py::ia_collapse_test::test_stretch
21-Oct-2026 13:23:11 ia.collapse(): Test stretch parameter
21-Oct-2026 13:23:11 PASSED
21-Oct-2026 13:23:11
21-Oct-2026 13:23:11 - generated xml file: /home/casatest/casa6/casatestutils/nosedir/xml/test_tool_image_collapse/nose.xml -
21-Oct-2026 13:23:11 ======================== 20 passed, 1 warning in 2.28s =========================
21-Oct-2026 13:23:12 ============================= test session starts ==============================
21-Oct-2026 13:23:12 platform linux -- Python 3.12.9, pytest-9.1.1, pluggy-1.7.0 -- /home/casatest/venv/bin/python3.12
21-Oct-2026 13:23:12 cachedir: .pytest_cache
21-Oct-2026 13:23:12 rootdir: /home/casatest/casa6/casatestutils/nosedir/test_tool_msuvbinner
21-Oct-2026 13:23:12 configfile: pytest.ini
21-Oct-2026 13:23:12 collecting ... collected 1 item
21-Oct-2026 13:23:12
21-Oct-2026 13:23:12
21-Oct-2026 13:23:14 test_tool_msuvbinner.py::msuvbinnerTest::test_fill_1ms
21-Oct-2026 13:23:14 test uvgridding 1 ms onto an output grid 
21-Oct-2026 13:23:14 PASSED
21-Oct-2026 13:23:14
21-Oct-2026 13:23:14 - generated xml file: /home/casatest/casa6/casatestutils/nosedir/xml/test_tool_msuvbinner/nose.xml -
21-Oct-2026 13:23:14 ========================= 1 passed, 1 warning in 2.85s =========================
21-Oct-2026 13:23:15 ============================= test session starts ==============================
21-Oct-2026 13:23:15 platform linux -- Python 3.12.9, pytest-9.1.1, pluggy-1.7.0 -- /home/casatest/venv/bin/python3.12
21-Oct-2026 13:23:15 cachedir: .pytest_cache
21-Oct-2026 13:23:15 rootdir: /home/casatest/casa6/casatestutils/nosedir/test_tool_quanta
21-Oct-2026 13:23:15 configfile: pytest.ini
21-Oct-2026 13:23:15 collecting ... collected 9 items
21-Oct-2026 13:23:15
21-Oct-2026 13:23:15
21-Oct-2026 13:23:15 2026-10-21 17:23:16        SEVERE                Exception Reported: Error in QuantumHolder::fromString with input string "bogus": Illegal input units or format
21-Oct-2026 13:23:15 2026-10-21 17:23:16        SEVERE        +         in converting quantity
21-Oct-2026 13:23:15 test_tool_quanta.py::quanta_convert_test::test_exceptions
21-Oct-2026 13:23:15 Test various exception cases
21-Oct-2026 13:23:15 PASSED
21-Oct-2026 13:23:15
21-Oct-2026 13:23:16 test_tool_quanta.py::quanta_convert_test::test_valid
21-Oct-2026 13:23:16 Test specifying the quantity as a scalar
21-Oct-2026 13:23:16 PASSED
21-Oct-2026 13:23:16
21-Oct-2026 13:23:16 test_tool_quanta.py::quanta_convert_test::test_value_as_string
21-Oct-2026 13:23:16 Test specifying value as a string
21-Oct-2026 13:23:16 PASSED
21-Oct-2026 13:23:16
21-Oct-2026 13:23:16 2026-10-21 17:23:16        SEVERE                Error in QuantumHolder::fromString with input string "blah": Illegal input units or format
21-Oct-2026 13:23:16 2026-10-21 17:23:16        SEVERE        +         in converting quantity
21-Oct-2026 13:23:16 2026-10-21 17:23:16        SEVERE                Exception Reported: Error in QuantumHolder::fromString with input string "blah": Illegal input units or format
21-Oct-2026 13:23:16 2026-10-21 17:23:16        SEVERE        +         in converting quantity
21-Oct-2026 13:23:16 2026-10-21 17:23:16        SEVERE                Error in QuantumHolder::fromString with input string "blah": Illegal input units or format
21-Oct-2026 13:23:16 2026-10-21 17:23:16        SEVERE        +         in converting quantity
21-Oct-2026 13:23:16 2026-10-21 17:23:16        SEVERE                Exception Reported: Error in QuantumHolder::fromString with input string "blah": Illegal input units or format
21-Oct-2026 13:23:16 2026-10-21 17:23:16        SEVERE        +         in converting quantity
21-Oct-2026 13:23:16 2026-10-21 17:23:16        SEVERE                Exception Reported: Unit::check Illegal unit string 'zz'
21-Oct-2026 13:23:16 2026-10-21 17:23:16        SEVERE                Exception Reported: Unit::check Illegal unit string 'zz'
21-Oct-2026 13:23:16 test_tool_quanta.py::quanta_quantity_test::test_exceptions
21-Oct-2026 13:23:16 Test various exception cases
21-Oct-2026 13:23:16 PASSED
21-Oct-2026 13:23:16
21-Oct-2026 13:23:16 test_tool_quanta.py::quanta_quantity_test::test_multidimensional_arra_value
21-Oct-2026 13:23:16 Test specifying the quantity as a multidimensional array
21-Oct-2026 13:23:16 PASSED
21-Oct-2026 13:23:16
21-Oct-2026 13:23:16 test_tool_quanta.py::quanta_quantity_test::test_scalar_value
21-Oct-2026 13:23:16 Test specifying the quantity as a scalar
21-Oct-2026 13:23:16 PASSED
21-Oct-2026 13:23:16
21-Oct-2026 13:23:16 test_tool_quanta.py::quanta_quantity_test::test_value_as_record
21-Oct-2026 13:23:16 Test value as record (eg already a quantity).
21-Oct-2026 13:23:16 This is essentially a reflection operator.
21-Oct-2026 13:23:16 PASSED
21-Oct-2026 13:23:16
21-Oct-2026 13:23:16 test_tool_quanta.py::quanta_quantity_test::test_value_as_string
21-Oct-2026 13:23:16 Test specifying value as a string
21-Oct-2026 13:23:16 PASSED
21-Oct-2026 13:23:16
21-Oct-2026 13:23:16 test_tool_quanta.py::quanta_quantity_test::test_vector_value
21-Oct-2026 13:23:16 Test specifying the quantity as a vector
21-Oct-2026 13:23:16 PASSED
21-Oct-2026 13:23:16
21-Oct-2026 13:23:16 - generated xml file: /home/casatest/casa6/casatestutils/nosedir/xml/test_tool_quanta/nose.xml -
21-Oct-2026 13:23:16 ========================= 9 passed, 1 warning in 0.85s =========================
21-Oct-2026 13:23:16 ============================= test session starts ==============================
21-Oct-2026 13:23:16 platform linux -- Python 3.12.9, pytest-9.1.1, pluggy-1.7.0 -- /home/casatest/venv/bin/python3.12
21-Oct-2026 13:23:16 cachedir: .pytest_cache
21-Oct-2026 13:23:16 rootdir: /home/casatest/casa6/casatestutils/nosedir/test_tool_msmetadata
21-Oct-2026 13:23:16 configfile: pytest.ini
21-Oct-2026 13:23:17 collecting ... collected 85 items
21-Oct-2026 13:23:17
21-Oct-2026 13:23:17
21-Oct-2026 13:23:17 2026-10-21 17:23:17        INFO        msmetadata_cmpt.cc::open        Performing internal consistency checks on /opt/casa/data/casatestdata/unittest/msmetadata/MSMetaData.ms...
21-Oct-2026 13:23:17 2026-10-21 17:23:17        SEVERE        msmetadata_cmpt.cc::chanwidths        Exception Reported: From/to units not consistent. Cannot convert Hz to km/s at File: /source/casainstall/include/casacore/casa/Quanta/Quantum.tcc, line: 256
21-Oct-2026 13:23:17 test_tool_msmetadata.py::msmetadata_test::test_CAS7463
21-Oct-2026 13:23:17 PASSED
21-Oct-2026 13:23:17
21-Oct-2026 13:23:17 2026-10-21 17:23:17        INFO        msmetadata_cmpt.cc::open        Performing internal consistency checks on /opt/casa/data/casatestdata/unittest/msmetadata/MSMetaData.ms...
21-Oct-2026 13:23:17 2026-10-21 17:23:17        INFO        MSFitsInput::MSFitsInput        Converting FITS file '/opt/casa/data/casatestdata/unittest/msmetadata/W3OH_MC.UVFITS' to MeasurementSet 'lala.ms'
21-Oct-2026 13:23:17 2026-10-21 17:23:17        INFO        MSFitsInput::setupMeasurementSet        Using tile shape [1, 38, 3449] for VLA with obstype=0
21-Oct-2026 13:23:17 2026-10-21 17:23:18        INFO        MSFitsInput::fillMSMainTableColWise        SOURCE not found in UU---SIN VV---SIN WW---SIN BASELINE DATE DATE
21-Oct-2026 13:23:17 2026-10-21 17:23:18        INFO        MSFitsInput::fillMSMainTableColWise        FREQSEL not found in UU---SIN VV---SIN WW---SIN BASELINE DATE DATE
21-Oct-2026 13:23:17 2026-10-21 17:23:18        INFO        MSFitsInput::fillMSMainTableColWise        Reading and writing 16311 visibility groups
21-Oct-2026 13:23:18 2026-10-21 17:23:18        INFO        MSFitsInput::readRandomGroupUVFits        extname=AIPS NX  nrows=1 ncols=7 rowsize=28 pcount=0 gcount=1
21-Oct-2026 13:23:18 2026-10-21 17:23:18        INFO        MSFitsInput::readRandomGroupUVFits        Skipping table, duplicate or unrecognized type: AIPS NX
21-Oct-2026 13:23:18 2026-10-21 17:23:18        INFO        MSFitsInput::readRandomGroupUVFits        extname=AIPS FQ  nrows=1 ncols=5 rowsize=24 pcount=0 gcount=1
21-Oct-2026 13:23:18 2026-10-21 17:23:18        INFO        MSFitsInput::readRandomGroupUVFits        extname=AIPS WX  nrows=155 ncols=11 rowsize=48 pcount=0 gcount=1
21-Oct-2026 13:23:18 2026-10-21 17:23:18        INFO        MSFitsInput::readRandomGroupUVFits        Skipping table, duplicate or unrecognized type: AIPS WX
21-Oct-2026 13:23:18 2026-10-21 17:23:18        INFO        MSFitsInput::readRandomGroupUVFits        extname=AIPS OF  nrows=100 ncols=7 rowsize=28 pcount=0 gcount=1
21-Oct-2026 13:23:18 2026-10-21 17:23:18        INFO        MSFitsInput::readRandomGroupUVFits        Skipping table, duplicate or unrecognized type: AIPS OF
21-Oct-2026 13:23:18 2026-10-21 17:23:18        INFO        MSFitsInput::readRandomGroupUVFits        extname=AIPS AN  nrows=29 ncols=14 rowsize=78 pcount=0 gcount=1
21-Oct-2026 13:23:18 2026-10-21 17:23:18        INFO        MSFitsInput::fillAntennaTable        This looks like an old VLA archive UVFITS file
21-Oct-2026 13:23:18 2026-10-21 17:23:18        INFO        MSFitsInput::fillAntennaTable        UVFITS file telescope position is 2.13393e-09 meters from CASA Observatories table VLA position
21-Oct-2026 13:23:18 2026-10-21 17:23:18        INFO        MSFitsInput::fillAntennaTable        Performing transformation of antenna positions from coordinate frame used by MODCOMPs to ITRF
21-Oct-2026 13:23:18 2026-10-21 17:23:18        INFO        MSFitsInput::fillExtraTables        Filling SOURCE table (this may take some time).
21-Oct-2026 13:23:18 2026-10-21 17:23:18        WARN        MSFitsInput::fillExtraTable        No systemic velocity for field 0
21-Oct-2026 13:23:18 2026-10-21 17:23:18        WARN        MSFitsInput::fillExtraTable        No rest frequency for field 0
21-Oct-2026 13:23:18 2026-10-21 17:23:18        INFO        msmetadata_cmpt.cc::open        Performing internal consistency checks on lala.ms...
21-Oct-2026 13:23:18 test_tool_msmetadata.py::msmetadata_test::test_CAS7837
21-Oct-2026 13:23:18 Test corner case with no intents to make sure it doesn't segfault
21-Oct-2026 13:23:18 PASSED
21-Oct-2026 13:23:18
21-Oct-2026 13:23:18 2026-10-21 17:23:18        INFO        msmetadata_cmpt.cc::open        Performing internal consistency checks on /opt/casa/data/casatestdata/unittest/msmetadata/MSMetaData.ms...
21-Oct-2026 13:23:18 2026-10-21 17:23:19        INFO        msmetadata_cmpt.cc::open        Performing internal consistency checks on cas7986.ms...
21-Oct-2026 13:23:18 2026-10-21 17:23:19        SEVERE        ms::close        Exception Reported: Exception: Illegal ANTENNA1 value 9 found in main table. /home/casatest/casa6/casatestutils/nosedir/test_tool_msmetadata/cas7986.ms/ANTENNA only has 8 rows (IDs).
21-Oct-2026 13:23:18 2026-10-21 17:23:19        SEVERE        ms::close+        ... thrown by void casa::MSChecker::checkReferentialIntegrity() const at File: /source/casa6/casatools/src/code/msvis/MSVis/MSChecker.cc, line: 73
21-Oct-2026 13:23:18 2026-10-21 17:23:19        INFO        msmetadata_cmpt.cc::open        Performing internal consistency checks on cas7986.ms...
21-Oct-2026 13:23:18 2026-10-21 17:23:19        SEVERE        msmetadata_cmpt.cc::open        Exception Reported: Exception: Illegal ANTENNA1 value 9 found in main table. /home/casatest/casa6/casatestutils/nosedir/test_tool_msmetadata/cas7986.ms/ANTENNA only has 8 rows (IDs).
21-Oct-2026 13:23:18 2026-10-21 17:23:19        SEVERE        msmetadata_cmpt.cc::open+        ... thrown by void casa::MSChecker::checkReferentialIntegrity() const at File: /source/casa6/casatools/src/code/msvis/MSVis/MSChecker.cc, line: 73
21-Oct-2026 13:23:18 2026-10-21 17:23:19        INFO        msmetadata_cmpt.cc::open        Performing internal consistency checks on cas7986.ms...
21-Oct-2026 13:23:18 2026-10-21 17:23:19        SEVERE        ms::close        Exception Reported: Exception: Illegal ANTENNA2 value 9 found in main table. /home/casatest/casa6/casatestutils/nosedir/test_tool_msmetadata/cas7986.ms/ANTENNA only has 8 rows (IDs).
21-Oct-2026 13:23:18 2026-10-21 17:23:19        SEVERE        ms::close+        ... thrown by void casa::MSChecker::checkReferentialIntegrity() const at File: /source/casa6/casatools/src/code/msvis/MSVis/MSChecker.cc, line: 73
21-Oct-2026 13:23:18 2026-10-21 17:23:19        INFO        msmetadata_cmpt.cc::open        Performing internal consistency checks on cas7986.ms...
21-Oct-2026 13:23:18 2026-10-21 17:23:19        SEVERE        msmetadata_cmpt.cc::open        Exception Reported: Exception: Illegal ANTENNA2 value 9 found in main table. /home/casatest/casa6/casatestutils/nosedir/test_tool_msmetadata/cas7986.ms/ANTENNA only has 8 rows (IDs).
21-Oct-2026 13:23:18 2026-10-21 17:23:19        SEVERE        msmetadata_cmpt.cc::open+        ... thrown by void casa::MSChecker::checkReferentialIntegrity() const at File: /source/casa6/casatools/src/code/msvis/MSVis/MSChecker.cc, line: 73
21-Oct-2026 13:23:18 2026-10-21 17:23:19        INFO        msmetadata_cmpt.cc::open        Performing internal consistency checks on cas7986.ms...
21-Oct-2026 13:23:18 2026-10-21 17:23:19        SEVERE        ms::close        Exception Reported: Exception: Illegal DATA_DESC_ID value 9 found in main table. /home/casatest/casa6/casatestutils/nosedir/test_tool_msmetadata/cas7986.ms/DATA_DESCRIPTION only has 3 rows (IDs).
21-Oct-2026 13:23:18 2026-10-21 17:23:19        SEVERE        ms::close+        ... thrown by void casa::MSChecker::checkReferentialIntegrity() const at File: /source/casa6/casatools/src/code/msvis/MSVis/MSChecker.cc, line: 73
21-Oct-2026 13:23:18 2026-10-21 17:23:19        INFO        msmetadata_cmpt.cc::open        Performing internal consistency checks on cas7986.ms...
21-Oct-2026 13:23:18 2026-10-21 17:23:19        SEVERE        msmetadata_cmpt.cc::open        Exception Reported: Exception: Illegal DATA_DESC_ID value 9 found in main table. /home/casatest/casa6/casatestutils/nosedir/test_tool_msmetadata/cas7986.ms/DATA_DESCRIPTION only has 3 rows (IDs).
21-Oct-2026 13:23:18 2026-10-21 17:23:19        SEVERE        msmetadata_cmpt.cc::open+        ... thrown by void casa::MSChecker::checkReferentialIntegrity() const at File: /source/casa6/casatools/src/code/msvis/MSVis/MSChecker.cc, line: 73
21-Oct-2026 13:23:18 2026-10-21 17:23:19        INFO        msmetadata_cmpt.cc::open        Performing internal consistency checks on cas7986.ms...
21-Oct-2026 13:23:18 2026-10-21 17:23:19        SEVERE        ms::close        Exception Reported: Exception: Illegal FIELD_ID value 9 found in main table. /home/casatest/casa6/casatestutils/nosedir/test_tool_msmetadata/cas7986.ms/FIELD only has 1 rows (IDs).
21-Oct-2026 13:23:18 2026-10-21 17:23:19        SEVERE        ms::close+        ... thrown by void casa::MSChecker::checkReferentialIntegrity() const at File: /source/casa6/casatools/src/code/msvis/MSVis/MSChecker.cc, line: 73
21-Oct-2026 13:23:18 2026-10-21 17:23:19        INFO        msmetadata_cmpt.cc::open        Performing internal consistency checks on cas7986.ms...
21-Oct-2026 13:23:18 2026-10-21 17:23:19        SEVERE        msmetadata_cmpt.cc::open        Exception Reported: Exception: Illegal FIELD_ID value 9 found in main table. /home/casatest/casa6/casatestutils/nosedir/test_tool_msmetadata/cas7986.ms/FIELD only has 1 rows (IDs).
21-Oct-2026 13:23:18 2026-10-21 17:23:19        SEVERE        msmetadata_cmpt.cc::open+        ... thrown by void casa::MSChecker::checkReferentialIntegrity() const at File: /source/casa6/casatools/src/code/msvis/MSVis/MSChecker.cc, line: 73
21-Oct-2026 13:23:18 test_tool_msmetadata.py::msmetadata_test::test_CAS7986
21-Oct-2026 13:23:18 Verify datasets with referential integrity issues cause errors
21-Oct-2026 13:23:18 PASSED
21-Oct-2026 13:23:18
21-Oct-2026 13:23:18 2026-10-21 17:23:19        INFO        msmetadata_cmpt.cc::open        Performing internal consistency checks on /opt/casa/data/casatestdata/unittest/msmetadata/MSMetaData.ms...
21-Oct-2026 13:23:19 2026-10-21 17:23:20        INFO        msmetadata_cmpt.cc::open        Performing internal consistency checks on /opt/casa/data/casatestdata/unittest/msmetadata/fdmtdm.ms...
21-Oct-2026 13:23:19 test_tool_msmetadata.py::msmetadata_test::test_alma_fdmtdm_heavy_online_averaging
21-Oct-2026 13:23:19 CAS-14435 proper fdm/tdm identification in cases
21-Oct-2026 13:23:19 of heavy online averaging
21-Oct-2026 13:23:19 PASSED
21-Oct-2026 13:23:19
21-Oct-2026 13:23:19 2026-10-21 17:23:20        INFO        msmetadata_cmpt.cc::open        Performing internal consistency checks on /opt/casa/data/casatestdata/unittest/msmetadata/MSMetaData.ms...
21-Oct-2026 13:23:19 test_tool_msmetadata.py::msmetadata_test::test_almaspws
21-Oct-2026 13:23:19 Test almaspws()
21-Oct-2026 13:23:19 PASSED
21-Oct-2026 13:23:19
21-Oct-2026 13:23:19 2026-10-21 17:23:20        INFO        msmetadata_cmpt.cc::open        Performing internal consistency checks on /opt/casa/data/casatestdata/unittest/msmetadata/MSMetaData.ms...
21-Oct-2026 13:23:19 test_tool_msmetadata.py::msmetadata_test::test_antennadiamter
21-Oct-2026 13:23:19 Test msmetadata.antennadiameter
21-Oct-2026 13:23:19 PASSED
21-Oct-2026 13:23:19
21-Oct-2026 13:23:19 2026-10-21 17:23:20        INFO        msmetadata_cmpt.cc::open        Performing internal consistency checks on /opt/casa/data/casatestdata/unittest/msmetadata/MSMetaData.ms...
21-Oct-2026 13:23:19 test_tool_msmetadata.py::msmetadata_test::test_antennanames_and_antennaids
21-Oct-2026 13:23:19 Test antennanames() and antennaids()
21-Oct-2026 13:23:19 PASSED
21-Oct-2026 13:23:19
21-Oct-2026 13:23:19 2026-10-21 17:23:20        INFO        msmetadata_cmpt.cc::open        Performing internal consistency checks on /opt/casa/data/casatestdata/unittest/msmetadata/MSMetaData.ms...
21-Oct-2026 13:23:19 2026-10-21 17:23:20        INFO        MSMetaData::_computeScanAndSubScanProperties         Computing scan and subscan properties...
21-Oct-2026 13:23:19 2026-10-21 17:23:20        SEVERE        msmetadata_cmpt.cc::antennasforscan        Exception Reported: Exception: No matching scans found.
21-Oct-2026 13:23:19 2026-10-21 17:23:20        SEVERE        msmetadata_cmpt.cc::antennasforscan+        ... thrown by std::set<casacore::ScanKey> casac::msmetadata::_getScanKeys(long int, long int, long int) const at File: src/tools/msmetadata/msmetadata_cmpt.cc, line: 2485
21-Oct-2026 13:23:19 2026-10-21 17:23:20        SEVERE        msmetadata_cmpt.cc::antennasforscan        Exception Reported: Exception: No matching scans found.
21-Oct-2026 13:23:19 2026-10-21 17:23:20        SEVERE        msmetadata_cmpt.cc::antennasforscan+        ... thrown by std::set<casacore::ScanKey> casac::msmetadata::_getScanKeys(long int, long int, long int) const at File: src/tools/msmetadata/msmetadata_cmpt.cc, line: 2485
21-Oct-2026 13:23:19 test_tool_msmetadata.py::msmetadata_test::test_antennasforscan
21-Oct-2026 13:23:19 Test msmetadata.antennasforscan()
21-Oct-2026 13:23:19 PASSED
21-Oct-2026 13:23:19
21-Oct-2026 13:23:19 2026-10-21 17:23:20        INFO        msmetadata_cmpt.cc::open        Performing internal consistency checks on /opt/casa/data/casatestdata/unittest/msmetadata/MSMetaData.ms...
21-Oct-2026 13:23:19 2026-10-21 17:23:20        SEVERE        msmetadata_cmpt.cc::antennastations        Exception Reported: No antenna ID may be less than zero when multiple IDs specified.
21-Oct-2026 13:23:19 2026-10-21 17:23:20        SEVERE        msmetadata_cmpt.cc::antennastations        Exception Reported: Exception: MSMetaData::_hasAntennaID: Requested antenna ID 20 is greater than or equal to the number of records (15) in this MS's ANTENNA table.
21-Oct-2026 13:23:19 2026-10-21 17:23:20        SEVERE        msmetadata_cmpt.cc::antennastations+        ... thrown by void casacore::MSMetaData::_hasAntennaID(casacore::Int) at File: /source/casa6/casatools/casacore/ms/MSOper/MSMetaData.cc, line: 4925
21-Oct-2026 13:23:19 2026-10-21 17:23:20        SEVERE        msmetadata_cmpt.cc::antennastations        Exception Reported: Exception: MSMetaData::_hasAntennaID: Requested antenna ID 20 is greater than or equal to the number of records (15) in this MS's ANTENNA table.
21-Oct-2026 13:23:19 2026-10-21 17:23:20        SEVERE        msmetadata_cmpt.cc::antennastations+        ... thrown by void casacore::MSMetaData::_hasAntennaID(casacore::Int) at File: /source/casa6/casatools/casacore/ms/MSOper/MSMetaData.cc, line: 4925
21-Oct-2026 13:23:19 test_tool_msmetadata.py::msmetadata_test::test_antennastations
21-Oct-2026 13:23:19 Test antennastations()
21-Oct-2026 13:23:19 PASSED
21-Oct-2026 13:23:19
21-Oct-2026 13:23:19 2026-10-21 17:23:20        INFO        msmetadata_cmpt.cc::open        Performing internal consistency checks on /opt/casa/data/casatestdata/unittest/msmetadata/MSMetaData.ms...
21-Oct-2026 13:23:19 2026-10-21 17:23:20        SEVERE        msmetadata_cmpt.cc::bandwidths        Exception Reported: Exception: Spectral window ID 50 out of range, must be less than or equal to 39.
21-Oct-2026 13:23:19 2026-10-21 17:23:20        SEVERE        msmetadata_cmpt.cc::bandwidths+        ... thrown by void casac::msmetadata::_checkSpwId(int, bool) const at File: src/tools/msmetadata/msmetadata_cmpt.cc, line: 2443
21-Oct-2026 13:23:19 2026-10-21 17:23:20        SEVERE        msmetadata_cmpt.cc::bandwidths        Exception Reported: Exception: Spectral window ID 50 out of range, must be less than or equal to 39.
21-Oct-2026 13:23:19 2026-10-21 17:23:20        SEVERE        msmetadata_cmpt.cc::bandwidths+        ... thrown by void casac::msmetadata::_checkSpwId(int, bool) const at File: src/tools/msmetadata/msmetadata_cmpt.cc, line: 2443
21-Oct-2026 13:23:19 2026-10-21 17:23:20        SEVERE        msmetadata_cmpt.cc::bandwidths        Exception Reported: Exception: When specified as an array, no element of spws may be < 0.
21-Oct-2026 13:23:19 2026-10-21 17:23:20        SEVERE        msmetadata_cmpt.cc::bandwidths+        ... thrown by casac::variant* casac::msmetadata::bandwidths(const casac::variant&) at File: src/tools/msmetadata/msmetadata_cmpt.cc, line: 575
21-Oct-2026 13:23:19 test_tool_msmetadata.py::msmetadata_test::test_bandwidths
21-Oct-2026 13:23:19 Test bandwidths()
21-Oct-2026 13:23:19 PASSED
21-Oct-2026 13:23:19
21-Oct-2026 13:23:19 2026-10-21 17:23:20        INFO        msmetadata_cmpt.cc::open        Performing internal consistency checks on /opt/casa/data/casatestdata/unittest/msmetadata/MSMetaData.ms...
21-Oct-2026 13:23:19 test_tool_msmetadata.py::msmetadata_test::test_chanavgspws
21-Oct-2026 13:23:19 Test chanavgspws()
21-Oct-2026 13:23:19 PASSED
21-Oct-2026 13:23:19
21-Oct-2026 13:23:19 2026-10-21 17:23:20        INFO        msmetadata_cmpt.cc::open        Performing internal consistency checks on /opt/casa/data/casatestdata/unittest/msmetadata/MSMetaData.ms...
21-Oct-2026 13:23:20 test_tool_msmetadata.py::msmetadata_test::test_chaneffbws
21-Oct-2026 13:23:20 Test chaneffbws()
21-Oct-2026 13:23:20 PASSED
21-Oct-2026 13:23:20
21-Oct-2026 13:23:20 2026-10-21 17:23:20        INFO        msmetadata_cmpt.cc::open        Performing internal consistency checks on /opt/casa/data/casatestdata/unittest/msmetadata/MSMetaData.ms...
21-Oct-2026 13:23:20 test_tool_msmetadata.py::msmetadata_test::test_chanres
21-Oct-2026 13:23:20 Test chanres()
21-Oct-2026 13:23:20 PASSED
21-Oct-2026 13:23:20
21-Oct-2026 13:23:20 2026-10-21 17:23:20        INFO        msmetadata_cmpt.cc::open        Performing internal consistency checks on /opt/casa/data/casatestdata/unittest/msmetadata/MSMetaData.ms...
21-Oct-2026 13:23:20 2026-10-21 17:23:20        SEVERE        msmetadata_cmpt.cc::chanwidths        Exception Reported: Exception: Spectral window ID 50 out of range, must be nonnegative and less than or equal to 39.
21-Oct-2026 13:23:20 2026-10-21 17:23:20        SEVERE        msmetadata_cmpt.cc::chanwidths+        ... thrown by void casac::msmetadata::_checkSpwId(int, bool) const at File: src/tools/msmetadata/msmetadata_cmpt.cc, line: 2443
21-Oct-2026 13:23:20 2026-10-21 17:23:20        SEVERE        msmetadata_cmpt.cc::chanwidths        Exception Reported: Exception: Spectral window ID -2 out of range, must be nonnegative and less than or equal to 39.
21-Oct-2026 13:23:20 2026-10-21 17:23:20        SEVERE        msmetadata_cmpt.cc::chanwidths+        ... thrown by void casac::msmetadata::_checkSpwId(int, bool) const at File: src/tools/msmetadata/msmetadata_cmpt.cc, line: 2443
21-Oct-2026 13:23:20 2026-10-21 17:23:20        SEVERE        msmetadata_cmpt.cc::chanwidths        Exception Reported: Tool is not attached to an MS. Use open()
21-Oct-2026 13:23:20 2026-10-21 17:23:20        SEVERE        msmetadata_cmpt.cc::chanfreqs        Exception Reported: Tool is not attached to an MS. Use open()
21-Oct-2026 13:23:20 2026-10-21 17:23:20        SEVERE        msmetadata_cmpt.cc::meanfreq        Exception Reported: Tool is not attached to an MS. Use open()
21-Oct-2026 13:23:20 2026-10-21 17:23:20        SEVERE        msmetadata_cmpt.cc::sideband        Exception Reported: Tool is not attached to an MS. Use open()
21-Oct-2026 13:23:20 2026-10-21 17:23:20        SEVERE        msmetadata_cmpt.cc::effexposuretime        Exception Reported: Tool is not attached to an MS. Use open()
21-Oct-2026 13:23:20 test_tool_msmetadata.py::msmetadata_test::test_chanwidths
21-Oct-2026 13:23:20 Test chanwidths()
21-Oct-2026 13:23:20 PASSED
21-Oct-2026 13:23:20
21-Oct-2026 13:23:20 2026-10-21 17:23:20        INFO        msmetadata_cmpt.cc::open        Performing internal consistency checks on /opt/casa/data/casatestdata/unittest/msmetadata/MSMetaData.ms...
21-Oct-2026 13:23:20 test_tool_msmetadata.py::msmetadata_test::test_corrbit
21-Oct-2026 13:23:20 Test corrbit()
21-Oct-2026 13:23:20 PASSED
21-Oct-2026 13:23:20
21-Oct-2026 13:23:20 2026-10-21 17:23:20        INFO        msmetadata_cmpt.cc::open        Performing internal consistency checks on /opt/casa/data/casatestdata/unittest/msmetadata/MSMetaData.ms...
21-Oct-2026 13:23:20 2026-10-21 17:23:20        SEVERE        msmetadata_cmpt.cc::corrprodsforpol        Exception Reported: Exception: Polarization ID cannot be negative.
21-Oct-2026 13:23:20 2026-10-21 17:23:20        SEVERE        msmetadata_cmpt.cc::corrprodsforpol+        ... thrown by void casac::msmetadata::_checkPolId(int, bool) const at File: src/tools/msmetadata/msmetadata_cmpt.cc, line: 2459
21-Oct-2026 13:23:20 2026-10-21 17:23:20        SEVERE        msmetadata_cmpt.cc::corrprodsforpol        Exception Reported: Exception: Polarization ID 2 out of range, must be less than 2.
21-Oct-2026 13:23:20 2026-10-21 17:23:20        SEVERE        msmetadata_cmpt.cc::corrprodsforpol+        ... thrown by void casac::msmetadata::_checkPolId(int, bool) const at File: src/tools/msmetadata/msmetadata_cmpt.cc, line: 2453
21-Oct-2026 13:23:20 test_tool_msmetadata.py::msmetadata_test::test_corrprodsforpol
21-Oct-2026 13:23:20 Test msmetadata.corrprodssforpol()
21-Oct-2026 13:23:20 PASSED
21-Oct-2026 13:23:20
21-Oct-2026 13:23:20 2026-10-21 17:23:20        INFO        msmetadata_cmpt.cc::open        Performing internal consistency checks on /opt/casa/data/casatestdata/unittest/msmetadata/MSMetaData.ms...
21-Oct-2026 13:23:20 2026-10-21 17:23:20        SEVERE        msmetadata_cmpt.cc::corrtypesforpol        Exception Reported: Exception: Polarization ID cannot be negative.
21-Oct-2026 13:23:20 2026-10-21 17:23:20        SEVERE        msmetadata_cmpt.cc::corrtypesforpol+        ... thrown by void casac::msmetadata::_checkPolId(int, bool) const at File: src/tools/msmetadata/msmetadata_cmpt.cc, line: 2459
21-Oct-2026 13:23:20 2026-10-21 17:23:20        SEVERE        msmetadata_cmpt.cc::corrtypesforpol        Exception Reported: Exception: Polarization ID 2 out of range, must be less than 2.
21-Oct-2026 13:23:20 2026-10-21 17:23:20        SEVERE        msmetadata_cmpt.cc::corrtypesforpol+        ... thrown by void casac::msmetadata::_checkPolId(int, bool) const at File: src/tools/msmetadata/msmetadata_cmpt.cc, line: 2453
21-Oct-2026 13:23:20 test_tool_msmetadata.py::msmetadata_test::test_corrtypesforpol
21-Oct-2026 13:23:20 Test msmetadata.corrtypesforpol()
21-Oct-2026 13:23:20 PASSED
21-Oct-2026 13:23:20
21-Oct-2026 13:23:20 2026-10-21 17:23:20        INFO        msmetadata_cmpt.cc::open        Performing internal consistency checks on /opt/casa/data/casatestdata/unittest/msmetadata/MSMetaData.ms...
21-Oct-2026 13:23:20 test_tool_msmetadata.py::msmetadata_test::test_datadescids
21-Oct-2026 13:23:20 Test datadescids()
21-Oct-2026 13:23:20 PASSED
21-Oct-2026 13:23:20
21-Oct-2026 13:23:20 2026-10-21 17:23:20        INFO        msmetadata_cmpt.cc::open        Performing internal consistency checks on /opt/casa/data/casatestdata/unittest/msmetadata/MSMetaData.ms...
21-Oct-2026 13:23:20 2026-10-21 17:23:20        SEVERE        msmetadata_cmpt.cc::exposuretime        Exception Reported: Exception: MS has no data description ID for spectral window ID 0 and polarization ID 0.
21-Oct-2026 13:23:20 2026-10-21 17:23:20        SEVERE        msmetadata_cmpt.cc::exposuretime+        ... thrown by casac::record* casac::msmetadata::exposuretime(long int, long int, long int, long int, long int) at File: src/tools/msmetadata/msmetadata_cmpt.cc, line: 816
21-Oct-2026 13:23:20 2026-10-21 17:23:20        INFO        MSMetaData::_computeScanAndSubScanProperties         Computing scan and subscan properties...
21-Oct-2026 13:23:20 test_tool_msmetadata.py::msmetadata_test::test_exposuretime
21-Oct-2026 13:23:20 Test exposuretime()
21-Oct-2026 13:23:20 PASSED
21-Oct-2026 13:23:20
21-Oct-2026 13:23:20 2026-10-21 17:23:20        INFO        msmetadata_cmpt.cc::open        Performing internal consistency checks on /opt/casa/data/casatestdata/unittest/msmetadata/MSMetaData.ms...
21-Oct-2026 13:23:20 test_tool_msmetadata.py::msmetadata_test::test_fdmspws
21-Oct-2026 13:23:20 Test fdmspws()
21-Oct-2026 13:23:20 PASSED
21-Oct-2026 13:23:20
21-Oct-2026 13:23:20 2026-10-21 17:23:20        INFO        msmetadata_cmpt.cc::open        Performing internal consistency checks on /opt/casa/data/casatestdata/unittest/msmetadata/MSMetaData.ms...
21-Oct-2026 13:23:20 test_tool_msmetadata.py::msmetadata_test::test_fieldnames
21-Oct-2026 13:23:20 PASSED
21-Oct-2026 13:23:20
21-Oct-2026 13:23:20 2026-10-21 17:23:20        INFO        msmetadata_cmpt.cc::open        Performing internal consistency checks on /opt/casa/data/casatestdata/unittest/msmetadata/MSMetaData.ms...
21-Oct-2026 13:23:20 test_tool_msmetadata.py::msmetadata_test::test_fieldsforintent
21-Oct-2026 13:23:20 Test fieldsforintent()
21-Oct-2026 13:23:20 PASSED
21-Oct-2026 13:23:20
21-Oct-2026 13:23:20 2026-10-21 17:23:20        INFO        msmetadata_cmpt.cc::open        Performing internal consistency checks on /opt/casa/data/casatestdata/unittest/msmetadata/MSMetaData.ms...
21-Oct-2026 13:23:20 test_tool_msmetadata.py::msmetadata_test::test_fieldsforname
21-Oct-2026 13:23:20 Test fieldforname()
21-Oct-2026 13:23:20 PASSED
21-Oct-2026 13:23:20
21-Oct-2026 13:23:20 2026-10-21 17:23:20        INFO        msmetadata_cmpt.cc::open        Performing internal consistency checks on /opt/casa/data/casatestdata/unittest/msmetadata/MSMetaData.ms...
21-Oct-2026 13:23:20 2026-10-21 17:23:20        INFO        MSMetaData::_computeScanAndSubScanProperties         Computing scan and subscan properties...
21-Oct-2026 13:23:20 2026-10-21 17:23:20        SEVERE        msmetadata_cmpt.cc::fieldsforscans        Exception Reported: Exception: When asmap is true, both obsid and arrayid must be nonnegative.
21-Oct-2026 13:23:20 2026-10-21 17:23:20        SEVERE        msmetadata_cmpt.cc::fieldsforscans+        ... thrown by casac::variant* casac::msmetadata::fieldsforscans(const std::vector<long int>&, bool, long int, long int, bool) at File: src/tools/msmetadata/msmetadata_cmpt.cc, line: 944
21-Oct-2026 13:23:20 test_tool_msmetadata.py::msmetadata_test::test_fieldsforscan
21-Oct-2026 13:23:20 Test fieldsforscan() and fieldsforscans()
21-Oct-2026 13:23:20 PASSED
21-Oct-2026 13:23:20
21-Oct-2026 13:23:20 2026-10-21 17:23:20        INFO        msmetadata_cmpt.cc::open        Performing internal consistency checks on /opt/casa/data/casatestdata/unittest/msmetadata/MSMetaData.ms...
21-Oct-2026 13:23:20 test_tool_msmetadata.py::msmetadata_test::test_fieldsforsource
21-Oct-2026 13:23:20 Test fieldsforsource() and fieldsforsources()
21-Oct-2026 13:23:20 PASSED
21-Oct-2026 13:23:20
21-Oct-2026 13:23:20 2026-10-21 17:23:20        INFO        msmetadata_cmpt.cc::open        Performing internal consistency checks on /opt/casa/data/casatestdata/unittest/msmetadata/MSMetaData.ms...
21-Oct-2026 13:23:20 2026-10-21 17:23:20        INFO        MSMetaData::_computeScanAndSubScanProperties         Computing scan and subscan properties...
21-Oct-2026 13:23:20 test_tool_msmetadata.py::msmetadata_test::test_fieldsforspw
21-Oct-2026 13:23:20 Test fieldsforspw()
21-Oct-2026 13:23:20 PASSED
21-Oct-2026 13:23:20
21-Oct-2026 13:23:20 2026-10-21 17:23:20        INFO        msmetadata_cmpt.cc::open        Performing internal consistency checks on /opt/casa/data/casatestdata/unittest/msmetadata/MSMetaData.ms...
21-Oct-2026 13:23:20 test_tool_msmetadata.py::msmetadata_test::test_fieldsfortimes
21-Oct-2026 13:23:20 Test fieldsfortimes()
21-Oct-2026 13:23:20 PASSED
21-Oct-2026 13:23:20
21-Oct-2026 13:23:20 2026-10-21 17:23:20        INFO        msmetadata_cmpt.cc::open        Performing internal consistency checks on /opt/casa/data/casatestdata/unittest/msmetadata/MSMetaData.ms...
21-Oct-2026 13:23:20 test_tool_msmetadata.py::msmetadata_test::test_intents
21-Oct-2026 13:23:20 Test intents()
21-Oct-2026 13:23:20 PASSED
21-Oct-2026 13:23:20
21-Oct-2026 13:23:20 2026-10-21 17:23:20        INFO        msmetadata_cmpt.cc::open        Performing internal consistency checks on /opt/casa/data/casatestdata/unittest/msmetadata/MSMetaData.ms...
21-Oct-2026 13:23:20 test_tool_msmetadata.py::msmetadata_test::test_intentsforfield
21-Oct-2026 13:23:20 Test intentsforfield()
21-Oct-2026 13:23:20 PASSED
21-Oct-2026 13:23:20
21-Oct-2026 13:23:20 2026-10-21 17:23:20        INFO        msmetadata_cmpt.cc::open        Performing internal consistency checks on /opt/casa/data/casatestdata/unittest/msmetadata/MSMetaData.ms...
21-Oct-2026 13:23:20 2026-10-21 17:23:20        INFO        MSMetaData::_computeScanAndSubScanProperties         Computing scan and subscan properties...
21-Oct-2026 13:23:20 test_tool_msmetadata.py::msmetadata_test::test_intentsforscan
21-Oct-2026 13:23:20 Test intentsforscan()
21-Oct-2026 13:23:20 PASSED
21-Oct-2026 13:23:20
21-Oct-2026 13:23:20 2026-10-21 17:23:20        INFO        msmetadata_cmpt.cc::open        Performing internal consistency checks on /opt/casa/data/casatestdata/unittest/msmetadata/MSMetaData.ms...
21-Oct-2026 13:23:20 test_tool_msmetadata.py::msmetadata_test::test_intentsforspw
21-Oct-2026 13:23:20 Test intentsforspw()
21-Oct-2026 13:23:20 PASSED
21-Oct-2026 13:23:20
21-Oct-2026 13:23:20 2026-10-21 17:23:21        INFO        msmetadata_cmpt.cc::open        Performing internal consistency checks on /opt/casa/data/casatestdata/unittest/msmetadata/MSMetaData.ms...
21-Oct-2026 13:23:20 test_tool_msmetadata.py::msmetadata_test::test_name
21-Oct-2026 13:23:20 Test name(), CAS-6817
21-Oct-2026 13:23:20 PASSED
21-Oct-2026 13:23:20
21-Oct-2026 13:23:20 2026-10-21 17:23:21        INFO        msmetadata_cmpt.cc::open        Performing internal consistency checks on /opt/casa/data/casatestdata/unittest/msmetadata/MSMetaData.ms...
21-Oct-2026 13:23:20 test_tool_msmetadata.py::msmetadata_test::test_namesforfields
21-Oct-2026 13:23:20 Test namesforfields()
21-Oct-2026 13:23:20 PASSED
21-Oct-2026 13:23:20
21-Oct-2026 13:23:20 2026-10-21 17:23:21        INFO        msmetadata_cmpt.cc::open        Performing internal consistency checks on /opt/casa/data/casatestdata/unittest/msmetadata/MSMetaData.ms...
21-Oct-2026 13:23:20 2026-10-21 17:23:21        SEVERE        msmetadata_cmpt.cc::namesforspws        Exception Reported: Exception: Spectral window ID must be nonnegative..
21-Oct-2026 13:23:20 2026-10-21 17:23:21        SEVERE        msmetadata_cmpt.cc::namesforspws+        ... thrown by std::vector<std::__cxx11::basic_string<char> > casac::msmetadata::namesforspws(const casac::variant&) at File: src/tools/msmetadata/msmetadata_cmpt.cc, line: 1171
21-Oct-2026 13:23:20 2026-10-21 17:23:21        SEVERE        msmetadata_cmpt.cc::namesforspws        Exception Reported: Exception: All spectral window IDs must be nonnegative..
21-Oct-2026 13:23:20 2026-10-21 17:23:21        SEVERE        msmetadata_cmpt.cc::namesforspws+        ... thrown by std::vector<std::__cxx11::basic_string<char> > casac::msmetadata::namesforspws(const casac::variant&) at File: src/tools/msmetadata/msmetadata_cmpt.cc, line: 1181
21-Oct-2026 13:23:20 2026-10-21 17:23:21        SEVERE        msmetadata_cmpt.cc::namesforspws        Exception Reported: Exception: Spectral window ID must be less than total number of spws.
21-Oct-2026 13:23:20 2026-10-21 17:23:21        SEVERE        msmetadata_cmpt.cc::namesforspws+        ... thrown by std::vector<std::__cxx11::basic_string<char> > casac::msmetadata::namesforspws(const casac::variant&) at File: src/tools/msmetadata/msmetadata_cmpt.cc, line: 1172
21-Oct-2026 13:23:20 2026-10-21 17:23:21        SEVERE        msmetadata_cmpt.cc::namesforspws        Exception Reported: Exception: All spectral window IDs must be less than the total number of spws.
21-Oct-2026 13:23:20 2026-10-21 17:23:21        SEVERE        msmetadata_cmpt.cc::namesforspws+        ... thrown by std::vector<std::__cxx11::basic_string<char> > casac::msmetadata::namesforspws(const casac::variant&) at File: src/tools/msmetadata/msmetadata_cmpt.cc, line: 1185
21-Oct-2026 13:23:20 test_tool_msmetadata.py::msmetadata_test::test_namesforspws
21-Oct-2026 13:23:20 Test namesforspws()
21-Oct-2026 13:23:20 PASSED
21-Oct-2026 13:23:20
21-Oct-2026 13:23:20 2026-10-21 17:23:21        INFO        msmetadata_cmpt.cc::open        Performing internal consistency checks on /opt/casa/data/casatestdata/unittest/msmetadata/MSMetaData.ms...
21-Oct-2026 13:23:20 test_tool_msmetadata.py::msmetadata_test::test_nantennas
21-Oct-2026 13:23:20 Test nantennas()
21-Oct-2026 13:23:20 PASSED
21-Oct-2026 13:23:20
21-Oct-2026 13:23:20 2026-10-21 17:23:21        INFO        msmetadata_cmpt.cc::open        Performing internal consistency checks on /opt/casa/data/casatestdata/unittest/msmetadata/MSMetaData.ms...
21-Oct-2026 13:23:20 test_tool_msmetadata.py::msmetadata_test::test_narrays
21-Oct-2026 13:23:20 Test narrays()
21-Oct-2026 13:23:20 PASSED
21-Oct-2026 13:23:20
21-Oct-2026 13:23:20 2026-10-21 17:23:21        INFO        msmetadata_cmpt.cc::open        Performing internal consistency checks on /opt/casa/data/casatestdata/unittest/msmetadata/MSMetaData.ms...
21-Oct-2026 13:23:20 test_tool_msmetadata.py::msmetadata_test::test_nbaselines
21-Oct-2026 13:23:20 Verify nbaselines()
21-Oct-2026 13:23:20 PASSED
21-Oct-2026 13:23:20
21-Oct-2026 13:23:20 2026-10-21 17:23:21        INFO        msmetadata_cmpt.cc::open        Performing internal consistency checks on /opt/casa/data/casatestdata/unittest/msmetadata/MSMetaData.ms...
21-Oct-2026 13:23:20 test_tool_msmetadata.py::msmetadata_test::test_ncorrforpol
21-Oct-2026 13:23:20 Test msmetadata.ncorrforpol()
21-Oct-2026 13:23:20 PASSED
21-Oct-2026 13:23:20
21-Oct-2026 13:23:20 2026-10-21 17:23:21        INFO        msmetadata_cmpt.cc::open        Performing internal consistency checks on /opt/casa/data/casatestdata/unittest/msmetadata/MSMetaData.ms...
21-Oct-2026 13:23:20 test_tool_msmetadata.py::msmetadata_test::test_nfields
21-Oct-2026 13:23:20 Test nfields()
21-Oct-2026 13:23:20 PASSED
21-Oct-2026 13:23:20
21-Oct-2026 13:23:20 2026-10-21 17:23:21        INFO        msmetadata_cmpt.cc::open        Performing internal consistency checks on /opt/casa/data/casatestdata/unittest/msmetadata/MSMetaData.ms...
21-Oct-2026 13:23:20 test_tool_msmetadata.py::msmetadata_test::test_nobservations
21-Oct-2026 13:23:20 Test nobservations()
21-Oct-2026 13:23:20 PASSED
21-Oct-2026 13:23:20
21-Oct-2026 13:23:20 2026-10-21 17:23:21        INFO        msmetadata_cmpt.cc::open        Performing internal consistency checks on /opt/casa/data/casatestdata/unittest/msmetadata/MSMetaData.ms...
21-Oct-2026 13:23:20 2026-10-21 17:23:21        INFO        MSMetaData::_computeScanAndSubScanProperties         Computing scan and subscan properties...
21-Oct-2026 13:23:20 test_tool_msmetadata.py::msmetadata_test::test_nscans
21-Oct-2026 13:23:20 Test nscans()
21-Oct-2026 13:23:20 PASSED
21-Oct-2026 13:23:20
21-Oct-2026 13:23:20 2026-10-21 17:23:21        INFO        msmetadata_cmpt.cc::open        Performing internal consistency checks on /opt/casa/data/casatestdata/unittest/msmetadata/MSMetaData.ms...
21-Oct-2026 13:23:20 test_tool_msmetadata.py::msmetadata_test::test_nsources
21-Oct-2026 13:23:20 PASSED
21-Oct-2026 13:23:20
21-Oct-2026 13:23:20 2026-10-21 17:23:21        INFO        msmetadata_cmpt.cc::open        Performing internal consistency checks on /opt/casa/data/casatestdata/unittest/msmetadata/MSMetaData.ms...
21-Oct-2026 13:23:20 test_tool_msmetadata.py::msmetadata_test::test_nspw
21-Oct-2026 13:23:20 Test nspw()
21-Oct-2026 13:23:20 PASSED
21-Oct-2026 13:23:20
21-Oct-2026 13:23:20 2026-10-21 17:23:21        INFO        msmetadata_cmpt.cc::open        Performing internal consistency checks on /opt/casa/data/casatestdata/unittest/msmetadata/MSMetaData.ms...
21-Oct-2026 13:23:20 test_tool_msmetadata.py::msmetadata_test::test_nstates
21-Oct-2026 13:23:20 Test nstates()
21-Oct-2026 13:23:20 PASSED
21-Oct-2026 13:23:20
21-Oct-2026 13:23:20 2026-10-21 17:23:21        INFO        msmetadata_cmpt.cc::open        Performing internal consistency checks on /opt/casa/data/casatestdata/unittest/msmetadata/MSMetaData.ms...
21-Oct-2026 13:23:20 test_tool_msmetadata.py::msmetadata_test::test_nvis
21-Oct-2026 13:23:20 Test nvis()
21-Oct-2026 13:23:20 PASSED
21-Oct-2026 13:23:20
21-Oct-2026 13:23:20 2026-10-21 17:23:21        INFO        msmetadata_cmpt.cc::open        Performing internal consistency checks on /opt/casa/data/casatestdata/unittest/msmetadata/MSMetaData.ms...
21-Oct-2026 13:23:20 test_tool_msmetadata.py::msmetadata_test::test_observers
21-Oct-2026 13:23:20 Test msmetadata.observers()
21-Oct-2026 13:23:20 PASSED
21-Oct-2026 13:23:20
21-Oct-2026 13:23:20 2026-10-21 17:23:21        INFO        msmetadata_cmpt.cc::open        Performing internal consistency checks on /opt/casa/data/casatestdata/unittest/msmetadata/MSMetaData.ms...
21-Oct-2026 13:23:20 test_tool_msmetadata.py::msmetadata_test::test_pointingdirection
21-Oct-2026 13:23:20 Test pointingdirection(), CAS-5878
21-Oct-2026 13:23:20 PASSED
21-Oct-2026 13:23:20
21-Oct-2026 13:23:20 2026-10-21 17:23:21        INFO        msmetadata_cmpt.cc::open        Performing internal consistency checks on /opt/casa/data/casatestdata/unittest/msmetadata/MSMetaData.ms...
21-Oct-2026 13:23:20 test_tool_msmetadata.py::msmetadata_test::test_polidfordatadesc
21-Oct-2026 13:23:20 Test msmetadata.polidfordatadesc()
21-Oct-2026 13:23:20 PASSED
21-Oct-2026 13:23:20
21-Oct-2026 13:23:20 2026-10-21 17:23:21        INFO        msmetadata_cmpt.cc::open        Performing internal consistency checks on /opt/casa/data/casatestdata/unittest/msmetadata/MSMetaData.ms...
21-Oct-2026 13:23:20 test_tool_msmetadata.py::msmetadata_test::test_projects
21-Oct-2026 13:23:20 Test msmetadata.projects()
21-Oct-2026 13:23:20 PASSED
21-Oct-2026 13:23:20
21-Oct-2026 13:23:20 2026-10-21 17:23:21        INFO        msmetadata_cmpt.cc::open        Performing internal consistency checks on /opt/casa/data/casatestdata/unittest/msmetadata/MSMetaData.ms...
21-Oct-2026 13:23:21 test_tool_msmetadata.py::msmetadata_test::test_propermotions
21-Oct-2026 13:23:21 Test msmetadata.propermotions()
21-Oct-2026 13:23:21 PASSED
21-Oct-2026 13:23:21
21-Oct-2026 13:23:21 2026-10-21 17:23:21        INFO        msmetadata_cmpt.cc::open        Performing internal consistency checks on /opt/casa/data/casatestdata/unittest/msmetadata/MSMetaData.ms...
21-Oct-2026 13:23:21 test_tool_msmetadata.py::msmetadata_test::test_refdir
21-Oct-2026 13:23:21 Test msmetadata.refdir()
21-Oct-2026 13:23:21 PASSED
21-Oct-2026 13:23:21
21-Oct-2026 13:23:21 2026-10-21 17:23:21        INFO        msmetadata_cmpt.cc::open        Performing internal consistency checks on /opt/casa/data/casatestdata/unittest/msmetadata/MSMetaData.ms...
21-Oct-2026 13:23:21 test_tool_msmetadata.py::msmetadata_test::test_reffreq
21-Oct-2026 13:23:21 Test msmetadata.reffreq
21-Oct-2026 13:23:21 PASSED
21-Oct-2026 13:23:21
21-Oct-2026 13:23:21 2026-10-21 17:23:21        INFO        msmetadata_cmpt.cc::open        Performing internal consistency checks on /opt/casa/data/casatestdata/unittest/msmetadata/MSMetaData.ms...
21-Oct-2026 13:23:21 2026-10-21 17:23:21        SEVERE        msmetadata_cmpt.cc::restfreqs        Exception Reported: Exception: sourceid cannot be negative.
21-Oct-2026 13:23:21 2026-10-21 17:23:21        SEVERE        msmetadata_cmpt.cc::restfreqs+        ... thrown by casac::variant* casac::msmetadata::restfreqs(long int, long int) at File: src/tools/msmetadata/msmetadata_cmpt.cc, line: 1519
21-Oct-2026 13:23:21 2026-10-21 17:23:21        SEVERE        msmetadata_cmpt.cc::restfreqs        Exception Reported: Exception: Spectral window ID -1 out of range, must be nonnegative and less than or equal to 39.
21-Oct-2026 13:23:21 2026-10-21 17:23:21        SEVERE        msmetadata_cmpt.cc::restfreqs+        ... thrown by void casac::msmetadata::_checkSpwId(int, bool) const at File: src/tools/msmetadata/msmetadata_cmpt.cc, line: 2443
21-Oct-2026 13:23:21 2026-10-21 17:23:21        SEVERE        msmetadata_cmpt.cc::restfreqs        Exception Reported: Exception: SOURCE table does not contain a row with SOURCE_ID=50 and SPECTRAL_WINDOW_ID=0.
21-Oct-2026 13:23:21 2026-10-21 17:23:21        SEVERE        msmetadata_cmpt.cc::restfreqs+        ... thrown by casac::variant* casac::msmetadata::restfreqs(long int, long int) at File: src/tools/msmetadata/msmetadata_cmpt.cc, line: 1526
21-Oct-2026 13:23:21 2026-10-21 17:23:21        SEVERE        msmetadata_cmpt.cc::restfreqs        Exception Reported: Exception: Spectral window ID 50 out of range, must be nonnegative and less than or equal to 39.
21-Oct-2026 13:23:21 2026-10-21 17:23:21        SEVERE        msmetadata_cmpt.cc::restfreqs+        ... thrown by void casac::msmetadata::_checkSpwId(int, bool) const at File: src/tools/msmetadata/msmetadata_cmpt.cc, line: 2443
21-Oct-2026 13:23:21 test_tool_msmetadata.py::msmetadata_test::test_restfreqs
21-Oct-2026 13:23:21 Test restfreqs()
21-Oct-2026 13:23:21 PASSED
21-Oct-2026 13:23:21
21-Oct-2026 13:23:21 2026-10-21 17:23:21        INFO        msmetadata_cmpt.cc::open        Performing internal consistency checks on /opt/casa/data/casatestdata/unittest/msmetadata/MSMetaData.ms...
21-Oct-2026 13:23:21 2026-10-21 17:23:21        INFO        msmetadata_cmpt.cc::open        Performing internal consistency checks on /opt/casa/data/casatestdata/unittest/msmetadata/uid___A002_Xa1f062_X37e3.ms...
21-Oct-2026 13:23:21 2026-10-21 17:23:22        INFO        msmetadata_cmpt.cc::open        Performing internal consistency checks on /opt/casa/data/casatestdata/unittest/msmetadata/uid___A002_X7b13df_X68f.ms...
21-Oct-2026 13:23:21 test_tool_msmetadata.py::msmetadata_test::test_rxbands
21-Oct-2026 13:23:21 CAS-13973 test rxbands() method
21-Oct-2026 13:23:21 PASSED
21-Oct-2026 13:23:21
21-Oct-2026 13:23:21 2026-10-21 17:23:22        INFO        msmetadata_cmpt.cc::open        Performing internal consistency checks on /opt/casa/data/casatestdata/unittest/msmetadata/MSMetaData.ms...
21-Oct-2026 13:23:21 2026-10-21 17:23:22        INFO        MSMetaData::_computeScanAndSubScanProperties         Computing scan and subscan properties...
21-Oct-2026 13:23:21 test_tool_msmetadata.py::msmetadata_test::test_scannumbers
21-Oct-2026 13:23:21 Test scannumbers()
21-Oct-2026 13:23:21 PASSED
21-Oct-2026 13:23:21
21-Oct-2026 13:23:21 2026-10-21 17:23:22        INFO        msmetadata_cmpt.cc::open        Performing internal consistency checks on /opt/casa/data/casatestdata/unittest/msmetadata/MSMetaData.ms...
21-Oct-2026 13:23:21 2026-10-21 17:23:22        INFO        MSMetaData::_computeScanAndSubScanProperties         Computing scan and subscan properties...
21-Oct-2026 13:23:21 test_tool_msmetadata.py::msmetadata_test::test_scansforfield
21-Oct-2026 13:23:21 Test scansforfield() and scansforfields()
21-Oct-2026 13:23:21 PASSED
21-Oct-2026 13:23:21
21-Oct-2026 13:23:21 2026-10-21 17:23:22        INFO        msmetadata_cmpt.cc::open        Performing internal consistency checks on /opt/casa/data/casatestdata/unittest/msmetadata/MSMetaData.ms...
21-Oct-2026 13:23:21 2026-10-21 17:23:22        INFO        MSMetaData::_computeScanAndSubScanProperties         Computing scan and subscan properties...
21-Oct-2026 13:23:21 test_tool_msmetadata.py::msmetadata_test::test_scansforintent
21-Oct-2026 13:23:21 Test scansforintent()
21-Oct-2026 13:23:21 PASSED
21-Oct-2026 13:23:21
21-Oct-2026 13:23:21 2026-10-21 17:23:22        INFO        msmetadata_cmpt.cc::open        Performing internal consistency checks on /opt/casa/data/casatestdata/unittest/msmetadata/MSMetaData.ms...
21-Oct-2026 13:23:21 2026-10-21 17:23:22        INFO        MSMetaData::_computeScanAndSubScanProperties         Computing scan and subscan properties...
21-Oct-2026 13:23:21 test_tool_msmetadata.py::msmetadata_test::test_scansforspw
21-Oct-2026 13:23:21 Test scansforspw() and scansforspws()
21-Oct-2026 13:23:21 PASSED
21-Oct-2026 13:23:21
21-Oct-2026 13:23:21 2026-10-21 17:23:22        INFO        msmetadata_cmpt.cc::open        Performing internal consistency checks on /opt/casa/data/casatestdata/unittest/msmetadata/MSMetaData.ms...
21-Oct-2026 13:23:21 2026-10-21 17:23:22        INFO        MSMetaData::_computeScanAndSubScanProperties         Computing scan and subscan properties...
21-Oct-2026 13:23:21 test_tool_msmetadata.py::msmetadata_test::test_scansforstate
21-Oct-2026 13:23:21 Test scansforstate()
21-Oct-2026 13:23:22 PASSED
21-Oct-2026 13:23:22
21-Oct-2026 13:23:22 2026-10-21 17:23:22        INFO        msmetadata_cmpt.cc::open        Performing internal consistency checks on /opt/casa/data/casatestdata/unittest/msmetadata/MSMetaData.ms...
21-Oct-2026 13:23:22 2026-10-21 17:23:22        INFO        MSMetaData::_computeScanAndSubScanProperties         Computing scan and subscan properties...
21-Oct-2026 13:23:22 test_tool_msmetadata.py::msmetadata_test::test_scansfortimes
21-Oct-2026 13:23:22 Test scansfortimes()
21-Oct-2026 13:23:22 PASSED
21-Oct-2026 13:23:22
21-Oct-2026 13:23:22 2026-10-21 17:23:22        INFO        msmetadata_cmpt.cc::open        Performing internal consistency checks on /opt/casa/data/casatestdata/unittest/msmetadata/MSMetaData.ms...
21-Oct-2026 13:23:22 test_tool_msmetadata.py::msmetadata_test::test_schedule
21-Oct-2026 13:23:22 Test msmetadata.schedule()
21-Oct-2026 13:23:22 PASSED
21-Oct-2026 13:23:22
21-Oct-2026 13:23:22 2026-10-21 17:23:22        INFO        msmetadata_cmpt.cc::open        Performing internal consistency checks on /opt/casa/data/casatestdata/unittest/msmetadata/MSMetaData.ms...
21-Oct-2026 13:23:22 test_tool_msmetadata.py::msmetadata_test::test_sideband
21-Oct-2026 13:23:22 PASSED
21-Oct-2026 13:23:22
21-Oct-2026 13:23:22 2026-10-21 17:23:22        INFO        msmetadata_cmpt.cc::open        Performing internal consistency checks on /opt/casa/data/casatestdata/unittest/msmetadata/MSMetaData.ms...
21-Oct-2026 13:23:22 test_tool_msmetadata.py::msmetadata_test::test_sourcedirs
21-Oct-2026 13:23:22 Test msmetadata.sourcedirs()
21-Oct-2026 13:23:22 PASSED
21-Oct-2026 13:23:22
21-Oct-2026 13:23:22 2026-10-21 17:23:22        INFO        msmetadata_cmpt.cc::open        Performing internal consistency checks on /opt/casa/data/casatestdata/unittest/msmetadata/MSMetaData.ms...
21-Oct-2026 13:23:22 2026-10-21 17:23:22        SEVERE        msmetadata_cmpt.cc::sourceidforfield        Exception Reported: Exception: Antenna ID -1 out of range, must be less than 6.
21-Oct-2026 13:23:22 2026-10-21 17:23:22        SEVERE        msmetadata_cmpt.cc::sourceidforfield+        ... thrown by void casac::msmetadata::_checkFieldId(int, bool) const at File: src/tools/msmetadata/msmetadata_cmpt.cc, line: 2425
21-Oct-2026 13:23:22 2026-10-21 17:23:22        SEVERE        msmetadata_cmpt.cc::sourceidforfield        Exception Reported: Exception: Antenna ID 6 out of range, must be less than 6.
21-Oct-2026 13:23:22 2026-10-21 17:23:22        SEVERE        msmetadata_cmpt.cc::sourceidforfield+        ... thrown by void casac::msmetadata::_checkFieldId(int, bool) const at File: src/tools/msmetadata/msmetadata_cmpt.cc, line: 2425
21-Oct-2026 13:23:22 test_tool_msmetadata.py::msmetadata_test::test_sourceidforfield
21-Oct-2026 13:23:22 Test msmetadata.sourceidforfield()
21-Oct-2026 13:23:22 PASSED
21-Oct-2026 13:23:22
21-Oct-2026 13:23:22 2026-10-21 17:23:22        INFO        msmetadata_cmpt.cc::open        Performing internal consistency checks on /opt/casa/data/casatestdata/unittest/msmetadata/MSMetaData.ms...
21-Oct-2026 13:23:22 test_tool_msmetadata.py::msmetadata_test::test_sourceidsfromsourcetable
21-Oct-2026 13:23:22 Test msmetadata.sourceidsfromsourcetable()
21-Oct-2026 13:23:22 PASSED
21-Oct-2026 13:23:22
21-Oct-2026 13:23:22 2026-10-21 17:23:22        INFO        msmetadata_cmpt.cc::open        Performing internal consistency checks on /opt/casa/data/casatestdata/unittest/msmetadata/MSMetaData.ms...
21-Oct-2026 13:23:22 test_tool_msmetadata.py::msmetadata_test::test_sourcenames
21-Oct-2026 13:23:22 Test msmetadata.sourcenames()
21-Oct-2026 13:23:22 PASSED
21-Oct-2026 13:23:22
21-Oct-2026 13:23:22 2026-10-21 17:23:22        INFO        msmetadata_cmpt.cc::open        Performing internal consistency checks on /opt/casa/data/casatestdata/unittest/msmetadata/MSMetaData.ms...
21-Oct-2026 13:23:22 test_tool_msmetadata.py::msmetadata_test::test_spwfordatadesc
21-Oct-2026 13:23:22 Test msmetadata.spwfordatadesc()
21-Oct-2026 13:23:22 PASSED
21-Oct-2026 13:23:22
21-Oct-2026 13:23:22 2026-10-21 17:23:22        INFO        msmetadata_cmpt.cc::open        Performing internal consistency checks on /opt/casa/data/casatestdata/unittest/msmetadata/MSMetaData.ms...
21-Oct-2026 13:23:22 test_tool_msmetadata.py::msmetadata_test::test_spwsforbasebands
21-Oct-2026 13:23:22 Test spwsforbasebands()
21-Oct-2026 13:23:22 PASSED
21-Oct-2026 13:23:22
21-Oct-2026 13:23:22 2026-10-21 17:23:22        INFO        msmetadata_cmpt.cc::open        Performing internal consistency checks on /opt/casa/data/casatestdata/unittest/msmetadata/MSMetaData.ms...
21-Oct-2026 13:23:22 2026-10-21 17:23:22        INFO        MSMetaData::_computeScanAndSubScanProperties         Computing scan and subscan properties...
21-Oct-2026 13:23:22 test_tool_msmetadata.py::msmetadata_test::test_spwsforfield
21-Oct-2026 13:23:22 Test spwsforfield() and spwsforfields()
21-Oct-2026 13:23:22 PASSED
21-Oct-2026 13:23:22
21-Oct-2026 13:23:22 2026-10-21 17:23:22        INFO        msmetadata_cmpt.cc::open        Performing internal consistency checks on /opt/casa/data/casatestdata/unittest/msmetadata/MSMetaData.ms...
21-Oct-2026 13:23:22 test_tool_msmetadata.py::msmetadata_test::test_spwsforintent
21-Oct-2026 13:23:22 Test spwsforintent()
21-Oct-2026 13:23:22 PASSED
21-Oct-2026 13:23:22
21-Oct-2026 13:23:22 2026-10-21 17:23:22        INFO        msmetadata_cmpt.cc::open        Performing internal consistency checks on /opt/casa/data/casatestdata/unittest/msmetadata/MSMetaData.ms...
21-Oct-2026 13:23:22 2026-10-21 17:23:22        WARN        msmetadata_cmpt.cc::spwsfornames        Specified spw named blah is not present in MS
21-Oct-2026 13:23:22 test_tool_msmetadata.py::msmetadata_test::test_spwsfornames
21-Oct-2026 13:23:22 Test spwsfornames()
21-Oct-2026 13:23:22 PASSED
21-Oct-2026 13:23:22
21-Oct-2026 13:23:22 2026-10-21 17:23:22        INFO        msmetadata_cmpt.cc::open        Performing internal consistency checks on /opt/casa/data/casatestdata/unittest/msmetadata/MSMetaData.ms...
21-Oct-2026 13:23:22 2026-10-21 17:23:22        INFO        MSMetaData::_computeScanAndSubScanProperties         Computing scan and subscan properties...
21-Oct-2026 13:23:22 test_tool_msmetadata.py::msmetadata_test::test_spwsforscan
21-Oct-2026 13:23:22 Test spwsforscan() and spwsforscans()
21-Oct-2026 13:23:22 PASSED
21-Oct-2026 13:23:22
21-Oct-2026 13:23:22 2026-10-21 17:23:22        INFO        msmetadata_cmpt.cc::open        Performing internal consistency checks on /opt/casa/data/casatestdata/unittest/msmetadata/MSMetaData.ms...
21-Oct-2026 13:23:22 2026-10-21 17:23:22        INFO        MSMetaData::_computeScanAndSubScanProperties         Computing scan and subscan properties...
21-Oct-2026 13:23:22 test_tool_msmetadata.py::msmetadata_test::test_statesforscan
21-Oct-2026 13:23:22 Test statesforscan() and statesforscans()
21-Oct-2026 13:23:22 PASSED
21-Oct-2026 13:23:22
21-Oct-2026 13:23:22 2026-10-21 17:23:22        INFO        msmetadata_cmpt.cc::open        Performing internal consistency checks on /opt/casa/data/casatestdata/unittest/msmetadata/MSMetaData.ms...
21-Oct-2026 13:23:22 2026-10-21 17:23:22        INFO        msmetadata_cmpt.cc::open        Performing internal consistency checks on /opt/casa/data/casatestdata/unittest/msmetadata/uid___A002_Xa1f062_X37e3.ms...
21-Oct-2026 13:23:22 test_tool_msmetadata.py::msmetadata_test::test_subwindows
21-Oct-2026 13:23:22 CAS-13973 test subwindows() method
21-Oct-2026 13:23:22 PASSED
21-Oct-2026 13:23:22
21-Oct-2026 13:23:22 2026-10-21 17:23:23        INFO        msmetadata_cmpt.cc::open        Performing internal consistency checks on /opt/casa/data/casatestdata/unittest/msmetadata/MSMetaData.ms...
21-Oct-2026 13:23:22 2026-10-21 17:23:23        INFO        msmetadata_cmpt.cc::open        Performing internal consistency checks on /opt/casa/data/casatestdata/unittest/msmetadata/uid___A002_Xd7be9d_X4838-spw16-18-20-22.ms...
21-Oct-2026 13:23:22 test_tool_msmetadata.py::msmetadata_test::test_tdm_fdm
21-Oct-2026 13:23:22 Verify change to algorithm used for FDM and TDM windows CAS-13362
21-Oct-2026 13:23:22 PASSED
21-Oct-2026 13:23:22
21-Oct-2026 13:23:22 2026-10-21 17:23:23        INFO        msmetadata_cmpt.cc::open        Performing internal consistency checks on /opt/casa/data/casatestdata/unittest/msmetadata/MSMetaData.ms...
21-Oct-2026 13:23:22 test_tool_msmetadata.py::msmetadata_test::test_tdmspws
21-Oct-2026 13:23:22 Test tdmspws()
21-Oct-2026 13:23:22 PASSED
21-Oct-2026 13:23:22
21-Oct-2026 13:23:22 2026-10-21 17:23:23        INFO        msmetadata_cmpt.cc::open        Performing internal consistency checks on /opt/casa/data/casatestdata/unittest/msmetadata/MSMetaData.ms...
21-Oct-2026 13:23:22 test_tool_msmetadata.py::msmetadata_test::test_telescopenames
21-Oct-2026 13:23:22 Test observatorynames()
21-Oct-2026 13:23:22 PASSED
21-Oct-2026 13:23:22
21-Oct-2026 13:23:22 2026-10-21 17:23:23        INFO        msmetadata_cmpt.cc::open        Performing internal consistency checks on /opt/casa/data/casatestdata/unittest/msmetadata/MSMetaData.ms...
21-Oct-2026 13:23:22 test_tool_msmetadata.py::msmetadata_test::test_timerforobs
21-Oct-2026 13:23:22 Test msmetadata.timerforobs()
21-Oct-2026 13:23:22 PASSED
21-Oct-2026 13:23:22
21-Oct-2026 13:23:22 2026-10-21 17:23:23        INFO        msmetadata_cmpt.cc::open        Performing internal consistency checks on /opt/casa/data/casatestdata/unittest/msmetadata/MSMetaData.ms...
21-Oct-2026 13:23:22 test_tool_msmetadata.py::msmetadata_test::test_timesforfield
21-Oct-2026 13:23:22 Test timesforfield()
21-Oct-2026 13:23:22 PASSED
21-Oct-2026 13:23:22
21-Oct-2026 13:23:22 2026-10-21 17:23:23        INFO        msmetadata_cmpt.cc::open        Performing internal consistency checks on /opt/casa/data/casatestdata/unittest/msmetadata/MSMetaData.ms...
21-Oct-2026 13:23:22 test_tool_msmetadata.py::msmetadata_test::test_timesforintent
21-Oct-2026 13:23:22 Test timesforintent(), CAS-6919
21-Oct-2026 13:23:22 PASSED
21-Oct-2026 13:23:22
21-Oct-2026 13:23:22 2026-10-21 17:23:23        INFO        msmetadata_cmpt.cc::open        Performing internal consistency checks on /opt/casa/data/casatestdata/unittest/msmetadata/MSMetaData.ms...
21-Oct-2026 13:23:22 2026-10-21 17:23:23        INFO        MSMetaData::_computeScanAndSubScanProperties         Computing scan and subscan properties...
21-Oct-2026 13:23:22 test_tool_msmetadata.py::msmetadata_test::test_timesforscan
21-Oct-2026 13:23:22 Test timesforscan()
21-Oct-2026 13:23:22 PASSED
21-Oct-2026 13:23:22
21-Oct-2026 13:23:22 2026-10-21 17:23:23        INFO        msmetadata_cmpt.cc::open        Performing internal consistency checks on /opt/casa/data/casatestdata/unittest/msmetadata/MSMetaData.ms...
21-Oct-2026 13:23:22 2026-10-21 17:23:23        INFO        MSMetaData::_computeScanAndSubScanProperties         Computing scan and subscan properties...
21-Oct-2026 13:23:22 test_tool_msmetadata.py::msmetadata_test::test_timesforscans
21-Oct-2026 13:23:22 Test timesforscans()
21-Oct-2026 13:23:22 PASSED
21-Oct-2026 13:23:22
21-Oct-2026 13:23:23 2026-10-21 17:23:23        INFO        msmetadata_cmpt.cc::open        Performing internal consistency checks on /opt/casa/data/casatestdata/unittest/msmetadata/MSMetaData.ms...
21-Oct-2026 13:23:23 2026-10-21 17:23:23        INFO        MSMetaData::_computeScanAndSubScanProperties         Computing scan and subscan properties...
21-Oct-2026 13:23:23 test_tool_msmetadata.py::msmetadata_test::test_timesforspws
21-Oct-2026 13:23:23 Verify timesforspws()
21-Oct-2026 13:23:23 PASSED
21-Oct-2026 13:23:23
21-Oct-2026 13:23:23 2026-10-21 17:23:23        INFO        msmetadata_cmpt.cc::open        Performing internal consistency checks on /opt/casa/data/casatestdata/unittest/msmetadata/MSMetaData.ms...
21-Oct-2026 13:23:23 2026-10-21 17:23:23        SEVERE        msmetadata_cmpt.cc::transitions        Exception Reported: Exception: sourceid cannot be negative.
21-Oct-2026 13:23:23 2026-10-21 17:23:23        SEVERE        msmetadata_cmpt.cc::transitions+        ... thrown by casac::variant* casac::msmetadata::transitions(long int, long int) at File: src/tools/msmetadata/msmetadata_cmpt.cc, line: 2270
21-Oct-2026 13:23:23 2026-10-21 17:23:23        SEVERE        msmetadata_cmpt.cc::transitions        Exception Reported: Exception: Spectral window ID -1 out of range, must be nonnegative and less than or equal to 39.
21-Oct-2026 13:23:23 2026-10-21 17:23:23        SEVERE        msmetadata_cmpt.cc::transitions+        ... thrown by void casac::msmetadata::_checkSpwId(int, bool) const at File: src/tools/msmetadata/msmetadata_cmpt.cc, line: 2443
21-Oct-2026 13:23:23 2026-10-21 17:23:23        SEVERE        msmetadata_cmpt.cc::transitions        Exception Reported: Exception: SOURCE table does not contain a row with SOURCE_ID=50 and SPECTRAL_WINDOW_ID=0.
21-Oct-2026 13:23:23 2026-10-21 17:23:23        SEVERE        msmetadata_cmpt.cc::transitions+        ... thrown by casac::variant* casac::msmetadata::transitions(long int, long int) at File: src/tools/msmetadata/msmetadata_cmpt.cc, line: 2277
21-Oct-2026 13:23:23 2026-10-21 17:23:23        SEVERE        msmetadata_cmpt.cc::transitions        Exception Reported: Exception: Spectral window ID 50 out of range, must be nonnegative and less than or equal to 39.
21-Oct-2026 13:23:23 2026-10-21 17:23:23        SEVERE        msmetadata_cmpt.cc::transitions+        ... thrown by void casac::msmetadata::_checkSpwId(int, bool) const at File: src/tools/msmetadata/msmetadata_cmpt.cc, line: 2443
21-Oct-2026 13:23:23 test_tool_msmetadata.py::msmetadata_test::test_transitions
21-Oct-2026 13:23:23 Test transitions()
21-Oct-2026 13:23:23 PASSED
21-Oct-2026 13:23:23
21-Oct-2026 13:23:23 2026-10-21 17:23:23        INFO        msmetadata_cmpt.cc::open        Performing internal consistency checks on /opt/casa/data/casatestdata/unittest/msmetadata/MSMetaData.ms...
21-Oct-2026 13:23:23 test_tool_msmetadata.py::msmetadata_test::test_wvrspws
21-Oct-2026 13:23:23 Test wvrspws()
21-Oct-2026 13:23:23 PASSED
21-Oct-2026 13:23:23
21-Oct-2026 13:23:23 - generated xml file: /home/casatest/casa6/casatestutils/nosedir/xml/test_tool_msmetadata/nose.xml -
21-Oct-2026 13:23:23 ======================== 85 passed, 1 warning in 6.57s =========================
21-Oct-2026 13:23:23
21-Oct-2026 13:23:23
21-Oct-2026 13:23:23 Setting Working Directory: /home/casatest/casa6/casatestutils/nosedir/test_tool_image_rebin/
21-Oct-2026 13:23:23 Test Directory: /home/casatest/casa6/casatestutils/nosedir/test_tool_image_rebin
21-Oct-2026 13:23:23
21-Oct-2026 13:23:23 Running Command: pytest --junitxml=/home/casatest/casa6/casatestutils/nosedir/xml/test_tool_image_rebin/nose.xml -s --disable-pytest-warnings --verbose -ra --tb=short /home/casatest/casa6/casatestutils/nosedir/test_tool_image_rebin/
21-Oct-2026 13:23:23
21-Oct-2026 13:23:23 Setting Working Directory: /home/casatest/casa6/casatestutils/nosedir/test_tool_vpmanager/
21-Oct-2026 13:23:23 Test Directory: /home/casatest/casa6/casatestutils/nosedir/test_tool_vpmanager
21-Oct-2026 13:23:23
21-Oct-2026 13:23:23 Running Command: pytest --junitxml=/home/casatest/casa6/casatestutils/nosedir/xml/test_tool_vpmanager/nose.xml -s --disable-pytest-warnings --verbose -ra --tb=short /home/casatest/casa6/casatestutils/nosedir/test_tool_vpmanager/
21-Oct-2026 13:23:23
21-Oct-2026 13:23:23 Setting Working Directory: /home/casatest/casa6/casatestutils/nosedir/test_tool_linearmosaic/
21-Oct-2026 13:23:23 Test Directory: /home/casatest/casa6/casatestutils/nosedir/test_tool_linearmosaic
21-Oct-2026 13:23:23
21-Oct-2026 13:23:23 Running Command: pytest --junitxml=/home/casatest/casa6/casatestutils/nosedir/xml/test_tool_linearmosaic/nose.xml -s --disable-pytest-warnings --verbose -ra --tb=short /home/casatest/casa6/casatestutils/nosedir/test_tool_linearmosaic/
21-Oct-2026 13:23:23
21-Oct-2026 13:23:23 Setting Working Directory: /home/casatest/casa6/casatestutils/nosedir/test_tool_image_subimage/
21-Oct-2026 13:23:23 Test Directory: /home/casatest/casa6/casatestutils/nosedir/test_tool_image_subimage
21-Oct-2026 13:23:23
21-Oct-2026 13:23:23 Running Command: pytest --junitxml=/home/casatest/casa6/casatestutils/nosedir/xml/test_tool_image_subimage/nose.xml -s --disable-pytest-warnings --verbose -ra --tb=short /home/casatest/casa6/casatestutils/nosedir/test_tool_image_subimage/
21-Oct-2026 13:23:23
21-Oct-2026 13:23:23 Setting Working Directory: /home/casatest/casa6/casatestutils/nosedir/test_tool_sdm_toms/
21-Oct-2026 13:23:23 Test Directory: /home/casatest/casa6/casatestutils/nosedir/test_tool_sdm_toms
21-Oct-2026 13:23:23
21-Oct-2026 13:23:23 Running Command: pytest --junitxml=/home/casatest/casa6/casatestutils/nosedir/xml/test_tool_sdm_toms/nose.xml -s --disable-pytest-warnings --verbose -ra --tb=short /home/casatest/casa6/casatestutils/nosedir/test_tool_sdm_toms/
21-Oct-2026 13:23:23
21-Oct-2026 13:23:23 Setting Working Directory: /home/casatest/casa6/casatestutils/nosedir/test_tool_sdm/
21-Oct-2026 13:23:23 Test Directory: /home/casatest/casa6/casatestutils/nosedir/test_tool_sdm
21-Oct-2026 13:23:23
21-Oct-2026 13:23:23 Running Command: pytest --junitxml=/home/casatest/casa6/casatestutils/nosedir/xml/test_tool_sdm/nose.xml -s --disable-pytest-warnings --verbose -ra --tb=short /home/casatest/casa6/casatestutils/nosedir/test_tool_sdm/
21-Oct-2026 13:23:23
21-Oct-2026 13:23:23 Setting Working Directory: /home/casatest/casa6/casatestutils/nosedir/test_tool_table/
21-Oct-2026 13:23:23 Test Directory: /home/casatest/casa6/casatestutils/nosedir/test_tool_table
21-Oct-2026 13:23:23
21-Oct-2026 13:23:23 Running Command: pytest --junitxml=/home/casatest/casa6/casatestutils/nosedir/xml/test_tool_table/nose.xml -s --disable-pytest-warnings --verbose -ra --tb=short /home/casatest/casa6/casatestutils/nosedir/test_tool_table/
21-Oct-2026 13:23:23
21-Oct-2026 13:23:23 Setting Working Directory: /home/casatest/casa6/casatestutils/nosedir/test_tool_image_pv/
21-Oct-2026 13:23:23 Test Directory: /home/casatest/casa6/casatestutils/nosedir/test_tool_image_pv
21-Oct-2026 13:23:23
21-Oct-2026 13:23:23 Running Command: pytest --junitxml=/home/casatest/casa6/casatestutils/nosedir/xml/test_tool_image_pv/nose.xml -s --disable-pytest-warnings --verbose -ra --tb=short /home/casatest/casa6/casatestutils/nosedir/test_tool_image_pv/
21-Oct-2026 13:23:23
21-Oct-2026 13:23:23 Setting Working Directory: /home/casatest/casa6/casatestutils/nosedir/test_tool_image_fitprofile/
21-Oct-2026 13:23:23 Test Directory: /home/casatest/casa6/casatestutils/nosedir/test_tool_image_fitprofile
21-Oct-2026 13:23:23
21-Oct-2026 13:23:23 Running Command: pytest --junitxml=/home/casatest/casa6/casatestutils/nosedir/xml/test_tool_image_fitprofile/nose.xml -s --disable-pytest-warnings --verbose -ra --tb=short /home/casatest/casa6/casatestutils/nosedir/test_tool_image_fitprofile/
21-Oct-2026 13:23:23
21-Oct-2026 13:23:23 Setting Working Directory: /home/casatest/casa6/casatestutils/nosedir/test_tool_image/
21-Oct-2026 13:23:23 Test Directory: /home/casatest/casa6/casatestutils/nosedir/test_tool_image
21-Oct-2026 13:23:23
21-Oct-2026 13:23:23 Running Command: pytest --junitxml=/home/casatest/casa6/casatestutils/nosedir/xml/test_tool_image/nose.xml -s --disable-pytest-warnings --verbose -ra --tb=short /home/casatest/casa6/casatestutils/nosedir/test_tool_image/
21-Oct-2026 13:23:23
21-Oct-2026 13:23:23 Setting Working Directory: /home/casatest/casa6/casatestutils/nosedir/test_tool_componentlist/
21-Oct-2026 13:23:23 Test Directory: /home/casatest/casa6/casatestutils/nosedir/test_tool_componentlist
21-Oct-2026 13:23:23
21-Oct-2026 13:23:23 Running Command: pytest --junitxml=/home/casatest/casa6/casatestutils/nosedir/xml/test_tool_componentlist/nose.xml -s --disable-pytest-warnings --verbose -ra --tb=short /home/casatest/casa6/casatestutils/nosedir/test_tool_componentlist/
21-Oct-2026 13:23:23
21-Oct-2026 13:23:23 Setting Working Directory: /home/casatest/casa6/casatestutils/nosedir/test_tool_calibrater/
21-Oct-2026 13:23:23 Test Directory: /home/casatest/casa6/casatestutils/nosedir/test_tool_calibrater
21-Oct-2026 13:23:23
21-Oct-2026 13:23:23 Running Command: pytest --junitxml=/home/casatest/casa6/casatestutils/nosedir/xml/test_tool_calibrater/nose.xml -s --disable-pytest-warnings --verbose -ra --tb=short /home/casatest/casa6/casatestutils/nosedir/test_tool_calibrater/
21-Oct-2026 13:23:23
21-Oct-2026 13:23:23 Setting Working Directory: /home/casatest/casa6/casatestutils/nosedir/test_tool_agentflagger/
21-Oct-2026 13:23:23 Test Directory: /home/casatest/casa6/casatestutils/nosedir/test_tool_agentflagger
21-Oct-2026 13:23:23
21-Oct-2026 13:23:23 Running Command: pytest --junitxml=/home/casatest/casa6/casatestutils/nosedir/xml/test_tool_agentflagger/nose.xml -s --disable-pytest-warnings --verbose -ra --tb=short /home/casatest/casa6/casatestutils/nosedir/test_tool_agentflagger/
21-Oct-2026 13:23:23
21-Oct-2026 13:23:23 Setting Working Directory: /home/casatest/casa6/casatestutils/nosedir/test_tool_image_transpose/
21-Oct-2026 13:23:23 Test Directory: /home/casatest/casa6/casatestutils/nosedir/test_tool_image_transpose
21-Oct-2026 13:23:23
21-Oct-2026 13:23:23 Running Command: pytest --junitxml=/home/casatest/casa6/casatestutils/nosedir/xml/test_tool_image_transpose/nose.xml -s --disable-pytest-warnings --verbose -ra --tb=short /home/casatest/casa6/casatestutils/nosedir/test_tool_image_transpose/
21-Oct-2026 13:23:23
21-Oct-2026 13:23:23 Setting Working Directory: /home/casatest/casa6/casatestutils/nosedir/test_tool_image_collapse/
21-Oct-2026 13:23:23 Test Directory: /home/casatest/casa6/casatestutils/nosedir/test_tool_image_collapse
21-Oct-2026 13:23:23
21-Oct-2026 13:23:23 Running Command: pytest --junitxml=/home/casatest/casa6/casatestutils/nosedir/xml/test_tool_image_collapse/nose.xml -s --disable-pytest-warnings --verbose -ra --tb=short /home/casatest/casa6/casatestutils/nosedir/test_tool_image_collapse/
21-Oct-2026 13:23:23
21-Oct-2026 13:23:23 Setting Working Directory: /home/casatest/casa6/casatestutils/nosedir/test_tool_msuvbinner/
21-Oct-2026 13:23:23 Test Directory: /home/casatest/casa6/casatestutils/nosedir/test_tool_msuvbinner
21-Oct-2026 13:23:23
21-Oct-2026 13:23:23 Running Command: pytest --junitxml=/home/casatest/casa6/casatestutils/nosedir/xml/test_tool_msuvbinner/nose.xml -s --disable-pytest-warnings --verbose -ra --tb=short /home/casatest/casa6/casatestutils/nosedir/test_tool_msuvbinner/
21-Oct-2026 13:23:23
21-Oct-2026 13:23:23 Setting Working Directory: /home/casatest/casa6/casatestutils/nosedir/test_tool_quanta/
21-Oct-2026 13:23:23 Test Directory: /home/casatest/casa6/casatestutils/nosedir/test_tool_quanta
21-Oct-2026 13:23:23
21-Oct-2026 13:23:23 Running Command: pytest --junitxml=/home/casatest/casa6/casatestutils/nosedir/xml/test_tool_quanta/nose.xml -s --disable-pytest-warnings --verbose -ra --tb=short /home/casatest/casa6/casatestutils/nosedir/test_tool_quanta/
21-Oct-2026 13:23:23
21-Oct-2026 13:23:23 Setting Working Directory: /home/casatest/casa6/casatestutils/nosedir/test_tool_msmetadata/
21-Oct-2026 13:23:23 Test Directory: /home/casatest/casa6/casatestutils/nosedir/test_tool_msmetadata
21-Oct-2026 13:23:23
21-Oct-2026 13:23:23 Running Command: pytest --junitxml=/home/casatest/casa6/casatestutils/nosedir/xml/test_tool_msmetadata/nose.xml -s --disable-pytest-warnings --verbose -ra --tb=short /home/casatest/casa6/casatestutils/nosedir/test_tool_msmetadata/
21-Oct-2026 13:23:25 total 77824
21-Oct-2026 13:23:25 -rw-r--r-- 1 casaci 15001   161182 Oct 21 17:04 casatestutils-6.8.0.0a100.dev0+dirty-py3-none-any.whl
21-Oct-2026 13:23:25 -rw-r--r-- 1 casaci 15001 79358335 Oct 21 17:04 casatools-6.8.0.0a100.dev0+dirty-cp312-cp312-manylinux_2_28_x86_64.whl
21-Oct-2026 13:23:25 -rw-r--r-- 1 casaci root      4340 Oct 21 17:23 test_tool_agentflagger.xml
21-Oct-2026 13:23:25 -rw-r--r-- 1 casaci root      1006 Oct 21 17:23 test_tool_calanalysis.xml
21-Oct-2026 13:23:25 -rw-r--r-- 1 casaci root      2657 Oct 21 17:23 test_tool_calibrater.xml
21-Oct-2026 13:23:25 -rw-r--r-- 1 casaci root       687 Oct 21 17:23 test_tool_componentlist.xml
21-Oct-2026 13:23:25 -rw-r--r-- 1 casaci root      7467 Oct 21 17:23 test_tool_coordsys.xml
21-Oct-2026 13:23:25 -rw-r--r-- 1 casaci root     12935 Oct 21 17:23 test_tool_image.xml
21-Oct-2026 13:23:25 -rw-r--r-- 1 casaci root      2220 Oct 21 17:23 test_tool_image_collapse.xml
21-Oct-2026 13:23:25 -rw-r--r-- 1 casaci root      1048 Oct 21 17:23 test_tool_image_deviation.xml
21-Oct-2026 13:23:25 -rw-r--r-- 1 casaci root      2575 Oct 21 17:23 test_tool_image_fitprofile.xml
21-Oct-2026 13:23:25 -rw-r--r-- 1 casaci root      1178 Oct 21 17:23 test_tool_image_pbcor.xml
21-Oct-2026 13:23:25 -rw-r--r-- 1 casaci root       883 Oct 21 17:23 test_tool_image_pv.xml
21-Oct-2026 13:23:25 -rw-r--r-- 1 casaci root      1006 Oct 21 17:23 test_tool_image_rebin.xml
21-Oct-2026 13:23:25 -rw-r--r-- 1 casaci root      1336 Oct 21 17:23 test_tool_image_regrid.xml
21-Oct-2026 13:23:25 -rw-r--r-- 1 casaci root      3307 Oct 21 17:23 test_tool_image_statistics.xml
21-Oct-2026 13:23:25 -rw-r--r-- 1 casaci root       765 Oct 21 17:23 test_tool_image_subimage.xml
21-Oct-2026 13:23:25 -rw-r--r-- 1 casaci root       890 Oct 21 17:23 test_tool_image_transpose.xml
21-Oct-2026 13:23:25 -rw-r--r-- 1 casaci root      1966 Oct 21 17:23 test_tool_imagepol.xml
21-Oct-2026 13:23:25 -rw-r--r-- 1 casaci root       839 Oct 21 17:23 test_tool_linearmosaic.xml
21-Oct-2026 13:23:25 -rw-r--r-- 1 casaci root       669 Oct 21 17:23 test_tool_logsink.xml
21-Oct-2026 13:23:25 -rw-r--r-- 1 casaci root       549 Oct 21 17:23 test_tool_measures.xml
21-Oct-2026 13:23:25 -rw-r--r-- 1 casaci root      5224 Oct 21 17:23 test_tool_ms.xml
21-Oct-2026 13:23:25 -rw-r--r-- 1 casaci root       367 Oct 21 17:23 test_tool_ms_createmultims.xml
21-Oct-2026 13:23:25 -rw-r--r-- 1 casaci root      2095 Oct 21 17:23 test_tool_ms_statwt.xml
21-Oct-2026 13:23:25 -rw-r--r-- 1 casaci root      8633 Oct 21 17:23 test_tool_msmetadata.xml
21-Oct-2026 13:23:25 -rw-r--r-- 1 casaci root       359 Oct 21 17:23 test_tool_msuvbinner.xml
21-Oct-2026 13:23:25 -rw-r--r-- 1 casaci root      1171 Oct 21 17:23 test_tool_quanta.xml
21-Oct-2026 13:23:25 -rw-r--r-- 1 casaci root      3977 Oct 21 17:23 test_tool_regionmanager.xml
21-Oct-2026 13:23:25 -rw-r--r-- 1 casaci root      2072 Oct 21 17:23 test_tool_sdm.xml
21-Oct-2026 13:23:25 -rw-r--r-- 1 casaci root      2194 Oct 21 17:23 test_tool_sdm_toms.xml
21-Oct-2026 13:23:25 -rw-r--r-- 1 casaci root       670 Oct 21 17:23 test_tool_simulator.xml
21-Oct-2026 13:23:25 -rw-r--r-- 1 casaci root      1717 Oct 21 17:23 test_tool_synthesisutils.xml
21-Oct-2026 13:23:25 -rw-r--r-- 1 casaci root      1462 Oct 21 17:23 test_tool_table.xml
21-Oct-2026 13:23:25 -rw-r--r-- 1 casaci root      1717 Oct 21 17:23 test_tool_vpmanager.xml
21-Oct-2026 13:23:25 Finished task 'Test wheel' with result: Success
21-Oct-2026 13:23:25 Starting task 'Parse tests' of type 'com.atlassian.bamboo.plugins.testresultparser:task.testresultparser.junit'
21-Oct-2026 13:23:25 Parsing test results under /export/home/cbt-el7-1/bamboo-home/xml-data/build-dir/CASASPECS-CI344-TTOML228...
21-Oct-2026 13:23:26 Failing task since 1 failing test cases were found.
21-Oct-2026 13:23:26 Finished task 'Parse tests' with result: Failed
21-Oct-2026 13:23:26 Starting task 'Cleanup' of type 'com.atlassian.bamboo.plugins.scripttask:task.builder.script'
21-Oct-2026 13:23:26
Beginning to execute external process for build 'CASASPECS - CI Build - CAS-14917 - Test Tools Many Linux 2.28 #4 (CASASPECS-CI344-TTOML228-4)'
... running command line:
/export/home/cbt-el7-1/bamboo-home/temp/CASASPECS-CI344-TTOML228-4-ScriptBuildTask-12770143633944781483.sh
... in: /export/home/cbt-el7-1/bamboo-home/xml-data/build-dir/CASASPECS-CI344-TTOML228
21-Oct-2026 13:23:26 Starting cleanup
21-Oct-2026 13:23:37 wheel-container-test
21-Oct-2026 13:23:40 wheel-container-test
21-Oct-2026 13:23:40 Cleanup complete
21-Oct-2026 13:23:40 Finished task 'Cleanup' with result: Success
21-Oct-2026 13:23:40 Running post build plugin 'Docker Container Cleanup'
21-Oct-2026 13:23:40
Beginning to execute external process for build 'CASASPECS - CI Build - CAS-14917 - Test Tools Many Linux 2.28 #4 (CASASPECS-CI344-TTOML228-4)'
... running command line:
/usr/bin/docker rm -f wheel-container-test
... in: /export/home/cbt-el7-1/bamboo-home/xml-data/build-dir/CASASPECS-CI344-TTOML228
21-Oct-2026 13:23:40 Error response from daemon: No such container: wheel-container-test
21-Oct-2026 13:23:40 Running post build plugin 'NCover Results Collector'
21-Oct-2026 13:23:40 Running post build plugin 'Build Results Label Collector'
21-Oct-2026 13:23:40 Running post build plugin 'Clover Results Collector'
21-Oct-2026 13:23:40 Running post build plugin 'npm Cache Cleanup'
21-Oct-2026 13:23:40 Running post build plugin 'Artifact Copier'
21-Oct-2026 13:23:40 Publishing an artifact: Tests
21-Oct-2026 13:23:41 Finished publishing of artifact Non required job artifact Http Compression On : [Tests], patterns: [*.xml] anchored at: [wheeldirectory/] in 645.1 ms
21-Oct-2026 13:23:41 Publishing an artifact: xml Directories
21-Oct-2026 13:23:41 Finished publishing of artifact Non required job artifact Http Compression On : [xml Directories], patterns: [**/*.xml] anchored at: [wheeldirectory/] in 313.3 ms
21-Oct-2026 13:23:41 Finalising the build...
21-Oct-2026 13:23:41 Stopping timer.
21-Oct-2026 13:23:41 Build CASASPECS-CI344-TTOML228-4 completed.
21-Oct-2026 13:23:42 Running on server: post build plugin 'Build Hanging Detection Configuration'
21-Oct-2026 13:23:42 Running on server: post build plugin 'NCover Results Collector'
21-Oct-2026 13:23:42 Running on server: post build plugin 'Build Labeller'
21-Oct-2026 13:23:42 Running on server: post build plugin 'Clover Delta Calculator'
21-Oct-2026 13:23:42 Running on server: post build plugin 'Maven Dependencies Postprocessor'
21-Oct-2026 13:23:42 All post build plugins have finished
21-Oct-2026 13:23:42 Generating build results summary...
21-Oct-2026 13:23:42 Saving build results to disk...
21-Oct-2026 13:23:42 Store variable context...
21-Oct-2026 13:23:42 Finished building CASASPECS-CI344-TTOML228-4.