Build: #3 failed
Job: Test Tools Many Linux 2.28 failed
Job result summary
- Completed
- Duration
- 18 minutes
- Agent
- cbt-el7-1.cv.nrao.edu (2)
- Revision
-
49d6c760656af6d8d511e7de0d4aa06b5a509929
- Total tests
- 545
Tests
- 545 tests in total
- 3 tests were quarantined / skipped
- 10 minutes taken in total.
Error summary
The build generated some errors. See the full build log for more details.
From https://open-bitbucket.nrao.edu/scm/casa/casa-data
7217062..a8e5e28 master -> origin/master
Downloading geodetic/IERSpredict/table.dat (3.3 KB)
Downloading geodetic/IERSpredict/table.f0 (296 KB)
Downloading geodetic/IERSpredict/table.lock (325 B)
/export/home/cbt-el7-1/bamboo-home/temp/CASASPECS-CI339-TTOML228-3-ScriptBuildTask-6478977065805220903.sh: line 2: cd: /opt/casa/data/casa-data-req: No such file or directory
Error response from daemon: No such container: wheel-container-test
Error response from daemon: No such container: wheel-container-test
2026-10-26 20:10:15 INFO AsciiRegionFileParser::_parse Combined 1 image regions (which excludes any annotation regions)
2026-10-26 20:10:15 INFO AsciiRegionFileParser::_parse The specified region will select all pixels that are included in the region. Full pixels will be included even when they are only partially covered by the region(s).
2026-10-26 20:10:15 INFO AsciiRegionFileParser::_parse Combined 1 image regions (which excludes any annotation regions)
2026-10-26 20:10:15 INFO AsciiRegionFileParser::_parse The specified region will select all pixels that are included in the region. Full pixels will be included even when they are only partially covered by the region(s).
2026-10-26 20:10:15 INFO ImageFactory::createImage Created Temp image of shape [200, 200] with float valued pixels.
2026-10-26 20:10:15 INFO AsciiRegionFileParser::_parse Combined 1 image regions (which excludes any annotation regions)
2026-10-26 20:10:15 INFO AsciiRegionFileParser::_parse The specified region will select all pixels that are included in the region. Full pixels will be included even when they are only partially covered by the region(s).
2026-10-26 20:10:15 INFO ImageRegion::fromRecord Selected bounding box :
2026-10-26 20:10:15 INFO ImageRegion::fromRecord+ [50, 31] to [150, 171] (00:03:20.047, -01.09.00.278 to 23:56:39.950, +01.11.00.303)
2026-10-26 20:10:15 INFO ImageMaskAttacher::makeMask Created mask `mask0'
2026-10-26 20:10:15 WARN image::open (file src/tools/image/image_cmpt.cc, line 4208) Another image is already open, closing first
2026-10-26 20:10:15 INFO ImageFactory::createImage Created Temp image of shape [200, 200] with float valued pixels.
2026-10-26 20:10:15 INFO AsciiRegionFileParser::_parse Combined 1 image regions (which excludes any annotation regions)
2026-10-26 20:10:15 INFO AsciiRegionFileParser::_parse The specified region will select all pixels that are included in the region. Full pixels will be included even when they are only partially covered by the region(s).
2026-10-26 20:10:15 INFO ImageRegion::fromRecord Selected bounding box :
2026-10-26 20:10:15 INFO ImageRegion::fromRecord+ [50, 31] to [149, 171] (00:03:20.047, -01.09.00.278 to 23:56:43.952, +01.11.00.303)
2026-10-26 20:10:15 INFO ImageMaskAttacher::makeMask Created mask `mask0'
2026-10-26 20:10:15 WARN image::open (file src/tools/image/image_cmpt.cc, line 4208) Another image is already open, closing first
2026-10-26 20:10:15 INFO ImageFactory::createImage Created Temp image of shape [200, 200] with float valued pixels.
2026-10-26 20:10:15 INFO AsciiRegionFileParser::_parse Combined 1 image regions (which excludes any annotation regions)
2026-10-26 20:10:15 INFO AsciiRegionFileParser::_parse The specified region will select all pixels that are included in the region. Full pixels will be included even when they are only partially covered by the region(s).
2026-10-26 20:10:15 INFO AsciiRegionFileParser::_parse Combined 1 image regions (which excludes any annotation regions)
2026-10-26 20:10:15 INFO AsciiRegionFileParser::_parse The specified region will select all pixels that are included in the region. Full pixels will be included even when they are only partially covered by the region(s).
2026-10-26 20:10:15 INFO ImageFactory::createImage Created Temp image of shape [4, 4, 20] with float valued pixels.
2026-10-26 20:10:15 WARN AsciiRegionFileParser::_parse line# 1: Error converting world region to lattice region which probably indicates the region lies outside of the image. This region will be ignored.The related message is: LCBox::LCBox - blc [0] must be <= trc [-99889]
2026-10-26 20:10:15 INFO AsciiRegionFileParser::_parse Combined 0 image regions (which excludes any annotation regions)
2026-10-26 20:10:15 SEVERE regionmanager::selectedchannels Exception Reported: Exception: The specified spectral range range=[1315MHz, 1315.1MHz] does not intersect the image spectral range..
2026-10-26 20:10:15 SEVERE regionmanager::selectedchannels+ ... thrown by std::vector<unsigned int, std::allocator<unsigned int> > casa::CasacRegionManager::_spectralRangeFromRangeFormat(casacore::uInt&, const casacore::String&, const casacore::IPosition&) const at File: /source/casa6/casatools/src/code/imageanalysis/Regions/CasacRegionManager.cc, line: 1013
2026-10-26 20:10:15 INFO name:: No table opened.
2026-10-26 20:10:15 INFO name:: No table opened.
2026-10-26 20:10:15 INFO ImageFactory::createImage Created Temp image of shape [4, 4, 4] with float valued pixels.
2026-10-26 20:10:15 SEVERE regionmanager::selectedchannels Exception Reported: Exception: Associated coordinate system has no spectral axis.
2026-10-26 20:10:15 SEVERE regionmanager::selectedchannels+ ... thrown by std::vector<long int> casac::regionmanager::selectedchannels(const string&, const std::vector<long int>&) at File: src/tools/regionmanager/regionmanager_cmpt.cc, line: 686
2026-10-26 20:10:15 INFO name:: No table opened.
2026-10-26 20:10:15 INFO name:: No table opened.
2026-10-26 20:10:15 INFO ImageFactory::createImage Created Temp image of shape [4, 4, 20] with float valued pixels.
2026-10-26 20:10:15 INFO AsciiRegionFileParser::_parse Combined 1 image regions (which excludes any annotation regions)
2026-10-26 20:10:15 INFO AsciiRegionFileParser::_parse The specified region will select all pixels that are included in the region. Full pixels will be included even when they are only partially covered by the region(s).
2026-10-26 20:10:15 INFO AsciiRegionFileParser::_parse Combined 1 image regions (which excludes any annotation regions)
2026-10-26 20:10:15 INFO AsciiRegionFileParser::_parse The specified region will select all pixels that are included in the region. Full pixels will be included even when they are only partially covered by the region(s).
2026-10-26 20:10:15 INFO AsciiRegionFileParser::_parse Combined 1 image regions (which excludes any annotation regions)
2026-10-26 20:10:15 INFO AsciiRegionFileParser::_parse The specified region will select all pixels that are included in the region. Full pixels will be included even when they are only partially covered by the region(s).
2026-10-26 20:10:15 INFO AsciiRegionFileParser::_parse Combined 1 image regions (which excludes any annotation regions)
2026-10-26 20:10:15 INFO AsciiRegionFileParser::_parse The specified region will select all pixels that are included in the region. Full pixels will be included even when they are only partially covered by the region(s).
2026-10-26 20:10:15 INFO name:: No table opened.
2026-10-26 20:10:15 INFO name:: No table opened.
terminate called after throwing an instance of 'casacore::AipsError'
what(): FiledesIO::write - write error in /home/casatest/casa6/casatestutils/nosedir/test_tool_image_statistics/largechunk.im/table.f0_TSM0: No such file or directory
Fatal Python error: Aborted
Current thread 0x00007fe6523bd140 (most recent call first):
File "/home/casatest/venv/lib/python3.12/site-packages/casatools/__casac__/image.py", line 1223 in fromshape
File "/home/casatest/venv/lib/python3.12/site-packages/casatools/image.py", line 545 in fromshape
File "/home/casatest/casa6/casatestutils/nosedir/test_tool_image_statistics/test_tool_image_statistics.py", line 451 in test_CAS_11460
File "/usr/local/lib/python3.12/unittest/case.py", line 589 in _callTestMethod
File "/usr/local/lib/python3.12/unittest/case.py", line 634 in run
File "/usr/local/lib/python3.12/unittest/case.py", line 690 in __call__
File "/home/casatest/venv/lib/python3.12/site-packages/_pytest/unittest.py", line 410 in runtest
File "/home/casatest/venv/lib/python3.12/site-packages/_pytest/runner.py", line 184 in pytest_runtest_call
File "/home/casatest/venv/lib/python3.12/site-packages/pluggy/_execution.py", line 147 in _multicall
File "/home/casatest/venv/lib/python3.12/site-packages/pluggy/_manager.py", line 183 in _hookexec
File "/home/casatest/venv/lib/python3.12/site-packages/pluggy/_caller.py", line 197 in __call__
File "/home/casatest/venv/lib/python3.12/site-packages/_pytest/runner.py", line 250 in <lambda>
File "/home/casatest/venv/lib/python3.12/site-packages/_pytest/runner.py", line 361 in from_call
File "/home/casatest/venv/lib/python3.12/site-packages/_pytest/runner.py", line 249 in call_and_report
File "/home/casatest/venv/lib/python3.12/site-packages/_pytest/runner.py", line 139 in runtestprotocol
File "/home/casatest/venv/lib/python3.12/site-packages/_pytest/runner.py", line 118 in pytest_runtest_protocol
File "/home/casatest/venv/lib/python3.12/site-packages/pluggy/_execution.py", line 147 in _multicall
File "/home/casatest/venv/lib/python3.12/site-packages/pluggy/_manager.py", line 183 in _hookexec
File "/home/casatest/venv/lib/python3.12/site-packages/pluggy/_caller.py", line 197 in __call__
File "/home/casatest/venv/lib/python3.12/site-packages/_pytest/main.py", line 408 in pytest_runtestloop
File "/home/casatest/venv/lib/python3.12/site-packages/pluggy/_execution.py", line 147 in _multicall
File "/home/casatest/venv/lib/python3.12/site-packages/pluggy/_manager.py", line 183 in _hookexec
File "/home/casatest/venv/lib/python3.12/site-packages/pluggy/_caller.py", line 197 in __call__
File "/home/casatest/venv/lib/python3.12/site-packages/_pytest/main.py", line 384 in _main
File "/home/casatest/venv/lib/python3.12/site-packages/_pytest/main.py", line 330 in wrap_session
File "/home/casatest/venv/lib/python3.12/site-packages/_pytest/main.py", line 377 in pytest_cmdline_main
File "/home/casatest/venv/lib/python3.12/site-packages/pluggy/_execution.py", line 147 in _multicall
File "/home/casatest/venv/lib/python3.12/site-packages/pluggy/_manager.py", line 183 in _hookexec
File "/home/casatest/venv/lib/python3.12/site-packages/pluggy/_caller.py", line 197 in __call__
File "/home/casatest/venv/lib/python3.12/site-packages/_pytest/config/__init__.py", line 229 in _main
File "/home/casatest/venv/lib/python3.12/site-packages/_pytest/config/__init__.py", line 253 in _console_main
File "/home/casatest/venv/lib/python3.12/site-packages/pytest/__main__.py", line 9 in <module>
File "<frozen runpy>", line 88 in _run_code
File "<frozen runpy>", line 198 in _run_module_as_main
Extension modules: numpy._core._multiarray_umath, numpy.linalg._umath_linalg, casatools.__casac__._image, casatools.__casac__._coordsys, casatools.__casac__._componentlist, casatools.__casac__._logsink, casatools.__casac__._synthesisutils, casatools.__casac__._synthesisimstore, casatools.__casac__._synthesisnormalizer, casatools.__casac__._calanalysis, casatools.__casac__._mstransformer, casatools.__casac__._calibrater, casatools.__casac__._functional, casatools.__casac__._table, casatools.__casac__._tablerow, casatools.__casac__._measures, casatools.__casac__._imagepol, casatools.__casac__._simulator, casatools.__casac__._sdm, casatools.__casac__._miriadfiller, casatools.__casac__._ms, casatools.__casac__._msmetadata, casatools.__casac__._vpmanager, casatools.__casac__._wvr, casatools.__casac__._synthesisdeconvolver, casatools.__casac__._vlafiller, casatools.__casac__._sakura, casatools.__casac__._linearmosaic, casatools.__casac__._iterbotsink, casatools.__casac__._sidebandseparator, casatools.__casac__._imagemetadata, casatools.__casac__._atcafiller, casatools.__casac__._agentflagger, casatools.__casac__._synthesismaskhandler, casatools.__casac__._regionmanager, casatools.__casac__._imager, casatools.__casac__._singledishms, casatools.__casac__._atmosphere, casatools.__casac__._quanta, casatools.__casac__._synthesisimager, casatools.__casac__._spectralline, casatools.__casac__._utils (total: 42)
Traceback (most recent call last):
File "/home/casatest/casa6/casatestutils/runtest.py", line 1526, in <module>
run(
File "/home/casatest/casa6/casatestutils/runtest.py", line 1135, in run
setup_and_run(cmd, workdir, workpath, dirname, DRY_RUN , pytest_args)
File "/home/casatest/casa6/casatestutils/runtest.py", line 1016, in setup_and_run
update_xml(xmlfile, result, name=os.getcwd().split("/")[-1])
File "/home/casatest/casa6/casatestutils/runtest.py", line 572, in update_xml
write_xml(name, runtime, testname, classname, fMessage, filename, result)
File "/home/casatest/casa6/casatestutils/runtest.py", line 523, in write_xml
with open(filename, "wb") as f:
^^^^^^^^^^^^^^^^^^^^
OSError: [Errno 28] No space left on device
7217062..a8e5e28 master -> origin/master
Downloading geodetic/IERSpredict/table.dat (3.3 KB)
Downloading geodetic/IERSpredict/table.f0 (296 KB)
Downloading geodetic/IERSpredict/table.lock (325 B)
/export/home/cbt-el7-1/bamboo-home/temp/CASASPECS-CI339-TTOML228-3-ScriptBuildTask-6478977065805220903.sh: line 2: cd: /opt/casa/data/casa-data-req: No such file or directory
Error response from daemon: No such container: wheel-container-test
Error response from daemon: No such container: wheel-container-test
2026-10-26 20:10:15 INFO AsciiRegionFileParser::_parse Combined 1 image regions (which excludes any annotation regions)
2026-10-26 20:10:15 INFO AsciiRegionFileParser::_parse The specified region will select all pixels that are included in the region. Full pixels will be included even when they are only partially covered by the region(s).
2026-10-26 20:10:15 INFO AsciiRegionFileParser::_parse Combined 1 image regions (which excludes any annotation regions)
2026-10-26 20:10:15 INFO AsciiRegionFileParser::_parse The specified region will select all pixels that are included in the region. Full pixels will be included even when they are only partially covered by the region(s).
2026-10-26 20:10:15 INFO ImageFactory::createImage Created Temp image of shape [200, 200] with float valued pixels.
2026-10-26 20:10:15 INFO AsciiRegionFileParser::_parse Combined 1 image regions (which excludes any annotation regions)
2026-10-26 20:10:15 INFO AsciiRegionFileParser::_parse The specified region will select all pixels that are included in the region. Full pixels will be included even when they are only partially covered by the region(s).
2026-10-26 20:10:15 INFO ImageRegion::fromRecord Selected bounding box :
2026-10-26 20:10:15 INFO ImageRegion::fromRecord+ [50, 31] to [150, 171] (00:03:20.047, -01.09.00.278 to 23:56:39.950, +01.11.00.303)
2026-10-26 20:10:15 INFO ImageMaskAttacher::makeMask Created mask `mask0'
2026-10-26 20:10:15 WARN image::open (file src/tools/image/image_cmpt.cc, line 4208) Another image is already open, closing first
2026-10-26 20:10:15 INFO ImageFactory::createImage Created Temp image of shape [200, 200] with float valued pixels.
2026-10-26 20:10:15 INFO AsciiRegionFileParser::_parse Combined 1 image regions (which excludes any annotation regions)
2026-10-26 20:10:15 INFO AsciiRegionFileParser::_parse The specified region will select all pixels that are included in the region. Full pixels will be included even when they are only partially covered by the region(s).
2026-10-26 20:10:15 INFO ImageRegion::fromRecord Selected bounding box :
2026-10-26 20:10:15 INFO ImageRegion::fromRecord+ [50, 31] to [149, 171] (00:03:20.047, -01.09.00.278 to 23:56:43.952, +01.11.00.303)
2026-10-26 20:10:15 INFO ImageMaskAttacher::makeMask Created mask `mask0'
2026-10-26 20:10:15 WARN image::open (file src/tools/image/image_cmpt.cc, line 4208) Another image is already open, closing first
2026-10-26 20:10:15 INFO ImageFactory::createImage Created Temp image of shape [200, 200] with float valued pixels.
2026-10-26 20:10:15 INFO AsciiRegionFileParser::_parse Combined 1 image regions (which excludes any annotation regions)
2026-10-26 20:10:15 INFO AsciiRegionFileParser::_parse The specified region will select all pixels that are included in the region. Full pixels will be included even when they are only partially covered by the region(s).
2026-10-26 20:10:15 INFO AsciiRegionFileParser::_parse Combined 1 image regions (which excludes any annotation regions)
2026-10-26 20:10:15 INFO AsciiRegionFileParser::_parse The specified region will select all pixels that are included in the region. Full pixels will be included even when they are only partially covered by the region(s).
2026-10-26 20:10:15 INFO ImageFactory::createImage Created Temp image of shape [4, 4, 20] with float valued pixels.
2026-10-26 20:10:15 WARN AsciiRegionFileParser::_parse line# 1: Error converting world region to lattice region which probably indicates the region lies outside of the image. This region will be ignored.The related message is: LCBox::LCBox - blc [0] must be <= trc [-99889]
2026-10-26 20:10:15 INFO AsciiRegionFileParser::_parse Combined 0 image regions (which excludes any annotation regions)
2026-10-26 20:10:15 SEVERE regionmanager::selectedchannels Exception Reported: Exception: The specified spectral range range=[1315MHz, 1315.1MHz] does not intersect the image spectral range..
2026-10-26 20:10:15 SEVERE regionmanager::selectedchannels+ ... thrown by std::vector<unsigned int, std::allocator<unsigned int> > casa::CasacRegionManager::_spectralRangeFromRangeFormat(casacore::uInt&, const casacore::String&, const casacore::IPosition&) const at File: /source/casa6/casatools/src/code/imageanalysis/Regions/CasacRegionManager.cc, line: 1013
2026-10-26 20:10:15 INFO name:: No table opened.
2026-10-26 20:10:15 INFO name:: No table opened.
2026-10-26 20:10:15 INFO ImageFactory::createImage Created Temp image of shape [4, 4, 4] with float valued pixels.
2026-10-26 20:10:15 SEVERE regionmanager::selectedchannels Exception Reported: Exception: Associated coordinate system has no spectral axis.
2026-10-26 20:10:15 SEVERE regionmanager::selectedchannels+ ... thrown by std::vector<long int> casac::regionmanager::selectedchannels(const string&, const std::vector<long int>&) at File: src/tools/regionmanager/regionmanager_cmpt.cc, line: 686
2026-10-26 20:10:15 INFO name:: No table opened.
2026-10-26 20:10:15 INFO name:: No table opened.
2026-10-26 20:10:15 INFO ImageFactory::createImage Created Temp image of shape [4, 4, 20] with float valued pixels.
2026-10-26 20:10:15 INFO AsciiRegionFileParser::_parse Combined 1 image regions (which excludes any annotation regions)
2026-10-26 20:10:15 INFO AsciiRegionFileParser::_parse The specified region will select all pixels that are included in the region. Full pixels will be included even when they are only partially covered by the region(s).
2026-10-26 20:10:15 INFO AsciiRegionFileParser::_parse Combined 1 image regions (which excludes any annotation regions)
2026-10-26 20:10:15 INFO AsciiRegionFileParser::_parse The specified region will select all pixels that are included in the region. Full pixels will be included even when they are only partially covered by the region(s).
2026-10-26 20:10:15 INFO AsciiRegionFileParser::_parse Combined 1 image regions (which excludes any annotation regions)
2026-10-26 20:10:15 INFO AsciiRegionFileParser::_parse The specified region will select all pixels that are included in the region. Full pixels will be included even when they are only partially covered by the region(s).
2026-10-26 20:10:15 INFO AsciiRegionFileParser::_parse Combined 1 image regions (which excludes any annotation regions)
2026-10-26 20:10:15 INFO AsciiRegionFileParser::_parse The specified region will select all pixels that are included in the region. Full pixels will be included even when they are only partially covered by the region(s).
2026-10-26 20:10:15 INFO name:: No table opened.
2026-10-26 20:10:15 INFO name:: No table opened.
terminate called after throwing an instance of 'casacore::AipsError'
what(): FiledesIO::write - write error in /home/casatest/casa6/casatestutils/nosedir/test_tool_image_statistics/largechunk.im/table.f0_TSM0: No such file or directory
Fatal Python error: Aborted
Current thread 0x00007fe6523bd140 (most recent call first):
File "/home/casatest/venv/lib/python3.12/site-packages/casatools/__casac__/image.py", line 1223 in fromshape
File "/home/casatest/venv/lib/python3.12/site-packages/casatools/image.py", line 545 in fromshape
File "/home/casatest/casa6/casatestutils/nosedir/test_tool_image_statistics/test_tool_image_statistics.py", line 451 in test_CAS_11460
File "/usr/local/lib/python3.12/unittest/case.py", line 589 in _callTestMethod
File "/usr/local/lib/python3.12/unittest/case.py", line 634 in run
File "/usr/local/lib/python3.12/unittest/case.py", line 690 in __call__
File "/home/casatest/venv/lib/python3.12/site-packages/_pytest/unittest.py", line 410 in runtest
File "/home/casatest/venv/lib/python3.12/site-packages/_pytest/runner.py", line 184 in pytest_runtest_call
File "/home/casatest/venv/lib/python3.12/site-packages/pluggy/_execution.py", line 147 in _multicall
File "/home/casatest/venv/lib/python3.12/site-packages/pluggy/_manager.py", line 183 in _hookexec
File "/home/casatest/venv/lib/python3.12/site-packages/pluggy/_caller.py", line 197 in __call__
File "/home/casatest/venv/lib/python3.12/site-packages/_pytest/runner.py", line 250 in <lambda>
File "/home/casatest/venv/lib/python3.12/site-packages/_pytest/runner.py", line 361 in from_call
File "/home/casatest/venv/lib/python3.12/site-packages/_pytest/runner.py", line 249 in call_and_report
File "/home/casatest/venv/lib/python3.12/site-packages/_pytest/runner.py", line 139 in runtestprotocol
File "/home/casatest/venv/lib/python3.12/site-packages/_pytest/runner.py", line 118 in pytest_runtest_protocol
File "/home/casatest/venv/lib/python3.12/site-packages/pluggy/_execution.py", line 147 in _multicall
File "/home/casatest/venv/lib/python3.12/site-packages/pluggy/_manager.py", line 183 in _hookexec
File "/home/casatest/venv/lib/python3.12/site-packages/pluggy/_caller.py", line 197 in __call__
File "/home/casatest/venv/lib/python3.12/site-packages/_pytest/main.py", line 408 in pytest_runtestloop
File "/home/casatest/venv/lib/python3.12/site-packages/pluggy/_execution.py", line 147 in _multicall
File "/home/casatest/venv/lib/python3.12/site-packages/pluggy/_manager.py", line 183 in _hookexec
File "/home/casatest/venv/lib/python3.12/site-packages/pluggy/_caller.py", line 197 in __call__
File "/home/casatest/venv/lib/python3.12/site-packages/_pytest/main.py", line 384 in _main
File "/home/casatest/venv/lib/python3.12/site-packages/_pytest/main.py", line 330 in wrap_session
File "/home/casatest/venv/lib/python3.12/site-packages/_pytest/main.py", line 377 in pytest_cmdline_main
File "/home/casatest/venv/lib/python3.12/site-packages/pluggy/_execution.py", line 147 in _multicall
File "/home/casatest/venv/lib/python3.12/site-packages/pluggy/_manager.py", line 183 in _hookexec
File "/home/casatest/venv/lib/python3.12/site-packages/pluggy/_caller.py", line 197 in __call__
File "/home/casatest/venv/lib/python3.12/site-packages/_pytest/config/__init__.py", line 229 in _main
File "/home/casatest/venv/lib/python3.12/site-packages/_pytest/config/__init__.py", line 253 in _console_main
File "/home/casatest/venv/lib/python3.12/site-packages/pytest/__main__.py", line 9 in <module>
File "<frozen runpy>", line 88 in _run_code
File "<frozen runpy>", line 198 in _run_module_as_main
Extension modules: numpy._core._multiarray_umath, numpy.linalg._umath_linalg, casatools.__casac__._image, casatools.__casac__._coordsys, casatools.__casac__._componentlist, casatools.__casac__._logsink, casatools.__casac__._synthesisutils, casatools.__casac__._synthesisimstore, casatools.__casac__._synthesisnormalizer, casatools.__casac__._calanalysis, casatools.__casac__._mstransformer, casatools.__casac__._calibrater, casatools.__casac__._functional, casatools.__casac__._table, casatools.__casac__._tablerow, casatools.__casac__._measures, casatools.__casac__._imagepol, casatools.__casac__._simulator, casatools.__casac__._sdm, casatools.__casac__._miriadfiller, casatools.__casac__._ms, casatools.__casac__._msmetadata, casatools.__casac__._vpmanager, casatools.__casac__._wvr, casatools.__casac__._synthesisdeconvolver, casatools.__casac__._vlafiller, casatools.__casac__._sakura, casatools.__casac__._linearmosaic, casatools.__casac__._iterbotsink, casatools.__casac__._sidebandseparator, casatools.__casac__._imagemetadata, casatools.__casac__._atcafiller, casatools.__casac__._agentflagger, casatools.__casac__._synthesismaskhandler, casatools.__casac__._regionmanager, casatools.__casac__._imager, casatools.__casac__._singledishms, casatools.__casac__._atmosphere, casatools.__casac__._quanta, casatools.__casac__._synthesisimager, casatools.__casac__._spectralline, casatools.__casac__._utils (total: 42)
Traceback (most recent call last):
File "/home/casatest/casa6/casatestutils/runtest.py", line 1526, in <module>
run(
File "/home/casatest/casa6/casatestutils/runtest.py", line 1135, in run
setup_and_run(cmd, workdir, workpath, dirname, DRY_RUN , pytest_args)
File "/home/casatest/casa6/casatestutils/runtest.py", line 1016, in setup_and_run
update_xml(xmlfile, result, name=os.getcwd().split("/")[-1])
File "/home/casatest/casa6/casatestutils/runtest.py", line 572, in update_xml
write_xml(name, runtime, testname, classname, fMessage, filename, result)
File "/home/casatest/casa6/casatestutils/runtest.py", line 523, in write_xml
with open(filename, "wb") as f:
^^^^^^^^^^^^^^^^^^^^
OSError: [Errno 28] No space left on device