Build: #3 failed

Job: ManyLinux 2.28 failed

Stages & jobs

  1. Default Stage

  2. Test

Build log

The build generated 70,248 lines of output.   The output is too long and has been truncated to the last 1,000 lines. Download or view full build log.

07-Oct-2026 13:56:53 copying src/tools/build_env/lib/python3.12/site-packages/setuptools/command/easy_install.py -> casatools-6.7.7.12a14900.dev1+dirty/src/tools/build_env/lib/python3.12/site-packages/setuptools/command
07-Oct-2026 13:56:53 copying src/tools/build_env/lib/python3.12/site-packages/setuptools/command/editable_wheel.py -> casatools-6.7.7.12a14900.dev1+dirty/src/tools/build_env/lib/python3.12/site-packages/setuptools/command
07-Oct-2026 13:56:53 copying src/tools/build_env/lib/python3.12/site-packages/setuptools/command/egg_info.py -> casatools-6.7.7.12a14900.dev1+dirty/src/tools/build_env/lib/python3.12/site-packages/setuptools/command
07-Oct-2026 13:56:53 copying src/tools/build_env/lib/python3.12/site-packages/setuptools/command/install.py -> casatools-6.7.7.12a14900.dev1+dirty/src/tools/build_env/lib/python3.12/site-packages/setuptools/command
07-Oct-2026 13:56:53 copying src/tools/build_env/lib/python3.12/site-packages/setuptools/command/install_egg_info.py -> casatools-6.7.7.12a14900.dev1+dirty/src/tools/build_env/lib/python3.12/site-packages/setuptools/command
07-Oct-2026 13:56:53 copying src/tools/build_env/lib/python3.12/site-packages/setuptools/command/install_lib.py -> casatools-6.7.7.12a14900.dev1+dirty/src/tools/build_env/lib/python3.12/site-packages/setuptools/command
07-Oct-2026 13:56:53 copying src/tools/build_env/lib/python3.12/site-packages/setuptools/command/install_scripts.py -> casatools-6.7.7.12a14900.dev1+dirty/src/tools/build_env/lib/python3.12/site-packages/setuptools/command
07-Oct-2026 13:56:53 copying src/tools/build_env/lib/python3.12/site-packages/setuptools/command/rotate.py -> casatools-6.7.7.12a14900.dev1+dirty/src/tools/build_env/lib/python3.12/site-packages/setuptools/command
07-Oct-2026 13:56:53 copying src/tools/build_env/lib/python3.12/site-packages/setuptools/command/saveopts.py -> casatools-6.7.7.12a14900.dev1+dirty/src/tools/build_env/lib/python3.12/site-packages/setuptools/command
07-Oct-2026 13:56:53 copying src/tools/build_env/lib/python3.12/site-packages/setuptools/command/sdist.py -> casatools-6.7.7.12a14900.dev1+dirty/src/tools/build_env/lib/python3.12/site-packages/setuptools/command
07-Oct-2026 13:56:53 copying src/tools/build_env/lib/python3.12/site-packages/setuptools/command/setopt.py -> casatools-6.7.7.12a14900.dev1+dirty/src/tools/build_env/lib/python3.12/site-packages/setuptools/command
07-Oct-2026 13:56:53 copying src/tools/build_env/lib/python3.12/site-packages/setuptools/command/test.py -> casatools-6.7.7.12a14900.dev1+dirty/src/tools/build_env/lib/python3.12/site-packages/setuptools/command
07-Oct-2026 13:56:53 copying src/tools/build_env/lib/python3.12/site-packages/setuptools/command/__pycache__/__init__.cpython-312.pyc -> casatools-6.7.7.12a14900.dev1+dirty/src/tools/build_env/lib/python3.12/site-packages/setuptools/command/__pycache__
07-Oct-2026 13:56:53 copying src/tools/build_env/lib/python3.12/site-packages/setuptools/command/__pycache__/_requirestxt.cpython-312.pyc -> casatools-6.7.7.12a14900.dev1+dirty/src/tools/build_env/lib/python3.12/site-packages/setuptools/command/__pycache__
07-Oct-2026 13:56:53 copying src/tools/build_env/lib/python3.12/site-packages/setuptools/command/__pycache__/alias.cpython-312.pyc -> casatools-6.7.7.12a14900.dev1+dirty/src/tools/build_env/lib/python3.12/site-packages/setuptools/command/__pycache__
07-Oct-2026 13:56:53 copying src/tools/build_env/lib/python3.12/site-packages/setuptools/command/__pycache__/bdist_egg.cpython-312.pyc -> casatools-6.7.7.12a14900.dev1+dirty/src/tools/build_env/lib/python3.12/site-packages/setuptools/command/__pycache__
07-Oct-2026 13:56:53 copying src/tools/build_env/lib/python3.12/site-packages/setuptools/command/__pycache__/bdist_rpm.cpython-312.pyc -> casatools-6.7.7.12a14900.dev1+dirty/src/tools/build_env/lib/python3.12/site-packages/setuptools/command/__pycache__
07-Oct-2026 13:56:53 copying src/tools/build_env/lib/python3.12/site-packages/setuptools/command/__pycache__/bdist_wheel.cpython-312.pyc -> casatools-6.7.7.12a14900.dev1+dirty/src/tools/build_env/lib/python3.12/site-packages/setuptools/command/__pycache__
07-Oct-2026 13:56:53 copying src/tools/build_env/lib/python3.12/site-packages/setuptools/command/__pycache__/build.cpython-312.pyc -> casatools-6.7.7.12a14900.dev1+dirty/src/tools/build_env/lib/python3.12/site-packages/setuptools/command/__pycache__
07-Oct-2026 13:56:53 copying src/tools/build_env/lib/python3.12/site-packages/setuptools/command/__pycache__/build_clib.cpython-312.pyc -> casatools-6.7.7.12a14900.dev1+dirty/src/tools/build_env/lib/python3.12/site-packages/setuptools/command/__pycache__
07-Oct-2026 13:56:53 copying src/tools/build_env/lib/python3.12/site-packages/setuptools/command/__pycache__/build_ext.cpython-312.pyc -> casatools-6.7.7.12a14900.dev1+dirty/src/tools/build_env/lib/python3.12/site-packages/setuptools/command/__pycache__
07-Oct-2026 13:56:53 copying src/tools/build_env/lib/python3.12/site-packages/setuptools/command/__pycache__/build_py.cpython-312.pyc -> casatools-6.7.7.12a14900.dev1+dirty/src/tools/build_env/lib/python3.12/site-packages/setuptools/command/__pycache__
07-Oct-2026 13:56:53 copying src/tools/build_env/lib/python3.12/site-packages/setuptools/command/__pycache__/develop.cpython-312.pyc -> casatools-6.7.7.12a14900.dev1+dirty/src/tools/build_env/lib/python3.12/site-packages/setuptools/command/__pycache__
07-Oct-2026 13:56:53 copying src/tools/build_env/lib/python3.12/site-packages/setuptools/command/__pycache__/dist_info.cpython-312.pyc -> casatools-6.7.7.12a14900.dev1+dirty/src/tools/build_env/lib/python3.12/site-packages/setuptools/command/__pycache__
07-Oct-2026 13:56:53 copying src/tools/build_env/lib/python3.12/site-packages/setuptools/command/__pycache__/easy_install.cpython-312.pyc -> casatools-6.7.7.12a14900.dev1+dirty/src/tools/build_env/lib/python3.12/site-packages/setuptools/command/__pycache__
07-Oct-2026 13:56:53 copying src/tools/build_env/lib/python3.12/site-packages/setuptools/command/__pycache__/editable_wheel.cpython-312.pyc -> casatools-6.7.7.12a14900.dev1+dirty/src/tools/build_env/lib/python3.12/site-packages/setuptools/command/__pycache__
07-Oct-2026 13:56:53 copying src/tools/build_env/lib/python3.12/site-packages/setuptools/command/__pycache__/egg_info.cpython-312.pyc -> casatools-6.7.7.12a14900.dev1+dirty/src/tools/build_env/lib/python3.12/site-packages/setuptools/command/__pycache__
07-Oct-2026 13:56:53 copying src/tools/build_env/lib/python3.12/site-packages/setuptools/command/__pycache__/install.cpython-312.pyc -> casatools-6.7.7.12a14900.dev1+dirty/src/tools/build_env/lib/python3.12/site-packages/setuptools/command/__pycache__
07-Oct-2026 13:56:53 copying src/tools/build_env/lib/python3.12/site-packages/setuptools/command/__pycache__/install_egg_info.cpython-312.pyc -> casatools-6.7.7.12a14900.dev1+dirty/src/tools/build_env/lib/python3.12/site-packages/setuptools/command/__pycache__
07-Oct-2026 13:56:53 copying src/tools/build_env/lib/python3.12/site-packages/setuptools/command/__pycache__/install_lib.cpython-312.pyc -> casatools-6.7.7.12a14900.dev1+dirty/src/tools/build_env/lib/python3.12/site-packages/setuptools/command/__pycache__
07-Oct-2026 13:56:53 copying src/tools/build_env/lib/python3.12/site-packages/setuptools/command/__pycache__/install_scripts.cpython-312.pyc -> casatools-6.7.7.12a14900.dev1+dirty/src/tools/build_env/lib/python3.12/site-packages/setuptools/command/__pycache__
07-Oct-2026 13:56:53 copying src/tools/build_env/lib/python3.12/site-packages/setuptools/command/__pycache__/rotate.cpython-312.pyc -> casatools-6.7.7.12a14900.dev1+dirty/src/tools/build_env/lib/python3.12/site-packages/setuptools/command/__pycache__
07-Oct-2026 13:56:53 copying src/tools/build_env/lib/python3.12/site-packages/setuptools/command/__pycache__/saveopts.cpython-312.pyc -> casatools-6.7.7.12a14900.dev1+dirty/src/tools/build_env/lib/python3.12/site-packages/setuptools/command/__pycache__
07-Oct-2026 13:56:53 copying src/tools/build_env/lib/python3.12/site-packages/setuptools/command/__pycache__/sdist.cpython-312.pyc -> casatools-6.7.7.12a14900.dev1+dirty/src/tools/build_env/lib/python3.12/site-packages/setuptools/command/__pycache__
07-Oct-2026 13:56:53 copying src/tools/build_env/lib/python3.12/site-packages/setuptools/command/__pycache__/setopt.cpython-312.pyc -> casatools-6.7.7.12a14900.dev1+dirty/src/tools/build_env/lib/python3.12/site-packages/setuptools/command/__pycache__
07-Oct-2026 13:56:53 copying src/tools/build_env/lib/python3.12/site-packages/setuptools/command/__pycache__/test.cpython-312.pyc -> casatools-6.7.7.12a14900.dev1+dirty/src/tools/build_env/lib/python3.12/site-packages/setuptools/command/__pycache__
07-Oct-2026 13:56:53 copying src/tools/build_env/lib/python3.12/site-packages/setuptools/compat/__init__.py -> casatools-6.7.7.12a14900.dev1+dirty/src/tools/build_env/lib/python3.12/site-packages/setuptools/compat
07-Oct-2026 13:56:53 copying src/tools/build_env/lib/python3.12/site-packages/setuptools/compat/py310.py -> casatools-6.7.7.12a14900.dev1+dirty/src/tools/build_env/lib/python3.12/site-packages/setuptools/compat
07-Oct-2026 13:56:53 copying src/tools/build_env/lib/python3.12/site-packages/setuptools/compat/py311.py -> casatools-6.7.7.12a14900.dev1+dirty/src/tools/build_env/lib/python3.12/site-packages/setuptools/compat
07-Oct-2026 13:56:53 copying src/tools/build_env/lib/python3.12/site-packages/setuptools/compat/py312.py -> casatools-6.7.7.12a14900.dev1+dirty/src/tools/build_env/lib/python3.12/site-packages/setuptools/compat
07-Oct-2026 13:56:53 copying src/tools/build_env/lib/python3.12/site-packages/setuptools/compat/py39.py -> casatools-6.7.7.12a14900.dev1+dirty/src/tools/build_env/lib/python3.12/site-packages/setuptools/compat
07-Oct-2026 13:56:53 copying src/tools/build_env/lib/python3.12/site-packages/setuptools/compat/__pycache__/__init__.cpython-312.pyc -> casatools-6.7.7.12a14900.dev1+dirty/src/tools/build_env/lib/python3.12/site-packages/setuptools/compat/__pycache__
07-Oct-2026 13:56:53 copying src/tools/build_env/lib/python3.12/site-packages/setuptools/compat/__pycache__/py310.cpython-312.pyc -> casatools-6.7.7.12a14900.dev1+dirty/src/tools/build_env/lib/python3.12/site-packages/setuptools/compat/__pycache__
07-Oct-2026 13:56:53 copying src/tools/build_env/lib/python3.12/site-packages/setuptools/compat/__pycache__/py311.cpython-312.pyc -> casatools-6.7.7.12a14900.dev1+dirty/src/tools/build_env/lib/python3.12/site-packages/setuptools/compat/__pycache__
07-Oct-2026 13:56:53 copying src/tools/build_env/lib/python3.12/site-packages/setuptools/compat/__pycache__/py312.cpython-312.pyc -> casatools-6.7.7.12a14900.dev1+dirty/src/tools/build_env/lib/python3.12/site-packages/setuptools/compat/__pycache__
07-Oct-2026 13:56:53 copying src/tools/build_env/lib/python3.12/site-packages/setuptools/compat/__pycache__/py39.cpython-312.pyc -> casatools-6.7.7.12a14900.dev1+dirty/src/tools/build_env/lib/python3.12/site-packages/setuptools/compat/__pycache__
07-Oct-2026 13:56:53 copying src/tools/build_env/lib/python3.12/site-packages/setuptools/config/NOTICE -> casatools-6.7.7.12a14900.dev1+dirty/src/tools/build_env/lib/python3.12/site-packages/setuptools/config
07-Oct-2026 13:56:53 copying src/tools/build_env/lib/python3.12/site-packages/setuptools/config/__init__.py -> casatools-6.7.7.12a14900.dev1+dirty/src/tools/build_env/lib/python3.12/site-packages/setuptools/config
07-Oct-2026 13:56:53 copying src/tools/build_env/lib/python3.12/site-packages/setuptools/config/_apply_pyprojecttoml.py -> casatools-6.7.7.12a14900.dev1+dirty/src/tools/build_env/lib/python3.12/site-packages/setuptools/config
07-Oct-2026 13:56:53 copying src/tools/build_env/lib/python3.12/site-packages/setuptools/config/distutils.schema.json -> casatools-6.7.7.12a14900.dev1+dirty/src/tools/build_env/lib/python3.12/site-packages/setuptools/config
07-Oct-2026 13:56:53 copying src/tools/build_env/lib/python3.12/site-packages/setuptools/config/expand.py -> casatools-6.7.7.12a14900.dev1+dirty/src/tools/build_env/lib/python3.12/site-packages/setuptools/config
07-Oct-2026 13:56:53 copying src/tools/build_env/lib/python3.12/site-packages/setuptools/config/pyprojecttoml.py -> casatools-6.7.7.12a14900.dev1+dirty/src/tools/build_env/lib/python3.12/site-packages/setuptools/config
07-Oct-2026 13:56:53 copying src/tools/build_env/lib/python3.12/site-packages/setuptools/config/setupcfg.py -> casatools-6.7.7.12a14900.dev1+dirty/src/tools/build_env/lib/python3.12/site-packages/setuptools/config
07-Oct-2026 13:56:53 copying src/tools/build_env/lib/python3.12/site-packages/setuptools/config/setuptools.schema.json -> casatools-6.7.7.12a14900.dev1+dirty/src/tools/build_env/lib/python3.12/site-packages/setuptools/config
07-Oct-2026 13:56:53 copying src/tools/build_env/lib/python3.12/site-packages/setuptools/config/__pycache__/__init__.cpython-312.pyc -> casatools-6.7.7.12a14900.dev1+dirty/src/tools/build_env/lib/python3.12/site-packages/setuptools/config/__pycache__
07-Oct-2026 13:56:53 copying src/tools/build_env/lib/python3.12/site-packages/setuptools/config/__pycache__/_apply_pyprojecttoml.cpython-312.pyc -> casatools-6.7.7.12a14900.dev1+dirty/src/tools/build_env/lib/python3.12/site-packages/setuptools/config/__pycache__
07-Oct-2026 13:56:53 copying src/tools/build_env/lib/python3.12/site-packages/setuptools/config/__pycache__/expand.cpython-312.pyc -> casatools-6.7.7.12a14900.dev1+dirty/src/tools/build_env/lib/python3.12/site-packages/setuptools/config/__pycache__
07-Oct-2026 13:56:53 copying src/tools/build_env/lib/python3.12/site-packages/setuptools/config/__pycache__/pyprojecttoml.cpython-312.pyc -> casatools-6.7.7.12a14900.dev1+dirty/src/tools/build_env/lib/python3.12/site-packages/setuptools/config/__pycache__
07-Oct-2026 13:56:53 copying src/tools/build_env/lib/python3.12/site-packages/setuptools/config/__pycache__/setupcfg.cpython-312.pyc -> casatools-6.7.7.12a14900.dev1+dirty/src/tools/build_env/lib/python3.12/site-packages/setuptools/config/__pycache__
07-Oct-2026 13:56:53 copying src/tools/build_env/lib/python3.12/site-packages/setuptools/config/_validate_pyproject/NOTICE -> casatools-6.7.7.12a14900.dev1+dirty/src/tools/build_env/lib/python3.12/site-packages/setuptools/config/_validate_pyproject
07-Oct-2026 13:56:53 copying src/tools/build_env/lib/python3.12/site-packages/setuptools/config/_validate_pyproject/__init__.py -> casatools-6.7.7.12a14900.dev1+dirty/src/tools/build_env/lib/python3.12/site-packages/setuptools/config/_validate_pyproject
07-Oct-2026 13:56:53 copying src/tools/build_env/lib/python3.12/site-packages/setuptools/config/_validate_pyproject/error_reporting.py -> casatools-6.7.7.12a14900.dev1+dirty/src/tools/build_env/lib/python3.12/site-packages/setuptools/config/_validate_pyproject
07-Oct-2026 13:56:53 copying src/tools/build_env/lib/python3.12/site-packages/setuptools/config/_validate_pyproject/extra_validations.py -> casatools-6.7.7.12a14900.dev1+dirty/src/tools/build_env/lib/python3.12/site-packages/setuptools/config/_validate_pyproject
07-Oct-2026 13:56:53 copying src/tools/build_env/lib/python3.12/site-packages/setuptools/config/_validate_pyproject/fastjsonschema_exceptions.py -> casatools-6.7.7.12a14900.dev1+dirty/src/tools/build_env/lib/python3.12/site-packages/setuptools/config/_validate_pyproject
07-Oct-2026 13:56:53 copying src/tools/build_env/lib/python3.12/site-packages/setuptools/config/_validate_pyproject/fastjsonschema_validations.py -> casatools-6.7.7.12a14900.dev1+dirty/src/tools/build_env/lib/python3.12/site-packages/setuptools/config/_validate_pyproject
07-Oct-2026 13:56:53 copying src/tools/build_env/lib/python3.12/site-packages/setuptools/config/_validate_pyproject/formats.py -> casatools-6.7.7.12a14900.dev1+dirty/src/tools/build_env/lib/python3.12/site-packages/setuptools/config/_validate_pyproject
07-Oct-2026 13:56:53 copying src/tools/build_env/lib/python3.12/site-packages/setuptools/config/_validate_pyproject/__pycache__/__init__.cpython-312.pyc -> casatools-6.7.7.12a14900.dev1+dirty/src/tools/build_env/lib/python3.12/site-packages/setuptools/config/_validate_pyproject/__pycache__
07-Oct-2026 13:56:53 copying src/tools/build_env/lib/python3.12/site-packages/setuptools/config/_validate_pyproject/__pycache__/error_reporting.cpython-312.pyc -> casatools-6.7.7.12a14900.dev1+dirty/src/tools/build_env/lib/python3.12/site-packages/setuptools/config/_validate_pyproject/__pycache__
07-Oct-2026 13:56:53 copying src/tools/build_env/lib/python3.12/site-packages/setuptools/config/_validate_pyproject/__pycache__/extra_validations.cpython-312.pyc -> casatools-6.7.7.12a14900.dev1+dirty/src/tools/build_env/lib/python3.12/site-packages/setuptools/config/_validate_pyproject/__pycache__
07-Oct-2026 13:56:53 copying src/tools/build_env/lib/python3.12/site-packages/setuptools/config/_validate_pyproject/__pycache__/fastjsonschema_exceptions.cpython-312.pyc -> casatools-6.7.7.12a14900.dev1+dirty/src/tools/build_env/lib/python3.12/site-packages/setuptools/config/_validate_pyproject/__pycache__
07-Oct-2026 13:56:53 copying src/tools/build_env/lib/python3.12/site-packages/setuptools/config/_validate_pyproject/__pycache__/fastjsonschema_validations.cpython-312.pyc -> casatools-6.7.7.12a14900.dev1+dirty/src/tools/build_env/lib/python3.12/site-packages/setuptools/config/_validate_pyproject/__pycache__
07-Oct-2026 13:56:53 copying src/tools/build_env/lib/python3.12/site-packages/setuptools/config/_validate_pyproject/__pycache__/formats.cpython-312.pyc -> casatools-6.7.7.12a14900.dev1+dirty/src/tools/build_env/lib/python3.12/site-packages/setuptools/config/_validate_pyproject/__pycache__
07-Oct-2026 13:56:53 copying src/tools/build_env/lib/python3.12/site-packages/wheel/__init__.py -> casatools-6.7.7.12a14900.dev1+dirty/src/tools/build_env/lib/python3.12/site-packages/wheel
07-Oct-2026 13:56:53 copying src/tools/build_env/lib/python3.12/site-packages/wheel/__main__.py -> casatools-6.7.7.12a14900.dev1+dirty/src/tools/build_env/lib/python3.12/site-packages/wheel
07-Oct-2026 13:56:53 copying src/tools/build_env/lib/python3.12/site-packages/wheel/_bdist_wheel.py -> casatools-6.7.7.12a14900.dev1+dirty/src/tools/build_env/lib/python3.12/site-packages/wheel
07-Oct-2026 13:56:53 copying src/tools/build_env/lib/python3.12/site-packages/wheel/_metadata.py -> casatools-6.7.7.12a14900.dev1+dirty/src/tools/build_env/lib/python3.12/site-packages/wheel
07-Oct-2026 13:56:53 copying src/tools/build_env/lib/python3.12/site-packages/wheel/_setuptools_logging.py -> casatools-6.7.7.12a14900.dev1+dirty/src/tools/build_env/lib/python3.12/site-packages/wheel
07-Oct-2026 13:56:53 copying src/tools/build_env/lib/python3.12/site-packages/wheel/bdist_wheel.py -> casatools-6.7.7.12a14900.dev1+dirty/src/tools/build_env/lib/python3.12/site-packages/wheel
07-Oct-2026 13:56:53 copying src/tools/build_env/lib/python3.12/site-packages/wheel/macosx_libfile.py -> casatools-6.7.7.12a14900.dev1+dirty/src/tools/build_env/lib/python3.12/site-packages/wheel
07-Oct-2026 13:56:53 copying src/tools/build_env/lib/python3.12/site-packages/wheel/metadata.py -> casatools-6.7.7.12a14900.dev1+dirty/src/tools/build_env/lib/python3.12/site-packages/wheel
07-Oct-2026 13:56:53 copying src/tools/build_env/lib/python3.12/site-packages/wheel/wheelfile.py -> casatools-6.7.7.12a14900.dev1+dirty/src/tools/build_env/lib/python3.12/site-packages/wheel
07-Oct-2026 13:56:53 copying src/tools/build_env/lib/python3.12/site-packages/wheel-0.48.0.dist-info/INSTALLER -> casatools-6.7.7.12a14900.dev1+dirty/src/tools/build_env/lib/python3.12/site-packages/wheel-0.48.0.dist-info
07-Oct-2026 13:56:53 copying src/tools/build_env/lib/python3.12/site-packages/wheel-0.48.0.dist-info/METADATA -> casatools-6.7.7.12a14900.dev1+dirty/src/tools/build_env/lib/python3.12/site-packages/wheel-0.48.0.dist-info
07-Oct-2026 13:56:53 copying src/tools/build_env/lib/python3.12/site-packages/wheel-0.48.0.dist-info/RECORD -> casatools-6.7.7.12a14900.dev1+dirty/src/tools/build_env/lib/python3.12/site-packages/wheel-0.48.0.dist-info
07-Oct-2026 13:56:53 copying src/tools/build_env/lib/python3.12/site-packages/wheel-0.48.0.dist-info/REQUESTED -> casatools-6.7.7.12a14900.dev1+dirty/src/tools/build_env/lib/python3.12/site-packages/wheel-0.48.0.dist-info
07-Oct-2026 13:56:53 copying src/tools/build_env/lib/python3.12/site-packages/wheel-0.48.0.dist-info/WHEEL -> casatools-6.7.7.12a14900.dev1+dirty/src/tools/build_env/lib/python3.12/site-packages/wheel-0.48.0.dist-info
07-Oct-2026 13:56:53 copying src/tools/build_env/lib/python3.12/site-packages/wheel-0.48.0.dist-info/entry_points.txt -> casatools-6.7.7.12a14900.dev1+dirty/src/tools/build_env/lib/python3.12/site-packages/wheel-0.48.0.dist-info
07-Oct-2026 13:56:53 copying src/tools/build_env/lib/python3.12/site-packages/wheel-0.48.0.dist-info/licenses/LICENSE.txt -> casatools-6.7.7.12a14900.dev1+dirty/src/tools/build_env/lib/python3.12/site-packages/wheel-0.48.0.dist-info/licenses
07-Oct-2026 13:56:53 copying src/tools/build_env/lib/python3.12/site-packages/wheel/__pycache__/__init__.cpython-312.pyc -> casatools-6.7.7.12a14900.dev1+dirty/src/tools/build_env/lib/python3.12/site-packages/wheel/__pycache__
07-Oct-2026 13:56:53 copying src/tools/build_env/lib/python3.12/site-packages/wheel/__pycache__/__main__.cpython-312.pyc -> casatools-6.7.7.12a14900.dev1+dirty/src/tools/build_env/lib/python3.12/site-packages/wheel/__pycache__
07-Oct-2026 13:56:53 copying src/tools/build_env/lib/python3.12/site-packages/wheel/__pycache__/_bdist_wheel.cpython-312.pyc -> casatools-6.7.7.12a14900.dev1+dirty/src/tools/build_env/lib/python3.12/site-packages/wheel/__pycache__
07-Oct-2026 13:56:53 copying src/tools/build_env/lib/python3.12/site-packages/wheel/__pycache__/_metadata.cpython-312.pyc -> casatools-6.7.7.12a14900.dev1+dirty/src/tools/build_env/lib/python3.12/site-packages/wheel/__pycache__
07-Oct-2026 13:56:53 copying src/tools/build_env/lib/python3.12/site-packages/wheel/__pycache__/_setuptools_logging.cpython-312.pyc -> casatools-6.7.7.12a14900.dev1+dirty/src/tools/build_env/lib/python3.12/site-packages/wheel/__pycache__
07-Oct-2026 13:56:53 copying src/tools/build_env/lib/python3.12/site-packages/wheel/__pycache__/bdist_wheel.cpython-312.pyc -> casatools-6.7.7.12a14900.dev1+dirty/src/tools/build_env/lib/python3.12/site-packages/wheel/__pycache__
07-Oct-2026 13:56:53 copying src/tools/build_env/lib/python3.12/site-packages/wheel/__pycache__/macosx_libfile.cpython-312.pyc -> casatools-6.7.7.12a14900.dev1+dirty/src/tools/build_env/lib/python3.12/site-packages/wheel/__pycache__
07-Oct-2026 13:56:53 copying src/tools/build_env/lib/python3.12/site-packages/wheel/__pycache__/metadata.cpython-312.pyc -> casatools-6.7.7.12a14900.dev1+dirty/src/tools/build_env/lib/python3.12/site-packages/wheel/__pycache__
07-Oct-2026 13:56:53 copying src/tools/build_env/lib/python3.12/site-packages/wheel/__pycache__/wheelfile.cpython-312.pyc -> casatools-6.7.7.12a14900.dev1+dirty/src/tools/build_env/lib/python3.12/site-packages/wheel/__pycache__
07-Oct-2026 13:56:53 copying src/tools/build_env/lib/python3.12/site-packages/wheel/_commands/__init__.py -> casatools-6.7.7.12a14900.dev1+dirty/src/tools/build_env/lib/python3.12/site-packages/wheel/_commands
07-Oct-2026 13:56:53 copying src/tools/build_env/lib/python3.12/site-packages/wheel/_commands/convert.py -> casatools-6.7.7.12a14900.dev1+dirty/src/tools/build_env/lib/python3.12/site-packages/wheel/_commands
07-Oct-2026 13:56:53 copying src/tools/build_env/lib/python3.12/site-packages/wheel/_commands/info.py -> casatools-6.7.7.12a14900.dev1+dirty/src/tools/build_env/lib/python3.12/site-packages/wheel/_commands
07-Oct-2026 13:56:53 copying src/tools/build_env/lib/python3.12/site-packages/wheel/_commands/pack.py -> casatools-6.7.7.12a14900.dev1+dirty/src/tools/build_env/lib/python3.12/site-packages/wheel/_commands
07-Oct-2026 13:56:53 copying src/tools/build_env/lib/python3.12/site-packages/wheel/_commands/tags.py -> casatools-6.7.7.12a14900.dev1+dirty/src/tools/build_env/lib/python3.12/site-packages/wheel/_commands
07-Oct-2026 13:56:53 copying src/tools/build_env/lib/python3.12/site-packages/wheel/_commands/unpack.py -> casatools-6.7.7.12a14900.dev1+dirty/src/tools/build_env/lib/python3.12/site-packages/wheel/_commands
07-Oct-2026 13:56:53 copying src/tools/build_env/lib/python3.12/site-packages/wheel/_commands/__pycache__/__init__.cpython-312.pyc -> casatools-6.7.7.12a14900.dev1+dirty/src/tools/build_env/lib/python3.12/site-packages/wheel/_commands/__pycache__
07-Oct-2026 13:56:53 copying src/tools/build_env/lib/python3.12/site-packages/wheel/_commands/__pycache__/convert.cpython-312.pyc -> casatools-6.7.7.12a14900.dev1+dirty/src/tools/build_env/lib/python3.12/site-packages/wheel/_commands/__pycache__
07-Oct-2026 13:56:53 copying src/tools/build_env/lib/python3.12/site-packages/wheel/_commands/__pycache__/info.cpython-312.pyc -> casatools-6.7.7.12a14900.dev1+dirty/src/tools/build_env/lib/python3.12/site-packages/wheel/_commands/__pycache__
07-Oct-2026 13:56:53 copying src/tools/build_env/lib/python3.12/site-packages/wheel/_commands/__pycache__/pack.cpython-312.pyc -> casatools-6.7.7.12a14900.dev1+dirty/src/tools/build_env/lib/python3.12/site-packages/wheel/_commands/__pycache__
07-Oct-2026 13:56:53 copying src/tools/build_env/lib/python3.12/site-packages/wheel/_commands/__pycache__/tags.cpython-312.pyc -> casatools-6.7.7.12a14900.dev1+dirty/src/tools/build_env/lib/python3.12/site-packages/wheel/_commands/__pycache__
07-Oct-2026 13:56:53 copying src/tools/build_env/lib/python3.12/site-packages/wheel/_commands/__pycache__/unpack.cpython-312.pyc -> casatools-6.7.7.12a14900.dev1+dirty/src/tools/build_env/lib/python3.12/site-packages/wheel/_commands/__pycache__
07-Oct-2026 13:56:53 copying src/tools/calanalysis/calanalysis_cmpt.cc -> casatools-6.7.7.12a14900.dev1+dirty/src/tools/calanalysis
07-Oct-2026 13:56:53 copying src/tools/calanalysis/calanalysis_forward.h -> casatools-6.7.7.12a14900.dev1+dirty/src/tools/calanalysis
07-Oct-2026 13:56:53 copying src/tools/calanalysis/calanalysis_private.h -> casatools-6.7.7.12a14900.dev1+dirty/src/tools/calanalysis
07-Oct-2026 13:56:53 copying src/tools/calanalysis/calanalysis_template.h -> casatools-6.7.7.12a14900.dev1+dirty/src/tools/calanalysis
07-Oct-2026 13:56:53 copying src/tools/calibrater/calibrater_cmpt.cc -> casatools-6.7.7.12a14900.dev1+dirty/src/tools/calibrater
07-Oct-2026 13:56:53 copying src/tools/calibrater/calibrater_forward.h -> casatools-6.7.7.12a14900.dev1+dirty/src/tools/calibrater
07-Oct-2026 13:56:53 copying src/tools/calibrater/calibrater_private.h -> casatools-6.7.7.12a14900.dev1+dirty/src/tools/calibrater
07-Oct-2026 13:56:53 copying src/tools/componentlist/componentlist_cmpt.cc -> casatools-6.7.7.12a14900.dev1+dirty/src/tools/componentlist
07-Oct-2026 13:56:53 copying src/tools/componentlist/componentlist_forward.h -> casatools-6.7.7.12a14900.dev1+dirty/src/tools/componentlist
07-Oct-2026 13:56:53 copying src/tools/componentlist/componentlist_private.h -> casatools-6.7.7.12a14900.dev1+dirty/src/tools/componentlist
07-Oct-2026 13:56:53 copying src/tools/coordsys/coordsys_cmpt.cc -> casatools-6.7.7.12a14900.dev1+dirty/src/tools/coordsys
07-Oct-2026 13:56:53 copying src/tools/coordsys/coordsys_forward.h -> casatools-6.7.7.12a14900.dev1+dirty/src/tools/coordsys
07-Oct-2026 13:56:53 copying src/tools/coordsys/coordsys_private.h -> casatools-6.7.7.12a14900.dev1+dirty/src/tools/coordsys
07-Oct-2026 13:56:53 copying src/tools/functional/functional_cmpt.cc -> casatools-6.7.7.12a14900.dev1+dirty/src/tools/functional
07-Oct-2026 13:56:53 copying src/tools/functional/functional_forward.h -> casatools-6.7.7.12a14900.dev1+dirty/src/tools/functional
07-Oct-2026 13:56:53 copying src/tools/functional/functional_private.h -> casatools-6.7.7.12a14900.dev1+dirty/src/tools/functional
07-Oct-2026 13:56:53 copying src/tools/image/image_cmpt.cc -> casatools-6.7.7.12a14900.dev1+dirty/src/tools/image
07-Oct-2026 13:56:53 copying src/tools/image/image_fitsheader.cc -> casatools-6.7.7.12a14900.dev1+dirty/src/tools/image
07-Oct-2026 13:56:53 copying src/tools/image/image_forward.h -> casatools-6.7.7.12a14900.dev1+dirty/src/tools/image
07-Oct-2026 13:56:53 copying src/tools/image/image_private.h -> casatools-6.7.7.12a14900.dev1+dirty/src/tools/image
07-Oct-2026 13:56:53 copying src/tools/imagemetadata/imagemetadata_cmpt.cc -> casatools-6.7.7.12a14900.dev1+dirty/src/tools/imagemetadata
07-Oct-2026 13:56:53 copying src/tools/imagemetadata/imagemetadata_forward.h -> casatools-6.7.7.12a14900.dev1+dirty/src/tools/imagemetadata
07-Oct-2026 13:56:53 copying src/tools/imagemetadata/imagemetadata_private.h -> casatools-6.7.7.12a14900.dev1+dirty/src/tools/imagemetadata
07-Oct-2026 13:56:53 copying src/tools/imagepol/imagepol_cmpt.cc -> casatools-6.7.7.12a14900.dev1+dirty/src/tools/imagepol
07-Oct-2026 13:56:53 copying src/tools/imagepol/imagepol_forward.h -> casatools-6.7.7.12a14900.dev1+dirty/src/tools/imagepol
07-Oct-2026 13:56:53 copying src/tools/imagepol/imagepol_private.h -> casatools-6.7.7.12a14900.dev1+dirty/src/tools/imagepol
07-Oct-2026 13:56:53 copying src/tools/imager/imager_cmpt.cc -> casatools-6.7.7.12a14900.dev1+dirty/src/tools/imager
07-Oct-2026 13:56:53 copying src/tools/imager/imager_forward.h -> casatools-6.7.7.12a14900.dev1+dirty/src/tools/imager
07-Oct-2026 13:56:53 copying src/tools/imager/imager_private.h -> casatools-6.7.7.12a14900.dev1+dirty/src/tools/imager
07-Oct-2026 13:56:53 copying src/tools/iterbotsink/iterbotsink_cmpt.cc -> casatools-6.7.7.12a14900.dev1+dirty/src/tools/iterbotsink
07-Oct-2026 13:56:53 copying src/tools/iterbotsink/iterbotsink_forward.h -> casatools-6.7.7.12a14900.dev1+dirty/src/tools/iterbotsink
07-Oct-2026 13:56:53 copying src/tools/iterbotsink/iterbotsink_private.h -> casatools-6.7.7.12a14900.dev1+dirty/src/tools/iterbotsink
07-Oct-2026 13:56:53 copying src/tools/linearmosaic/linearmosaic_cmpt.cc -> casatools-6.7.7.12a14900.dev1+dirty/src/tools/linearmosaic
07-Oct-2026 13:56:53 copying src/tools/linearmosaic/linearmosaic_forward.h -> casatools-6.7.7.12a14900.dev1+dirty/src/tools/linearmosaic
07-Oct-2026 13:56:53 copying src/tools/linearmosaic/linearmosaic_private.h -> casatools-6.7.7.12a14900.dev1+dirty/src/tools/linearmosaic
07-Oct-2026 13:56:53 copying src/tools/logsink/logsink_cmpt.cc -> casatools-6.7.7.12a14900.dev1+dirty/src/tools/logsink
07-Oct-2026 13:56:53 copying src/tools/logsink/logsink_forward.h -> casatools-6.7.7.12a14900.dev1+dirty/src/tools/logsink
07-Oct-2026 13:56:53 copying src/tools/logsink/logsink_private.h -> casatools-6.7.7.12a14900.dev1+dirty/src/tools/logsink
07-Oct-2026 13:56:53 copying src/tools/measures/measures_cmpt.cc -> casatools-6.7.7.12a14900.dev1+dirty/src/tools/measures
07-Oct-2026 13:56:53 copying src/tools/measures/measures_forward.h -> casatools-6.7.7.12a14900.dev1+dirty/src/tools/measures
07-Oct-2026 13:56:53 copying src/tools/measures/measures_private.h -> casatools-6.7.7.12a14900.dev1+dirty/src/tools/measures
07-Oct-2026 13:56:53 copying src/tools/miriadfiller/miriadfiller_cmpt.cc -> casatools-6.7.7.12a14900.dev1+dirty/src/tools/miriadfiller
07-Oct-2026 13:56:53 copying src/tools/ms/ms_cmpt.cc -> casatools-6.7.7.12a14900.dev1+dirty/src/tools/ms
07-Oct-2026 13:56:53 copying src/tools/ms/ms_forward.h -> casatools-6.7.7.12a14900.dev1+dirty/src/tools/ms
07-Oct-2026 13:56:53 copying src/tools/ms/ms_private.h -> casatools-6.7.7.12a14900.dev1+dirty/src/tools/ms
07-Oct-2026 13:56:53 copying src/tools/msmetadata/msmetadata_cmpt.cc -> casatools-6.7.7.12a14900.dev1+dirty/src/tools/msmetadata
07-Oct-2026 13:56:53 copying src/tools/msmetadata/msmetadata_forward.h -> casatools-6.7.7.12a14900.dev1+dirty/src/tools/msmetadata
07-Oct-2026 13:56:53 copying src/tools/msmetadata/msmetadata_private.h -> casatools-6.7.7.12a14900.dev1+dirty/src/tools/msmetadata
07-Oct-2026 13:56:53 copying src/tools/mstransformer/mstransformer_cmpt.cc -> casatools-6.7.7.12a14900.dev1+dirty/src/tools/mstransformer
07-Oct-2026 13:56:53 copying src/tools/mstransformer/mstransformer_forward.h -> casatools-6.7.7.12a14900.dev1+dirty/src/tools/mstransformer
07-Oct-2026 13:56:53 copying src/tools/mstransformer/mstransformer_private.h -> casatools-6.7.7.12a14900.dev1+dirty/src/tools/mstransformer
07-Oct-2026 13:56:53 copying src/tools/msuvbinner/msuvbinner_cmpt.cc -> casatools-6.7.7.12a14900.dev1+dirty/src/tools/msuvbinner
07-Oct-2026 13:56:53 copying src/tools/msuvbinner/msuvbinner_forward.h -> casatools-6.7.7.12a14900.dev1+dirty/src/tools/msuvbinner
07-Oct-2026 13:56:53 copying src/tools/msuvbinner/msuvbinner_private.h -> casatools-6.7.7.12a14900.dev1+dirty/src/tools/msuvbinner
07-Oct-2026 13:56:53 copying src/tools/quanta/quanta_cmpt.cc -> casatools-6.7.7.12a14900.dev1+dirty/src/tools/quanta
07-Oct-2026 13:56:53 copying src/tools/quanta/quanta_forward.h -> casatools-6.7.7.12a14900.dev1+dirty/src/tools/quanta
07-Oct-2026 13:56:53 copying src/tools/quanta/quanta_private.h -> casatools-6.7.7.12a14900.dev1+dirty/src/tools/quanta
07-Oct-2026 13:56:53 copying src/tools/regionmanager/regionmanager_cmpt.cc -> casatools-6.7.7.12a14900.dev1+dirty/src/tools/regionmanager
07-Oct-2026 13:56:53 copying src/tools/regionmanager/regionmanager_forward.h -> casatools-6.7.7.12a14900.dev1+dirty/src/tools/regionmanager
07-Oct-2026 13:56:53 copying src/tools/regionmanager/regionmanager_private.h -> casatools-6.7.7.12a14900.dev1+dirty/src/tools/regionmanager
07-Oct-2026 13:56:53 copying src/tools/sakura/sakura_cmpt.cc -> casatools-6.7.7.12a14900.dev1+dirty/src/tools/sakura
07-Oct-2026 13:56:53 copying src/tools/sakura/sakura_forward.h -> casatools-6.7.7.12a14900.dev1+dirty/src/tools/sakura
07-Oct-2026 13:56:53 copying src/tools/sakura/sakura_private.h -> casatools-6.7.7.12a14900.dev1+dirty/src/tools/sakura
07-Oct-2026 13:56:53 copying src/tools/sdm/ASDM2MSException.h -> casatools-6.7.7.12a14900.dev1+dirty/src/tools/sdm
07-Oct-2026 13:56:53 copying src/tools/sdm/ASDM2MSFiller.cc -> casatools-6.7.7.12a14900.dev1+dirty/src/tools/sdm
07-Oct-2026 13:56:53 copying src/tools/sdm/ASDM2MSFiller.h -> casatools-6.7.7.12a14900.dev1+dirty/src/tools/sdm
07-Oct-2026 13:56:53 copying src/tools/sdm/ASDMTableBase.cc -> casatools-6.7.7.12a14900.dev1+dirty/src/tools/sdm
07-Oct-2026 13:56:53 copying src/tools/sdm/ASDMTableBase.h -> casatools-6.7.7.12a14900.dev1+dirty/src/tools/sdm
07-Oct-2026 13:56:53 copying src/tools/sdm/ASDMTables.cc -> casatools-6.7.7.12a14900.dev1+dirty/src/tools/sdm
07-Oct-2026 13:56:53 copying src/tools/sdm/ASDMTables.h -> casatools-6.7.7.12a14900.dev1+dirty/src/tools/sdm
07-Oct-2026 13:56:53 copying src/tools/sdm/ASDMVerbatimFiller.cc -> casatools-6.7.7.12a14900.dev1+dirty/src/tools/sdm
07-Oct-2026 13:56:53 copying src/tools/sdm/ASDMVerbatimFiller.h -> casatools-6.7.7.12a14900.dev1+dirty/src/tools/sdm
07-Oct-2026 13:56:53 copying src/tools/sdm/BDF2AsdmStManIndex.cc -> casatools-6.7.7.12a14900.dev1+dirty/src/tools/sdm
07-Oct-2026 13:56:53 copying src/tools/sdm/BDF2AsdmStManIndex.h -> casatools-6.7.7.12a14900.dev1+dirty/src/tools/sdm
07-Oct-2026 13:56:53 copying src/tools/sdm/BdFlagger.inc -> casatools-6.7.7.12a14900.dev1+dirty/src/tools/sdm
07-Oct-2026 13:56:53 copying src/tools/sdm/Name2Table.cc -> casatools-6.7.7.12a14900.dev1+dirty/src/tools/sdm
07-Oct-2026 13:56:53 copying src/tools/sdm/Name2Table.h -> casatools-6.7.7.12a14900.dev1+dirty/src/tools/sdm
07-Oct-2026 13:56:53 copying src/tools/sdm/SDMMSTooLargeException.h -> casatools-6.7.7.12a14900.dev1+dirty/src/tools/sdm
07-Oct-2026 13:56:53 copying src/tools/sdm/ScansParser.cc -> casatools-6.7.7.12a14900.dev1+dirty/src/tools/sdm
07-Oct-2026 13:56:53 copying src/tools/sdm/ScansParser.h -> casatools-6.7.7.12a14900.dev1+dirty/src/tools/sdm
07-Oct-2026 13:56:53 copying src/tools/sdm/UvwCoords.cc -> casatools-6.7.7.12a14900.dev1+dirty/src/tools/sdm
07-Oct-2026 13:56:53 copying src/tools/sdm/UvwCoords.h -> casatools-6.7.7.12a14900.dev1+dirty/src/tools/sdm
07-Oct-2026 13:56:53 copying src/tools/sdm/asdm2MSGeneric.h -> casatools-6.7.7.12a14900.dev1+dirty/src/tools/sdm
07-Oct-2026 13:56:53 copying src/tools/sdm/sdm_cmpt.cc -> casatools-6.7.7.12a14900.dev1+dirty/src/tools/sdm
07-Oct-2026 13:56:53 copying src/tools/sdm/sdm_forward.h -> casatools-6.7.7.12a14900.dev1+dirty/src/tools/sdm
07-Oct-2026 13:56:53 copying src/tools/sdm/sdm_private.h -> casatools-6.7.7.12a14900.dev1+dirty/src/tools/sdm
07-Oct-2026 13:56:53 copying src/tools/sidebandseparator/sidebandseparator_cmpt.cc -> casatools-6.7.7.12a14900.dev1+dirty/src/tools/sidebandseparator
07-Oct-2026 13:56:53 copying src/tools/sidebandseparator/sidebandseparator_forward.h -> casatools-6.7.7.12a14900.dev1+dirty/src/tools/sidebandseparator
07-Oct-2026 13:56:53 copying src/tools/sidebandseparator/sidebandseparator_private.h -> casatools-6.7.7.12a14900.dev1+dirty/src/tools/sidebandseparator
07-Oct-2026 13:56:53 copying src/tools/simulator/simulator_cmpt.cc -> casatools-6.7.7.12a14900.dev1+dirty/src/tools/simulator
07-Oct-2026 13:56:53 copying src/tools/simulator/simulator_forward.h -> casatools-6.7.7.12a14900.dev1+dirty/src/tools/simulator
07-Oct-2026 13:56:53 copying src/tools/simulator/simulator_private.h -> casatools-6.7.7.12a14900.dev1+dirty/src/tools/simulator
07-Oct-2026 13:56:53 copying src/tools/singledishms/singledishms_cmpt.cc -> casatools-6.7.7.12a14900.dev1+dirty/src/tools/singledishms
07-Oct-2026 13:56:53 copying src/tools/singledishms/singledishms_forward.h -> casatools-6.7.7.12a14900.dev1+dirty/src/tools/singledishms
07-Oct-2026 13:56:53 copying src/tools/singledishms/singledishms_private.h -> casatools-6.7.7.12a14900.dev1+dirty/src/tools/singledishms
07-Oct-2026 13:56:53 copying src/tools/spectralline/spectralline_cmpt.cc -> casatools-6.7.7.12a14900.dev1+dirty/src/tools/spectralline
07-Oct-2026 13:56:53 copying src/tools/spectralline/spectralline_forward.h -> casatools-6.7.7.12a14900.dev1+dirty/src/tools/spectralline
07-Oct-2026 13:56:53 copying src/tools/spectralline/spectralline_private.h -> casatools-6.7.7.12a14900.dev1+dirty/src/tools/spectralline
07-Oct-2026 13:56:53 copying src/tools/synthesisdeconvolver/synthesisdeconvolver_cmpt.cc -> casatools-6.7.7.12a14900.dev1+dirty/src/tools/synthesisdeconvolver
07-Oct-2026 13:56:53 copying src/tools/synthesisdeconvolver/synthesisdeconvolver_forward.h -> casatools-6.7.7.12a14900.dev1+dirty/src/tools/synthesisdeconvolver
07-Oct-2026 13:56:53 copying src/tools/synthesisdeconvolver/synthesisdeconvolver_private.h -> casatools-6.7.7.12a14900.dev1+dirty/src/tools/synthesisdeconvolver
07-Oct-2026 13:56:53 copying src/tools/synthesisimager/synthesisimager_cmpt.cc -> casatools-6.7.7.12a14900.dev1+dirty/src/tools/synthesisimager
07-Oct-2026 13:56:53 copying src/tools/synthesisimager/synthesisimager_forward.h -> casatools-6.7.7.12a14900.dev1+dirty/src/tools/synthesisimager
07-Oct-2026 13:56:53 copying src/tools/synthesisimager/synthesisimager_private.h -> casatools-6.7.7.12a14900.dev1+dirty/src/tools/synthesisimager
07-Oct-2026 13:56:53 copying src/tools/synthesisimstore/synthesisimstore_cmpt.cc -> casatools-6.7.7.12a14900.dev1+dirty/src/tools/synthesisimstore
07-Oct-2026 13:56:53 copying src/tools/synthesisimstore/synthesisimstore_forward.h -> casatools-6.7.7.12a14900.dev1+dirty/src/tools/synthesisimstore
07-Oct-2026 13:56:53 copying src/tools/synthesisimstore/synthesisimstore_private.h -> casatools-6.7.7.12a14900.dev1+dirty/src/tools/synthesisimstore
07-Oct-2026 13:56:53 copying src/tools/synthesismaskhandler/synthesismaskhandler_cmpt.cc -> casatools-6.7.7.12a14900.dev1+dirty/src/tools/synthesismaskhandler
07-Oct-2026 13:56:53 copying src/tools/synthesismaskhandler/synthesismaskhandler_forward.h -> casatools-6.7.7.12a14900.dev1+dirty/src/tools/synthesismaskhandler
07-Oct-2026 13:56:53 copying src/tools/synthesismaskhandler/synthesismaskhandler_private.h -> casatools-6.7.7.12a14900.dev1+dirty/src/tools/synthesismaskhandler
07-Oct-2026 13:56:53 copying src/tools/synthesisnormalizer/synthesisnormalizer_cmpt.cc -> casatools-6.7.7.12a14900.dev1+dirty/src/tools/synthesisnormalizer
07-Oct-2026 13:56:53 copying src/tools/synthesisnormalizer/synthesisnormalizer_forward.h -> casatools-6.7.7.12a14900.dev1+dirty/src/tools/synthesisnormalizer
07-Oct-2026 13:56:53 copying src/tools/synthesisnormalizer/synthesisnormalizer_private.h -> casatools-6.7.7.12a14900.dev1+dirty/src/tools/synthesisnormalizer
07-Oct-2026 13:56:53 copying src/tools/synthesisutils/synthesisutils_cmpt.cc -> casatools-6.7.7.12a14900.dev1+dirty/src/tools/synthesisutils
07-Oct-2026 13:56:53 copying src/tools/synthesisutils/synthesisutils_forward.h -> casatools-6.7.7.12a14900.dev1+dirty/src/tools/synthesisutils
07-Oct-2026 13:56:53 copying src/tools/synthesisutils/synthesisutils_private.h -> casatools-6.7.7.12a14900.dev1+dirty/src/tools/synthesisutils
07-Oct-2026 13:56:53 copying src/tools/table/asdmCasaSaxHandler.cc -> casatools-6.7.7.12a14900.dev1+dirty/src/tools/table
07-Oct-2026 13:56:53 copying src/tools/table/asdmCasaSaxHandler.h -> casatools-6.7.7.12a14900.dev1+dirty/src/tools/table
07-Oct-2026 13:56:53 copying src/tools/table/asdmCasaXMLUtil.cc -> casatools-6.7.7.12a14900.dev1+dirty/src/tools/table
07-Oct-2026 13:56:53 copying src/tools/table/asdmCasaXMLUtil.h -> casatools-6.7.7.12a14900.dev1+dirty/src/tools/table
07-Oct-2026 13:56:53 copying src/tools/table/table_cmpt.cc -> casatools-6.7.7.12a14900.dev1+dirty/src/tools/table
07-Oct-2026 13:56:53 copying src/tools/table/table_forward.h -> casatools-6.7.7.12a14900.dev1+dirty/src/tools/table
07-Oct-2026 13:56:53 copying src/tools/table/table_getcoliter.cc -> casatools-6.7.7.12a14900.dev1+dirty/src/tools/table
07-Oct-2026 13:56:53 copying src/tools/table/table_private.h -> casatools-6.7.7.12a14900.dev1+dirty/src/tools/table
07-Oct-2026 13:56:53 copying src/tools/tablerow/tablerow_cmpt.cc -> casatools-6.7.7.12a14900.dev1+dirty/src/tools/tablerow
07-Oct-2026 13:56:53 copying src/tools/tablerow/tablerow_forward.h -> casatools-6.7.7.12a14900.dev1+dirty/src/tools/tablerow
07-Oct-2026 13:56:53 copying src/tools/tablerow/tablerow_private.h -> casatools-6.7.7.12a14900.dev1+dirty/src/tools/tablerow
07-Oct-2026 13:56:53 copying src/tools/utils/BaseInterface.cc -> casatools-6.7.7.12a14900.dev1+dirty/src/tools/utils
07-Oct-2026 13:56:53 copying src/tools/utils/BaseInterface.h -> casatools-6.7.7.12a14900.dev1+dirty/src/tools/utils
07-Oct-2026 13:56:53 copying src/tools/utils/stdBaseInterface.cc -> casatools-6.7.7.12a14900.dev1+dirty/src/tools/utils
07-Oct-2026 13:56:53 copying src/tools/utils/stdBaseInterface.h -> casatools-6.7.7.12a14900.dev1+dirty/src/tools/utils
07-Oct-2026 13:56:53 copying src/tools/utils/utils_cmpt.cc -> casatools-6.7.7.12a14900.dev1+dirty/src/tools/utils
07-Oct-2026 13:56:53 copying src/tools/utils/utils_forward.h -> casatools-6.7.7.12a14900.dev1+dirty/src/tools/utils
07-Oct-2026 13:56:53 copying src/tools/utils/utils_private.h -> casatools-6.7.7.12a14900.dev1+dirty/src/tools/utils
07-Oct-2026 13:56:53 copying src/tools/vlafiller/vlafiller_cmpt.cc -> casatools-6.7.7.12a14900.dev1+dirty/src/tools/vlafiller
07-Oct-2026 13:56:53 copying src/tools/vpmanager/vpmanager_cmpt.cc -> casatools-6.7.7.12a14900.dev1+dirty/src/tools/vpmanager
07-Oct-2026 13:56:53 copying src/tools/vpmanager/vpmanager_forward.h -> casatools-6.7.7.12a14900.dev1+dirty/src/tools/vpmanager
07-Oct-2026 13:56:53 copying src/tools/vpmanager/vpmanager_private.h -> casatools-6.7.7.12a14900.dev1+dirty/src/tools/vpmanager
07-Oct-2026 13:56:53 copying src/tools/wvr/wvr_cmpt.cc -> casatools-6.7.7.12a14900.dev1+dirty/src/tools/wvr
07-Oct-2026 13:56:53 copying src/tools/wvr/wvr_forward.h -> casatools-6.7.7.12a14900.dev1+dirty/src/tools/wvr
07-Oct-2026 13:56:53 copying src/tools/wvr/wvr_private.h -> casatools-6.7.7.12a14900.dev1+dirty/src/tools/wvr
07-Oct-2026 13:56:53 copying src/tools/wvr/wvrgcalargs.h -> casatools-6.7.7.12a14900.dev1+dirty/src/tools/wvr
07-Oct-2026 13:56:53 copying src/tools/wvr/wvrgcalerrors.cc -> casatools-6.7.7.12a14900.dev1+dirty/src/tools/wvr
07-Oct-2026 13:56:53 copying src/tools/wvr/wvrgcalerrors.h -> casatools-6.7.7.12a14900.dev1+dirty/src/tools/wvr
07-Oct-2026 13:56:53 copying src/tools/wvr/wvrgcalfeedback.cc -> casatools-6.7.7.12a14900.dev1+dirty/src/tools/wvr
07-Oct-2026 13:56:53 copying src/tools/wvr/wvrgcalfeedback.h -> casatools-6.7.7.12a14900.dev1+dirty/src/tools/wvr
07-Oct-2026 13:56:53 copying xml/agentflagger.xml -> casatools-6.7.7.12a14900.dev1+dirty/xml
07-Oct-2026 13:56:53 copying xml/atcafiller.xml -> casatools-6.7.7.12a14900.dev1+dirty/xml
07-Oct-2026 13:56:53 copying xml/atmosphere.xml -> casatools-6.7.7.12a14900.dev1+dirty/xml
07-Oct-2026 13:56:53 copying xml/calanalysis.xml -> casatools-6.7.7.12a14900.dev1+dirty/xml
07-Oct-2026 13:56:53 copying xml/calibrater.xml -> casatools-6.7.7.12a14900.dev1+dirty/xml
07-Oct-2026 13:56:53 copying xml/componentlist.xml -> casatools-6.7.7.12a14900.dev1+dirty/xml
07-Oct-2026 13:56:53 copying xml/coordsys.xml -> casatools-6.7.7.12a14900.dev1+dirty/xml
07-Oct-2026 13:56:53 copying xml/functional.xml -> casatools-6.7.7.12a14900.dev1+dirty/xml
07-Oct-2026 13:56:53 copying xml/image.xml -> casatools-6.7.7.12a14900.dev1+dirty/xml
07-Oct-2026 13:56:53 copying xml/imagemetadata.xml -> casatools-6.7.7.12a14900.dev1+dirty/xml
07-Oct-2026 13:56:53 copying xml/imagepol.xml -> casatools-6.7.7.12a14900.dev1+dirty/xml
07-Oct-2026 13:56:53 copying xml/imager.xml -> casatools-6.7.7.12a14900.dev1+dirty/xml
07-Oct-2026 13:56:53 copying xml/iterbotsink.xml -> casatools-6.7.7.12a14900.dev1+dirty/xml
07-Oct-2026 13:57:45 copying xml/linearmosaic.xml -> casatools-6.7.7.12a14900.dev1+dirty/xml
07-Oct-2026 13:57:45 copying xml/logsink.xml -> casatools-6.7.7.12a14900.dev1+dirty/xml
07-Oct-2026 13:57:45 copying xml/measures.xml -> casatools-6.7.7.12a14900.dev1+dirty/xml
07-Oct-2026 13:57:45 copying xml/miriadfiller.xml -> casatools-6.7.7.12a14900.dev1+dirty/xml
07-Oct-2026 13:57:45 copying xml/ms.xml -> casatools-6.7.7.12a14900.dev1+dirty/xml
07-Oct-2026 13:57:45 copying xml/msmetadata.xml -> casatools-6.7.7.12a14900.dev1+dirty/xml
07-Oct-2026 13:57:45 copying xml/mstransformer.xml -> casatools-6.7.7.12a14900.dev1+dirty/xml
07-Oct-2026 13:57:45 copying xml/msuvbinner.xml -> casatools-6.7.7.12a14900.dev1+dirty/xml
07-Oct-2026 13:57:45 copying xml/quanta.xml -> casatools-6.7.7.12a14900.dev1+dirty/xml
07-Oct-2026 13:57:45 copying xml/regionmanager.xml -> casatools-6.7.7.12a14900.dev1+dirty/xml
07-Oct-2026 13:57:45 copying xml/sakura.xml -> casatools-6.7.7.12a14900.dev1+dirty/xml
07-Oct-2026 13:57:45 copying xml/sdm.xml -> casatools-6.7.7.12a14900.dev1+dirty/xml
07-Oct-2026 13:57:45 copying xml/sidebandseparator.xml -> casatools-6.7.7.12a14900.dev1+dirty/xml
07-Oct-2026 13:57:45 copying xml/simulator.xml -> casatools-6.7.7.12a14900.dev1+dirty/xml
07-Oct-2026 13:57:45 copying xml/singledishms.xml -> casatools-6.7.7.12a14900.dev1+dirty/xml
07-Oct-2026 13:57:45 copying xml/spectralline.xml -> casatools-6.7.7.12a14900.dev1+dirty/xml
07-Oct-2026 13:57:45 copying xml/synthesisdeconvolver.xml -> casatools-6.7.7.12a14900.dev1+dirty/xml
07-Oct-2026 13:57:45 copying xml/synthesisimager.xml -> casatools-6.7.7.12a14900.dev1+dirty/xml
07-Oct-2026 13:57:45 copying xml/synthesisimstore.xml -> casatools-6.7.7.12a14900.dev1+dirty/xml
07-Oct-2026 13:57:45 copying xml/synthesismaskhandler.xml -> casatools-6.7.7.12a14900.dev1+dirty/xml
07-Oct-2026 13:57:45 copying xml/synthesisnormalizer.xml -> casatools-6.7.7.12a14900.dev1+dirty/xml
07-Oct-2026 13:57:45 copying xml/synthesisutils.xml -> casatools-6.7.7.12a14900.dev1+dirty/xml
07-Oct-2026 13:57:45 copying xml/table.xml -> casatools-6.7.7.12a14900.dev1+dirty/xml
07-Oct-2026 13:57:45 copying xml/tablerow.xml -> casatools-6.7.7.12a14900.dev1+dirty/xml
07-Oct-2026 13:57:45 copying xml/utils.xml -> casatools-6.7.7.12a14900.dev1+dirty/xml
07-Oct-2026 13:57:45 copying xml/vlafiller.xml -> casatools-6.7.7.12a14900.dev1+dirty/xml
07-Oct-2026 13:57:45 copying xml/vpmanager.xml -> casatools-6.7.7.12a14900.dev1+dirty/xml
07-Oct-2026 13:57:45 copying xml/wvr.xml -> casatools-6.7.7.12a14900.dev1+dirty/xml
07-Oct-2026 13:57:45 Writing casatools-6.7.7.12a14900.dev1+dirty/setup.cfg
07-Oct-2026 13:57:45 Creating tar archive
07-Oct-2026 13:57:45 removing 'casatools-6.7.7.12a14900.dev1+dirty' (and everything under it)
07-Oct-2026 13:57:45 WARNING License classifiers are deprecated.
07-Oct-2026 13:57:45 !!
07-Oct-2026 13:57:45
07-Oct-2026 13:57:45 ********************************************************************************
07-Oct-2026 13:57:45 Please consider removing the following classifiers in favor of a SPDX license expression:
07-Oct-2026 13:57:45
07-Oct-2026 13:57:45 License :: OSI Approved :: GNU Library or Lesser General Public License (LGPL)
07-Oct-2026 13:57:45
07-Oct-2026 13:57:45 See https://packaging.python.org/en/latest/guides/writing-pyproject-toml/#license for details.
07-Oct-2026 13:57:45 ********************************************************************************
07-Oct-2026 13:57:45
07-Oct-2026 13:57:45 !!
07-Oct-2026 13:57:45 WARNING Cannot find any files for the given pattern.
07-Oct-2026 13:57:45 !!
07-Oct-2026 13:57:45
07-Oct-2026 13:57:45 ********************************************************************************
07-Oct-2026 13:57:45 Pattern 'LICENSE.txt' did not match any files.
07-Oct-2026 13:57:45
07-Oct-2026 13:57:45 By 2027-Feb-18, you need to update your project and remove deprecated calls
07-Oct-2026 13:57:45 or your builds will no longer be supported.
07-Oct-2026 13:57:45 ********************************************************************************
07-Oct-2026 13:57:45
07-Oct-2026 13:57:45 !!
07-Oct-2026 13:57:45 * Building wheel from sdist
07-Oct-2026 13:57:45 * Getting build dependencies for wheel...
07-Oct-2026 13:57:45 running egg_info
07-Oct-2026 13:57:45 writing casatools.egg-info/PKG-INFO
07-Oct-2026 13:57:45 writing dependency_links to casatools.egg-info/dependency_links.txt
07-Oct-2026 13:57:45 writing requirements to casatools.egg-info/requires.txt
07-Oct-2026 13:57:45 writing top-level names to casatools.egg-info/top_level.txt
07-Oct-2026 13:57:45 reading manifest file 'casatools.egg-info/SOURCES.txt'
07-Oct-2026 13:57:45 reading manifest template 'MANIFEST.in'
07-Oct-2026 13:57:45 writing manifest file 'casatools.egg-info/SOURCES.txt'
07-Oct-2026 13:57:45 WARNING License classifiers are deprecated.
07-Oct-2026 13:57:45 !!
07-Oct-2026 13:57:45
07-Oct-2026 13:57:45 ********************************************************************************
07-Oct-2026 13:57:45 Please consider removing the following classifiers in favor of a SPDX license expression:
07-Oct-2026 13:57:45
07-Oct-2026 13:57:45 License :: OSI Approved :: GNU Library or Lesser General Public License (LGPL)
07-Oct-2026 13:57:45
07-Oct-2026 13:57:45 See https://packaging.python.org/en/latest/guides/writing-pyproject-toml/#license for details.
07-Oct-2026 13:57:45 ********************************************************************************
07-Oct-2026 13:57:45
07-Oct-2026 13:57:45 !!
07-Oct-2026 13:57:45 WARNING Cannot find any files for the given pattern.
07-Oct-2026 13:57:45 !!
07-Oct-2026 13:57:45
07-Oct-2026 13:57:45 ********************************************************************************
07-Oct-2026 13:57:45 Pattern 'LICENSE.txt' did not match any files.
07-Oct-2026 13:57:45
07-Oct-2026 13:58:02 By 2027-Feb-18, you need to update your project and remove deprecated calls
07-Oct-2026 13:58:02 or your builds will no longer be supported.
07-Oct-2026 13:58:02 ********************************************************************************
07-Oct-2026 13:58:02
07-Oct-2026 13:58:02 !!
07-Oct-2026 13:58:02 * Building wheel...
07-Oct-2026 13:58:02 Latest commit doesn't have a tag. Adding -dirty flag to version string.
07-Oct-2026 13:58:02 casatools version:  6.7.7.12a14900.dev1+dirty
07-Oct-2026 13:58:02 running bdist_wheel
07-Oct-2026 13:58:02 running build
07-Oct-2026 13:58:02 running build_py
07-Oct-2026 13:58:02 creating build/lib.linux-x86_64-cpython-312/casatools
07-Oct-2026 13:58:02 copying src/casatools/errors.py -> build/lib.linux-x86_64-cpython-312/casatools
07-Oct-2026 13:58:02 copying src/casatools/__init__.py -> build/lib.linux-x86_64-cpython-312/casatools
07-Oct-2026 13:58:02 copying src/casatools/coercetype.py -> build/lib.linux-x86_64-cpython-312/casatools
07-Oct-2026 13:58:02 copying src/casatools/constants.py -> build/lib.linux-x86_64-cpython-312/casatools
07-Oct-2026 13:58:02 copying src/casatools/platform.py -> build/lib.linux-x86_64-cpython-312/casatools
07-Oct-2026 13:58:02 creating build/lib.linux-x86_64-cpython-312/casatools/__cerberus__
07-Oct-2026 13:58:02 copying src/casa_cerberus/errors.py -> build/lib.linux-x86_64-cpython-312/casatools/__cerberus__
07-Oct-2026 13:58:02 copying src/casa_cerberus/validator.py -> build/lib.linux-x86_64-cpython-312/casatools/__cerberus__
07-Oct-2026 13:58:02 copying src/casa_cerberus/__init__.py -> build/lib.linux-x86_64-cpython-312/casatools/__cerberus__
07-Oct-2026 13:58:02 copying src/casa_cerberus/schema.py -> build/lib.linux-x86_64-cpython-312/casatools/__cerberus__
07-Oct-2026 13:58:02 copying src/casa_cerberus/utils.py -> build/lib.linux-x86_64-cpython-312/casatools/__cerberus__
07-Oct-2026 13:58:02 copying src/casa_cerberus/platform.py -> build/lib.linux-x86_64-cpython-312/casatools/__cerberus__
07-Oct-2026 13:58:02 running build_ext
07-Oct-2026 13:58:02 -- The CXX compiler identification is GNU 11.2.1
07-Oct-2026 13:58:02 -- Detecting CXX compiler ABI info
07-Oct-2026 13:58:02 -- Detecting CXX compiler ABI info - done
07-Oct-2026 13:58:02 -- Check for working CXX compiler: /usr/lib64/ccache/c++ - skipped
07-Oct-2026 13:58:02 -- Detecting CXX compile features
07-Oct-2026 13:58:02 -- Detecting CXX compile features - done
07-Oct-2026 13:58:02 -- Found PkgConfig: /usr/bin/pkg-config (found version "1.4.2")
07-Oct-2026 13:58:02 -- CMAKE_CXX_STANDARD 17
07-Oct-2026 13:58:02 -- CMAKE_CXX_FLAGS  -std=c++17
07-Oct-2026 13:58:02 -- Found Python3: /usr/local/include/python3.12 (found version "3.12.1") found components: Development NumPy Interpreter Development.Module Development.Embed
07-Oct-2026 13:58:02 -- Found SWIG: /usr/bin/swig (found version "3.0.12") found components: python
07-Oct-2026 13:58:02 -- Checking for module 'xerces-c'
07-Oct-2026 13:58:02 --   Found xerces-c, version 3.2.5
07-Oct-2026 13:58:02 -- Checking for module 'casacpp'
07-Oct-2026 13:58:02 --   Package 'casacpp', required by 'virtual:world', not found
07-Oct-2026 13:58:02 CMake Error at /usr/share/cmake/Modules/FindPkgConfig.cmake:607 (message):
07-Oct-2026 13:58:02 A required package was not found
07-Oct-2026 13:58:02 Call Stack (most recent call first):
07-Oct-2026 13:58:02 /usr/share/cmake/Modules/FindPkgConfig.cmake:829 (_pkg_check_modules_internal)
07-Oct-2026 13:58:02 CMakeLists.txt:79 (pkg_check_modules)
07-Oct-2026 13:58:02
07-Oct-2026 13:58:02
07-Oct-2026 13:58:02 -- Configuring incomplete, errors occurred!
07-Oct-2026 13:58:02 Generating bindings from XML /tmp/build-via-sdist-jv61io3q/casatools-6.7.7.12a14900.dev1+dirty/scripts/java/xml-casa-assembly-1.89.jar
07-Oct-2026 13:58:02
07-Oct-2026 13:58:02 * Found destination dir for SWIG generated tool modules / .py files: build/lib.linux-x86_64-cpython-312/casatools
07-Oct-2026 13:58:02 * Copying SWIG generated files for every tool module into build/lib.linux-x86_64-cpython-312/casatools...
07-Oct-2026 13:58:02 Copying file src/casatools/iterbotsink.py -> build/lib.linux-x86_64-cpython-312/casatools
07-Oct-2026 13:58:02 Copying file src/casatools/sdm.py -> build/lib.linux-x86_64-cpython-312/casatools
07-Oct-2026 13:58:02 Copying file src/casatools/vlafiller.py -> build/lib.linux-x86_64-cpython-312/casatools
07-Oct-2026 13:58:02 Copying file src/casatools/synthesisutils.py -> build/lib.linux-x86_64-cpython-312/casatools
07-Oct-2026 13:58:02 Copying file src/casatools/msuvbinner.py -> build/lib.linux-x86_64-cpython-312/casatools
07-Oct-2026 13:58:02 Copying file src/casatools/synthesisdeconvolver.py -> build/lib.linux-x86_64-cpython-312/casatools
07-Oct-2026 13:58:02 Copying file src/casatools/errors.py -> build/lib.linux-x86_64-cpython-312/casatools
07-Oct-2026 13:58:02 Copying file src/casatools/msmetadata.py -> build/lib.linux-x86_64-cpython-312/casatools
07-Oct-2026 13:58:02 Copying file src/casatools/synthesisnormalizer.py -> build/lib.linux-x86_64-cpython-312/casatools
07-Oct-2026 13:58:02 Copying file src/casatools/sakura.py -> build/lib.linux-x86_64-cpython-312/casatools
07-Oct-2026 13:58:02 Copying file src/casatools/wvr.py -> build/lib.linux-x86_64-cpython-312/casatools
07-Oct-2026 13:58:02 Copying file src/casatools/calanalysis.py -> build/lib.linux-x86_64-cpython-312/casatools
07-Oct-2026 13:58:02 Copying file src/casatools/singledishms.py -> build/lib.linux-x86_64-cpython-312/casatools
07-Oct-2026 13:58:02 Copying file src/casatools/atcafiller.py -> build/lib.linux-x86_64-cpython-312/casatools
07-Oct-2026 13:58:02 Copying file src/casatools/calibrater.py -> build/lib.linux-x86_64-cpython-312/casatools
07-Oct-2026 13:58:02 Copying file src/casatools/functional.py -> build/lib.linux-x86_64-cpython-312/casatools
07-Oct-2026 13:58:02 Copying file src/casatools/vpmanager.py -> build/lib.linux-x86_64-cpython-312/casatools
07-Oct-2026 13:58:02 Copying file src/casatools/linearmosaic.py -> build/lib.linux-x86_64-cpython-312/casatools
07-Oct-2026 13:58:02 Copying file src/casatools/measures.py -> build/lib.linux-x86_64-cpython-312/casatools
07-Oct-2026 13:58:02 Copying file src/casatools/__init__.py -> build/lib.linux-x86_64-cpython-312/casatools
07-Oct-2026 13:58:02 Copying file src/casatools/synthesisimstore.py -> build/lib.linux-x86_64-cpython-312/casatools
07-Oct-2026 13:58:02 Copying file src/casatools/simulator.py -> build/lib.linux-x86_64-cpython-312/casatools
07-Oct-2026 13:58:02 Copying file src/casatools/imagepol.py -> build/lib.linux-x86_64-cpython-312/casatools
07-Oct-2026 13:58:02 Copying file src/casatools/imagemetadata.py -> build/lib.linux-x86_64-cpython-312/casatools
07-Oct-2026 13:58:02 Copying file src/casatools/synthesisimager.py -> build/lib.linux-x86_64-cpython-312/casatools
07-Oct-2026 13:58:02 Copying file src/casatools/image.py -> build/lib.linux-x86_64-cpython-312/casatools
07-Oct-2026 13:58:02 Copying file src/casatools/tablerow.py -> build/lib.linux-x86_64-cpython-312/casatools
07-Oct-2026 13:58:02 Copying file src/casatools/atmosphere.py -> build/lib.linux-x86_64-cpython-312/casatools
07-Oct-2026 13:58:02 Copying file src/casatools/coercetype.py -> build/lib.linux-x86_64-cpython-312/casatools
07-Oct-2026 13:58:02 Copying file src/casatools/mstransformer.py -> build/lib.linux-x86_64-cpython-312/casatools
07-Oct-2026 13:58:02 Copying file src/casatools/componentlist.py -> build/lib.linux-x86_64-cpython-312/casatools
07-Oct-2026 13:58:02 Copying file src/casatools/agentflagger.py -> build/lib.linux-x86_64-cpython-312/casatools
07-Oct-2026 13:58:02 Copying file src/casatools/coordsys.py -> build/lib.linux-x86_64-cpython-312/casatools
07-Oct-2026 13:58:02 Copying file src/casatools/constants.py -> build/lib.linux-x86_64-cpython-312/casatools
07-Oct-2026 13:58:02 Copying file src/casatools/quanta.py -> build/lib.linux-x86_64-cpython-312/casatools
07-Oct-2026 13:58:02 Copying file src/casatools/utils.py -> build/lib.linux-x86_64-cpython-312/casatools
07-Oct-2026 13:58:02 Copying file src/casatools/imager.py -> build/lib.linux-x86_64-cpython-312/casatools
07-Oct-2026 13:58:02 Copying file src/casatools/spectralline.py -> build/lib.linux-x86_64-cpython-312/casatools
07-Oct-2026 13:58:02 Copying file src/casatools/logsink.py -> build/lib.linux-x86_64-cpython-312/casatools
07-Oct-2026 13:58:02 Copying file src/casatools/platform.py -> build/lib.linux-x86_64-cpython-312/casatools
07-Oct-2026 13:58:02 Copying file src/casatools/sidebandseparator.py -> build/lib.linux-x86_64-cpython-312/casatools
07-Oct-2026 13:58:02 Copying file src/casatools/synthesismaskhandler.py -> build/lib.linux-x86_64-cpython-312/casatools
07-Oct-2026 13:58:02 Copying file src/casatools/ms.py -> build/lib.linux-x86_64-cpython-312/casatools
07-Oct-2026 13:58:02 Copying file src/casatools/regionmanager.py -> build/lib.linux-x86_64-cpython-312/casatools
07-Oct-2026 13:58:02 Copying file src/casatools/typecheck.py -> build/lib.linux-x86_64-cpython-312/casatools
07-Oct-2026 13:58:02 Copying file src/casatools/table.py -> build/lib.linux-x86_64-cpython-312/casatools
07-Oct-2026 13:58:02 Copying file src/casatools/miriadfiller.py -> build/lib.linux-x86_64-cpython-312/casatools
07-Oct-2026 13:58:02 Traceback (most recent call last):
07-Oct-2026 13:58:02 File "/source/casa6/casatools/src/tools/build_env/lib/python3.12/site-packages/pyproject_hooks/_in_process/_in_process.py", line 406, in <module>
07-Oct-2026 13:58:02 main()
07-Oct-2026 13:58:02 File "/source/casa6/casatools/src/tools/build_env/lib/python3.12/site-packages/pyproject_hooks/_in_process/_in_process.py", line 381, in main
07-Oct-2026 13:58:02 json_out["return_val"] = hook(**hook_input["kwargs"])
07-Oct-2026 13:58:02 ^^^^^^^^^^^^^^^^^^^^^^^^^^^^
07-Oct-2026 13:58:02 File "/source/casa6/casatools/src/tools/build_env/lib/python3.12/site-packages/pyproject_hooks/_in_process/_in_process.py", line 286, in build_wheel
07-Oct-2026 13:58:02 return _build_backend().build_wheel(
07-Oct-2026 13:58:02 ^^^^^^^^^^^^^^^^^^^^^^^^^^^^^
07-Oct-2026 13:58:02 File "/source/casa6/casatools/src/tools/build_env/lib/python3.12/site-packages/setuptools/build_meta.py", line 438, in build_wheel
07-Oct-2026 13:58:02 return _build(['bdist_wheel'])
07-Oct-2026 13:58:02 ^^^^^^^^^^^^^^^^^^^^^^^
07-Oct-2026 13:58:02 File "/source/casa6/casatools/src/tools/build_env/lib/python3.12/site-packages/setuptools/build_meta.py", line 429, in _build
07-Oct-2026 13:58:02 return self._build_with_temp_dir(
07-Oct-2026 13:58:02 ^^^^^^^^^^^^^^^^^^^^^^^^^^
07-Oct-2026 13:58:15 File "/source/casa6/casatools/src/tools/build_env/lib/python3.12/site-packages/setuptools/build_meta.py", line 410, in _build_with_temp_dir
07-Oct-2026 13:58:15 self.run_setup()
07-Oct-2026 13:58:15 File "/source/casa6/casatools/src/tools/build_env/lib/python3.12/site-packages/setuptools/build_meta.py", line 317, in run_setup
07-Oct-2026 13:58:15 exec(code, locals())  # noqa: S102 # exec is intentional here
07-Oct-2026 13:58:15 ^^^^^^^^^^^^^^^^^^^^
07-Oct-2026 13:58:15 File "<string>", line 327, in <module>
07-Oct-2026 13:58:15 File "<string>", line 322, in setup_package
07-Oct-2026 13:58:15 File "/source/casa6/casatools/src/tools/build_env/lib/python3.12/site-packages/setuptools/__init__.py", line 117, in setup
07-Oct-2026 13:58:15 return distutils.core.setup(**attrs)  # type: ignore[return-value]
07-Oct-2026 13:58:15 ^^^^^^^^^^^^^^^^^^^^^^^^^^^^^
07-Oct-2026 13:58:15 File "/source/casa6/casatools/src/tools/build_env/lib/python3.12/site-packages/setuptools/_distutils/core.py", line 168, in setup
07-Oct-2026 13:58:15 return run_commands(dist)
07-Oct-2026 13:58:15 ^^^^^^^^^^^^^^^^^^
07-Oct-2026 13:58:15 File "/source/casa6/casatools/src/tools/build_env/lib/python3.12/site-packages/setuptools/_distutils/core.py", line 184, in run_commands
07-Oct-2026 13:58:15 dist.run_commands()
07-Oct-2026 13:58:15 File "/source/casa6/casatools/src/tools/build_env/lib/python3.12/site-packages/setuptools/_distutils/dist.py", line 1028, in run_commands
07-Oct-2026 13:58:15 self.run_command(cmd)
07-Oct-2026 13:58:15 File "/source/casa6/casatools/src/tools/build_env/lib/python3.12/site-packages/setuptools/dist.py", line 1106, in run_command
07-Oct-2026 13:58:15 super().run_command(command)
07-Oct-2026 13:58:15 File "/source/casa6/casatools/src/tools/build_env/lib/python3.12/site-packages/setuptools/_distutils/dist.py", line 1047, in run_command
07-Oct-2026 13:58:15 cmd_obj.run()
07-Oct-2026 13:58:15 File "/source/casa6/casatools/src/tools/build_env/lib/python3.12/site-packages/setuptools/command/bdist_wheel.py", line 385, in run
07-Oct-2026 13:58:15 self.run_command("build")
07-Oct-2026 13:58:15 File "/source/casa6/casatools/src/tools/build_env/lib/python3.12/site-packages/setuptools/_distutils/cmd.py", line 342, in run_command
07-Oct-2026 13:58:15 self.distribution.run_command(command)
07-Oct-2026 13:58:15 File "/source/casa6/casatools/src/tools/build_env/lib/python3.12/site-packages/setuptools/dist.py", line 1106, in run_command
07-Oct-2026 13:58:15 super().run_command(command)
07-Oct-2026 13:58:15 File "/source/casa6/casatools/src/tools/build_env/lib/python3.12/site-packages/setuptools/_distutils/dist.py", line 1047, in run_command
07-Oct-2026 13:58:15 cmd_obj.run()
07-Oct-2026 13:58:15 File "<string>", line 68, in run
07-Oct-2026 13:58:15 File "/source/casa6/casatools/src/tools/build_env/lib/python3.12/site-packages/setuptools/_distutils/command/build.py", line 137, in run
07-Oct-2026 13:58:15 self.run_command(cmd_name)
07-Oct-2026 13:58:15 File "/source/casa6/casatools/src/tools/build_env/lib/python3.12/site-packages/setuptools/_distutils/cmd.py", line 342, in run_command
07-Oct-2026 13:58:15 self.distribution.run_command(command)
07-Oct-2026 13:58:15 File "/source/casa6/casatools/src/tools/build_env/lib/python3.12/site-packages/setuptools/dist.py", line 1106, in run_command
07-Oct-2026 13:58:15 super().run_command(command)
07-Oct-2026 13:58:15 File "/source/casa6/casatools/src/tools/build_env/lib/python3.12/site-packages/setuptools/_distutils/dist.py", line 1047, in run_command
07-Oct-2026 13:58:15 cmd_obj.run()
07-Oct-2026 13:58:15 File "<string>", line 89, in run
07-Oct-2026 13:58:15 File "<string>", line 207, in build_extension
07-Oct-2026 13:58:15 File "/usr/local/lib/python3.12/subprocess.py", line 413, in check_call
07-Oct-2026 13:58:15 raise CalledProcessError(retcode, cmd)
07-Oct-2026 13:58:15 subprocess.CalledProcessError: Command '['cmake', 'src/tools', '-DCMAKE_LIBRARY_OUTPUT_DIRECTORY=/tmp/build-via-sdist-jv61io3q/casatools-6.7.7.12a14900.dev1+dirty/build/lib.linux-x86_64-cpython-312/', '-DPython3_EXECUTABLE=/source/casa6/casatools/src/tools/build_env/bin/python3.12', '-DPython3_FIND_VIRTUALENV=ONLY']' returned non-zero exit status 1.
07-Oct-2026 13:58:15 TIP pass --env-dir and --sdist-extract-dir to keep the build environment and sources, then see https://build.pypa.io/en/stable/how-to/troubleshooting.html#debug-a-failed-build for help debugging a failed build
07-Oct-2026 13:58:15 ERROR Backend subprocess exited when trying to invoke build_wheel
07-Oct-2026 13:58:15
07-Oct-2026 13:58:15 Auditwheel repair
07-Oct-2026 13:58:15 usage: auditwheel [-h] [-V] [-v] command ...
07-Oct-2026 13:58:15 auditwheel: error: cannot access *.whl. No such file
07-Oct-2026 13:58:15 ./build_casalith_cmake: line 246: cd: /source/casainstall/dist/wheelhouse/: No such file or directory
07-Oct-2026 13:58:15 cp: cannot stat '/source/casainstall/dist/wheelhouse/': No such file or directory
07-Oct-2026 13:58:15 <casa_cmake> Building casatestutils
07-Oct-2026 13:58:15 Latest commit doesn't have a tag. Adding -dirty flag to version string.
07-Oct-2026 13:58:15 running bdist_wheel
07-Oct-2026 13:58:15 running build
07-Oct-2026 13:58:15 running build_py
07-Oct-2026 13:58:15 creating build/lib/testrunner
07-Oct-2026 13:58:15 copying testrunner/xunit.py -> build/lib/testrunner
07-Oct-2026 13:58:15 copying testrunner/atlassian_helper.py -> build/lib/testrunner
07-Oct-2026 13:58:15 copying testrunner/run.py -> build/lib/testrunner
07-Oct-2026 13:58:15 copying testrunner/shell_runner.py -> build/lib/testrunner
07-Oct-2026 13:58:15 copying testrunner/__init__.py -> build/lib/testrunner
07-Oct-2026 13:58:15 copying testrunner/xvfb_helper.py -> build/lib/testrunner
07-Oct-2026 13:58:15 creating build/lib/casatestutils
07-Oct-2026 13:58:15 copying casatestutils/weblog.py -> build/lib/casatestutils
07-Oct-2026 13:58:15 copying casatestutils/restfreqtool.py -> build/lib/casatestutils
07-Oct-2026 13:58:15 copying casatestutils/selection_syntax.py -> build/lib/casatestutils
07-Oct-2026 13:58:15 copying casatestutils/check.py -> build/lib/casatestutils
07-Oct-2026 13:58:15 copying casatestutils/extractcasascript.py -> build/lib/casatestutils
07-Oct-2026 13:58:15 copying casatestutils/sparse_check.py -> build/lib/casatestutils
07-Oct-2026 13:58:15 copying casatestutils/testhelper.py -> build/lib/casatestutils
07-Oct-2026 13:58:15 copying casatestutils/xmlhelper.py -> build/lib/casatestutils
07-Oct-2026 13:58:15 copying casatestutils/filltsys.py -> build/lib/casatestutils
07-Oct-2026 13:58:15 copying casatestutils/plotutils.py -> build/lib/casatestutils
07-Oct-2026 13:58:15 copying casatestutils/runtest.py -> build/lib/casatestutils
07-Oct-2026 13:58:15 copying casatestutils/__init__.py -> build/lib/casatestutils
07-Oct-2026 13:58:15 copying casatestutils/listing.py -> build/lib/casatestutils
07-Oct-2026 13:58:15 copying casatestutils/compare.py -> build/lib/casatestutils
07-Oct-2026 13:58:15 creating build/lib/casatestutils/getcalmodvla_helpers
07-Oct-2026 13:58:15 copying casatestutils/getcalmodvla_helpers/__init__.py -> build/lib/casatestutils/getcalmodvla_helpers
07-Oct-2026 13:58:15 creating build/lib/casatestutils/datahelpers
07-Oct-2026 13:58:15 copying casatestutils/datahelpers/selectTaql.py -> build/lib/casatestutils/datahelpers
07-Oct-2026 13:58:15 copying casatestutils/datahelpers/__init__.py -> build/lib/casatestutils/datahelpers
07-Oct-2026 13:58:15 copying casatestutils/datahelpers/getTelescope.py -> build/lib/casatestutils/datahelpers
07-Oct-2026 13:58:15 creating build/lib/casatestutils/imagerhelpers
07-Oct-2026 13:58:15 copying casatestutils/imagerhelpers/imagetesthelpers.py -> build/lib/casatestutils/imagerhelpers
07-Oct-2026 13:58:15 copying casatestutils/imagerhelpers/__init__.py -> build/lib/casatestutils/imagerhelpers
07-Oct-2026 13:58:15 creating build/lib/casatestutils/stakeholder
07-Oct-2026 13:58:15 copying casatestutils/stakeholder/almastktestutils.py -> build/lib/casatestutils/stakeholder
07-Oct-2026 13:58:15 copying casatestutils/stakeholder/StkUnitTest.py -> build/lib/casatestutils/stakeholder
07-Oct-2026 13:58:15 copying casatestutils/stakeholder/__init__.py -> build/lib/casatestutils/stakeholder
07-Oct-2026 13:58:15 creating build/lib/casatestutils/getantposalma_helpers
07-Oct-2026 13:58:15 copying casatestutils/getantposalma_helpers/__init__.py -> build/lib/casatestutils/getantposalma_helpers
07-Oct-2026 13:58:15 running egg_info
07-Oct-2026 13:58:15 creating casatestutils.egg-info
07-Oct-2026 13:58:15 writing casatestutils.egg-info/PKG-INFO
07-Oct-2026 13:58:15 writing dependency_links to casatestutils.egg-info/dependency_links.txt
07-Oct-2026 13:58:15 writing requirements to casatestutils.egg-info/requires.txt
07-Oct-2026 13:58:15 writing top-level names to casatestutils.egg-info/top_level.txt
07-Oct-2026 13:58:15 writing manifest file 'casatestutils.egg-info/SOURCES.txt'
07-Oct-2026 13:58:15 reading manifest file 'casatestutils.egg-info/SOURCES.txt'
07-Oct-2026 13:58:15 adding license file 'LICENSE'
07-Oct-2026 13:58:15 writing manifest file 'casatestutils.egg-info/SOURCES.txt'
07-Oct-2026 13:58:15 copying casatestutils/component_to_test_map.json -> build/lib/casatestutils
07-Oct-2026 13:58:15 copying casatestutils/getcalmodvla_helpers/query1.json -> build/lib/casatestutils/getcalmodvla_helpers
07-Oct-2026 13:58:15 copying casatestutils/getantposalma_helpers/query1.json -> build/lib/casatestutils/getantposalma_helpers
07-Oct-2026 13:58:15 /source/casa6/casatools/src/tools/build_env/lib/python3.12/site-packages/setuptools/_distutils/cmd.py:90: SetuptoolsDeprecationWarning: setup.py install is deprecated.
07-Oct-2026 13:58:15 !!
07-Oct-2026 13:58:15
07-Oct-2026 13:58:15 ********************************************************************************
07-Oct-2026 13:58:15 Please avoid running ``setup.py`` directly.
07-Oct-2026 13:58:15 Instead, use pypa/build, pypa/installer or other
07-Oct-2026 13:58:15 standards-based tools.
07-Oct-2026 13:58:15
07-Oct-2026 13:58:15 This deprecation is overdue, please update your project and remove deprecated
07-Oct-2026 13:58:15 calls to avoid build errors in the future.
07-Oct-2026 13:58:15
07-Oct-2026 13:58:15 See https://blog.ganssle.io/articles/2021/10/setup-py-deprecated.html for details.
07-Oct-2026 13:58:15 ********************************************************************************
07-Oct-2026 13:58:15
07-Oct-2026 13:58:15 !!
07-Oct-2026 13:58:15 self.initialize_options()
07-Oct-2026 13:58:15 installing to build/bdist.linux-x86_64/wheel
07-Oct-2026 13:58:15 running install
07-Oct-2026 13:58:15 running install_lib
07-Oct-2026 13:58:15 creating build/bdist.linux-x86_64/wheel
07-Oct-2026 13:58:15 creating build/bdist.linux-x86_64/wheel/testrunner
07-Oct-2026 13:58:15 copying build/lib/testrunner/xunit.py -> build/bdist.linux-x86_64/wheel/./testrunner
07-Oct-2026 13:58:15 copying build/lib/testrunner/atlassian_helper.py -> build/bdist.linux-x86_64/wheel/./testrunner
07-Oct-2026 13:58:15 copying build/lib/testrunner/run.py -> build/bdist.linux-x86_64/wheel/./testrunner
07-Oct-2026 13:58:15 copying build/lib/testrunner/shell_runner.py -> build/bdist.linux-x86_64/wheel/./testrunner
07-Oct-2026 13:58:15 copying build/lib/testrunner/__init__.py -> build/bdist.linux-x86_64/wheel/./testrunner
07-Oct-2026 13:58:15 copying build/lib/testrunner/xvfb_helper.py -> build/bdist.linux-x86_64/wheel/./testrunner
07-Oct-2026 13:58:15 creating build/bdist.linux-x86_64/wheel/casatestutils
07-Oct-2026 13:58:15 creating build/bdist.linux-x86_64/wheel/casatestutils/getcalmodvla_helpers
07-Oct-2026 13:58:15 copying build/lib/casatestutils/getcalmodvla_helpers/__init__.py -> build/bdist.linux-x86_64/wheel/./casatestutils/getcalmodvla_helpers
07-Oct-2026 13:58:15 copying build/lib/casatestutils/getcalmodvla_helpers/query1.json -> build/bdist.linux-x86_64/wheel/./casatestutils/getcalmodvla_helpers
07-Oct-2026 13:58:15 copying build/lib/casatestutils/weblog.py -> build/bdist.linux-x86_64/wheel/./casatestutils
07-Oct-2026 13:58:15 copying build/lib/casatestutils/restfreqtool.py -> build/bdist.linux-x86_64/wheel/./casatestutils
07-Oct-2026 13:58:15 copying build/lib/casatestutils/selection_syntax.py -> build/bdist.linux-x86_64/wheel/./casatestutils
07-Oct-2026 13:58:15 creating build/bdist.linux-x86_64/wheel/casatestutils/datahelpers
07-Oct-2026 13:58:15 copying build/lib/casatestutils/datahelpers/selectTaql.py -> build/bdist.linux-x86_64/wheel/./casatestutils/datahelpers
07-Oct-2026 13:58:15 copying build/lib/casatestutils/datahelpers/__init__.py -> build/bdist.linux-x86_64/wheel/./casatestutils/datahelpers
07-Oct-2026 13:58:15 copying build/lib/casatestutils/datahelpers/getTelescope.py -> build/bdist.linux-x86_64/wheel/./casatestutils/datahelpers
07-Oct-2026 13:58:15 copying build/lib/casatestutils/check.py -> build/bdist.linux-x86_64/wheel/./casatestutils
07-Oct-2026 13:58:15 copying build/lib/casatestutils/extractcasascript.py -> build/bdist.linux-x86_64/wheel/./casatestutils
07-Oct-2026 13:58:15 copying build/lib/casatestutils/sparse_check.py -> build/bdist.linux-x86_64/wheel/./casatestutils
07-Oct-2026 13:58:15 creating build/bdist.linux-x86_64/wheel/casatestutils/imagerhelpers
07-Oct-2026 13:58:15 copying build/lib/casatestutils/imagerhelpers/imagetesthelpers.py -> build/bdist.linux-x86_64/wheel/./casatestutils/imagerhelpers
07-Oct-2026 13:58:15 copying build/lib/casatestutils/imagerhelpers/__init__.py -> build/bdist.linux-x86_64/wheel/./casatestutils/imagerhelpers
07-Oct-2026 13:58:15 copying build/lib/casatestutils/testhelper.py -> build/bdist.linux-x86_64/wheel/./casatestutils
07-Oct-2026 13:58:15 copying build/lib/casatestutils/xmlhelper.py -> build/bdist.linux-x86_64/wheel/./casatestutils
07-Oct-2026 13:58:15 copying build/lib/casatestutils/filltsys.py -> build/bdist.linux-x86_64/wheel/./casatestutils
07-Oct-2026 13:58:15 copying build/lib/casatestutils/component_to_test_map.json -> build/bdist.linux-x86_64/wheel/./casatestutils
07-Oct-2026 13:58:15 copying build/lib/casatestutils/plotutils.py -> build/bdist.linux-x86_64/wheel/./casatestutils
07-Oct-2026 13:58:15 copying build/lib/casatestutils/runtest.py -> build/bdist.linux-x86_64/wheel/./casatestutils
07-Oct-2026 13:58:15 copying build/lib/casatestutils/__init__.py -> build/bdist.linux-x86_64/wheel/./casatestutils
07-Oct-2026 13:58:15 copying build/lib/casatestutils/listing.py -> build/bdist.linux-x86_64/wheel/./casatestutils
07-Oct-2026 13:58:15 copying build/lib/casatestutils/compare.py -> build/bdist.linux-x86_64/wheel/./casatestutils
07-Oct-2026 13:58:15 creating build/bdist.linux-x86_64/wheel/casatestutils/stakeholder
07-Oct-2026 13:58:15 copying build/lib/casatestutils/stakeholder/almastktestutils.py -> build/bdist.linux-x86_64/wheel/./casatestutils/stakeholder
07-Oct-2026 13:58:15 copying build/lib/casatestutils/stakeholder/StkUnitTest.py -> build/bdist.linux-x86_64/wheel/./casatestutils/stakeholder
07-Oct-2026 13:58:15 copying build/lib/casatestutils/stakeholder/__init__.py -> build/bdist.linux-x86_64/wheel/./casatestutils/stakeholder
07-Oct-2026 13:58:15 creating build/bdist.linux-x86_64/wheel/casatestutils/getantposalma_helpers
07-Oct-2026 13:58:15 copying build/lib/casatestutils/getantposalma_helpers/__init__.py -> build/bdist.linux-x86_64/wheel/./casatestutils/getantposalma_helpers
07-Oct-2026 13:58:15 copying build/lib/casatestutils/getantposalma_helpers/query1.json -> build/bdist.linux-x86_64/wheel/./casatestutils/getantposalma_helpers
07-Oct-2026 13:58:15 running install_egg_info
07-Oct-2026 13:58:15 Copying casatestutils.egg-info to build/bdist.linux-x86_64/wheel/./casatestutils-6.7.7.12a14900.dev1+dirty-py3.12.egg-info
07-Oct-2026 13:58:15 running install_scripts
07-Oct-2026 13:58:15 creating build/bdist.linux-x86_64/wheel/casatestutils-6.7.7.12a14900.dev1+dirty.dist-info/WHEEL
07-Oct-2026 13:58:15 creating 'dist/casatestutils-6.7.7.12a14900.dev1+dirty-py3-none-any.whl' and adding 'build/bdist.linux-x86_64/wheel' to it
07-Oct-2026 13:58:15 adding 'casatestutils/__init__.py'
07-Oct-2026 13:58:15 adding 'casatestutils/check.py'
07-Oct-2026 13:58:15 adding 'casatestutils/compare.py'
07-Oct-2026 13:58:15 adding 'casatestutils/component_to_test_map.json'
07-Oct-2026 13:58:15 adding 'casatestutils/extractcasascript.py'
07-Oct-2026 13:58:15 adding 'casatestutils/filltsys.py'
07-Oct-2026 13:58:15 adding 'casatestutils/listing.py'
07-Oct-2026 13:58:15 adding 'casatestutils/plotutils.py'
07-Oct-2026 13:58:15 adding 'casatestutils/restfreqtool.py'
07-Oct-2026 13:58:15 adding 'casatestutils/runtest.py'
07-Oct-2026 13:58:15 adding 'casatestutils/selection_syntax.py'
07-Oct-2026 13:58:15 adding 'casatestutils/sparse_check.py'
07-Oct-2026 13:58:15 adding 'casatestutils/testhelper.py'
07-Oct-2026 13:58:15 adding 'casatestutils/weblog.py'
07-Oct-2026 13:58:15 adding 'casatestutils/xmlhelper.py'
07-Oct-2026 13:58:15 adding 'casatestutils/datahelpers/__init__.py'
07-Oct-2026 13:58:15 adding 'casatestutils/datahelpers/getTelescope.py'
07-Oct-2026 13:58:15 adding 'casatestutils/datahelpers/selectTaql.py'
07-Oct-2026 13:58:15 adding 'casatestutils/getantposalma_helpers/__init__.py'
07-Oct-2026 13:58:15 adding 'casatestutils/getantposalma_helpers/query1.json'
07-Oct-2026 13:58:15 adding 'casatestutils/getcalmodvla_helpers/__init__.py'
07-Oct-2026 13:58:15 adding 'casatestutils/getcalmodvla_helpers/query1.json'
07-Oct-2026 13:58:15 adding 'casatestutils/imagerhelpers/__init__.py'
07-Oct-2026 13:58:15 adding 'casatestutils/imagerhelpers/imagetesthelpers.py'
07-Oct-2026 13:58:15 adding 'casatestutils/stakeholder/StkUnitTest.py'
07-Oct-2026 13:58:15 adding 'casatestutils/stakeholder/__init__.py'
07-Oct-2026 13:58:15 adding 'casatestutils/stakeholder/almastktestutils.py'
07-Oct-2026 13:58:15 adding 'casatestutils-6.7.7.12a14900.dev1+dirty.dist-info/licenses/LICENSE'
07-Oct-2026 13:58:15 adding 'testrunner/__init__.py'
07-Oct-2026 13:58:15 adding 'testrunner/atlassian_helper.py'
07-Oct-2026 13:58:15 adding 'testrunner/run.py'
07-Oct-2026 13:58:15 adding 'testrunner/shell_runner.py'
07-Oct-2026 13:58:15 adding 'testrunner/xunit.py'
07-Oct-2026 13:58:15 adding 'testrunner/xvfb_helper.py'
07-Oct-2026 13:58:15 adding 'casatestutils-6.7.7.12a14900.dev1+dirty.dist-info/METADATA'
07-Oct-2026 13:58:15 adding 'casatestutils-6.7.7.12a14900.dev1+dirty.dist-info/WHEEL'
07-Oct-2026 13:58:15 adding 'casatestutils-6.7.7.12a14900.dev1+dirty.dist-info/top_level.txt'
07-Oct-2026 13:58:15 adding 'casatestutils-6.7.7.12a14900.dev1+dirty.dist-info/RECORD'
07-Oct-2026 13:58:15 removing build/bdist.linux-x86_64/wheel
07-Oct-2026 13:58:15 Build target set to casatools. Done.
07-Oct-2026 13:58:15 Finished task 'Create Casatools Wheel' with result: Success
07-Oct-2026 13:58:15 Starting task 'Run c++ tests' of type 'com.atlassian.bamboo.plugins.scripttask:task.builder.script'
07-Oct-2026 13:58:15
Beginning to execute external process for build 'CASASPECS - CI Build - CAS-14900 - ManyLinux 2.28 #3 (CASASPECS-CI335-ML228-3)'
... running command line:
/export/home/cbt-el7-1/bamboo-home/temp/CASASPECS-CI335-ML228-3-ScriptBuildTask-17030041827960314779.sh
... in: /export/home/cbt-el7-1/bamboo-home/xml-data/build-dir/CASASPECS-CI335-ML228
07-Oct-2026 13:58:16    Site: 3ade64f44082
07-Oct-2026 13:58:16    Build name: Linux-c++
07-Oct-2026 13:58:16 Create new tag: 20261007-1758 - Experimental
07-Oct-2026 13:58:16 Test project /source/casa6/casatools/src/code/build
07-Oct-2026 13:58:16       Start  1: APEX_SkyDipTest
07-Oct-2026 13:58:16 1/24 Test  #1: APEX_SkyDipTest ..................   Passed    0.41 sec
07-Oct-2026 13:58:16       Start  2: ATMDiscontinuityTest
07-Oct-2026 13:58:16 2/24 Test  #2: ATMDiscontinuityTest .............   Passed    0.08 sec
07-Oct-2026 13:58:16       Start  3: ATMVersionTest
07-Oct-2026 13:58:16 3/24 Test  #3: ATMVersionTest ...................   Passed    0.07 sec
07-Oct-2026 13:58:16       Start  4: AtmBasicTest
07-Oct-2026 13:58:25 4/24 Test  #4: AtmBasicTest .....................   Passed    8.32 sec
07-Oct-2026 13:58:25       Start  5: AtmProfileTest
07-Oct-2026 13:58:25 5/24 Test  #5: AtmProfileTest ...................   Passed    0.09 sec
07-Oct-2026 13:58:25       Start  6: LengthTest
07-Oct-2026 13:58:25 6/24 Test  #6: LengthTest .......................   Passed    0.09 sec
07-Oct-2026 13:58:25       Start  7: RefractiveIndexProfileTest
07-Oct-2026 13:58:25 7/24 Test  #7: RefractiveIndexProfileTest .......   Passed    0.07 sec
07-Oct-2026 13:58:25       Start  8: SkyStatusTest
07-Oct-2026 13:58:27 8/24 Test  #8: SkyStatusTest ....................   Passed    2.32 sec
07-Oct-2026 13:58:27       Start  9: SpectralGridTest
07-Oct-2026 13:58:27 9/24 Test  #9: SpectralGridTest .................   Passed    0.06 sec
07-Oct-2026 13:58:27       Start 10: simpleSpectralGridTest
07-Oct-2026 13:58:27 10/24 Test #10: simpleSpectralGridTest ...........   Passed    0.07 sec
07-Oct-2026 13:58:27       Start 11: tCalStats0
07-Oct-2026 13:58:27 Could not find executable /source/casa6/casatools/src/code/build/calanalysis/tCalStats0
07-Oct-2026 13:58:27 Looked in the following places:
07-Oct-2026 13:58:27 /source/casa6/casatools/src/code/build/calanalysis/tCalStats0
07-Oct-2026 13:58:27 /source/casa6/casatools/src/code/build/calanalysis/tCalStats0
07-Oct-2026 13:58:27 /source/casa6/casatools/src/code/build/calanalysis/Release/tCalStats0
07-Oct-2026 13:58:27 /source/casa6/casatools/src/code/build/calanalysis/Release/tCalStats0
07-Oct-2026 13:58:27 /source/casa6/casatools/src/code/build/calanalysis/Debug/tCalStats0
07-Oct-2026 13:58:27 /source/casa6/casatools/src/code/build/calanalysis/Debug/tCalStats0
07-Oct-2026 13:58:27 /source/casa6/casatools/src/code/build/calanalysis/MinSizeRel/tCalStats0
07-Oct-2026 13:58:27 /source/casa6/casatools/src/code/build/calanalysis/MinSizeRel/tCalStats0
07-Oct-2026 13:58:27 /source/casa6/casatools/src/code/build/calanalysis/RelWithDebInfo/tCalStats0
07-Oct-2026 13:58:27 /source/casa6/casatools/src/code/build/calanalysis/RelWithDebInfo/tCalStats0
07-Oct-2026 13:58:27 /source/casa6/casatools/src/code/build/calanalysis/Deployment/tCalStats0
07-Oct-2026 13:58:27 /source/casa6/casatools/src/code/build/calanalysis/Deployment/tCalStats0
07-Oct-2026 13:58:27 /source/casa6/casatools/src/code/build/calanalysis/Development/tCalStats0
07-Oct-2026 13:58:27 /source/casa6/casatools/src/code/build/calanalysis/Development/tCalStats0
07-Oct-2026 13:58:27 source/casa6/casatools/src/code/build/calanalysis/tCalStats0
07-Oct-2026 13:58:27 source/casa6/casatools/src/code/build/calanalysis/tCalStats0
07-Oct-2026 13:58:27 source/casa6/casatools/src/code/build/calanalysis/Release/tCalStats0
07-Oct-2026 13:58:27 source/casa6/casatools/src/code/build/calanalysis/Release/tCalStats0
07-Oct-2026 13:58:27 source/casa6/casatools/src/code/build/calanalysis/Debug/tCalStats0
07-Oct-2026 13:58:27 source/casa6/casatools/src/code/build/calanalysis/Debug/tCalStats0
07-Oct-2026 13:58:27 source/casa6/casatools/src/code/build/calanalysis/MinSizeRel/tCalStats0
07-Oct-2026 13:58:27 source/casa6/casatools/src/code/build/calanalysis/MinSizeRel/tCalStats0
07-Oct-2026 13:58:27 source/casa6/casatools/src/code/build/calanalysis/RelWithDebInfo/tCalStats0
07-Oct-2026 13:58:27 source/casa6/casatools/src/code/build/calanalysis/RelWithDebInfo/tCalStats0
07-Oct-2026 13:58:27 source/casa6/casatools/src/code/build/calanalysis/Deployment/tCalStats0
07-Oct-2026 13:58:27 source/casa6/casatools/src/code/build/calanalysis/Deployment/tCalStats0
07-Oct-2026 13:58:27 source/casa6/casatools/src/code/build/calanalysis/Development/tCalStats0
07-Oct-2026 13:58:27 source/casa6/casatools/src/code/build/calanalysis/Development/tCalStats0
07-Oct-2026 13:58:27 Unable to find executable: /source/casa6/casatools/src/code/build/calanalysis/tCalStats0
07-Oct-2026 13:58:27 11/24 Test #11: tCalStats0 .......................***Not Run   0.00 sec
07-Oct-2026 13:58:27       Start 12: tSakuraUtils
07-Oct-2026 13:58:27 12/24 Test #12: tSakuraUtils .....................   Passed    0.08 sec
07-Oct-2026 13:58:27       Start 13: dPointShape
07-Oct-2026 13:58:28 13/24 Test #13: dPointShape ......................   Passed    0.11 sec
07-Oct-2026 13:58:28       Start 14: dImageHistograms
07-Oct-2026 13:58:28 14/24 Test #14: dImageHistograms .................   Passed    0.13 sec
07-Oct-2026 13:58:28       Start 15: tHanningSmooth
07-Oct-2026 13:58:28 15/24 Test #15: tHanningSmooth ...................   Passed    0.56 sec
07-Oct-2026 13:58:28       Start 16: tVLABuffer
07-Oct-2026 13:58:28 16/24 Test #16: tVLABuffer .......................   Passed    0.05 sec
07-Oct-2026 13:58:28       Start 17: tLineFinder
07-Oct-2026 13:58:28 17/24 Test #17: tLineFinder ......................   Passed    0.09 sec
07-Oct-2026 13:58:28       Start 18: tVersionInfo
07-Oct-2026 13:58:28 18/24 Test #18: tVersionInfo .....................   Passed    0.05 sec
07-Oct-2026 13:58:28       Start 19: tCalLibraryParse
07-Oct-2026 13:58:28 Unable to find executable: /source/casa6/casatools/src/code/build/synthesis/tCalLibraryParse
07-Oct-2026 13:58:28 Unable to find executable: /source/casa6/casatools/src/code/build/synthesis/tCTIter
07-Oct-2026 13:58:28 Unable to find executable: /source/casa6/casatools/src/code/build/synthesis/tGridFT
07-Oct-2026 13:58:28 Unable to find executable: /source/casa6/casatools/src/code/build/synthesis/tAWPHPG
07-Oct-2026 13:58:28 Unable to find executable: /source/casa6/casatools/src/code/build/synthesis/tVisModelDataRefim
07-Oct-2026 13:58:28 Unable to find executable: /source/casa6/casatools/src/code/build/synthesis/tFFT2D
07-Oct-2026 13:58:28 Errors while running CTest
07-Oct-2026 13:58:28 Could not find executable /source/casa6/casatools/src/code/build/synthesis/tCalLibraryParse
07-Oct-2026 13:58:28 Looked in the following places:
07-Oct-2026 13:58:28 /source/casa6/casatools/src/code/build/synthesis/tCalLibraryParse
07-Oct-2026 13:58:28 /source/casa6/casatools/src/code/build/synthesis/tCalLibraryParse
07-Oct-2026 13:58:28 /source/casa6/casatools/src/code/build/synthesis/Release/tCalLibraryParse
07-Oct-2026 13:58:28 /source/casa6/casatools/src/code/build/synthesis/Release/tCalLibraryParse
07-Oct-2026 13:58:28 /source/casa6/casatools/src/code/build/synthesis/Debug/tCalLibraryParse
07-Oct-2026 13:58:28 /source/casa6/casatools/src/code/build/synthesis/Debug/tCalLibraryParse
07-Oct-2026 13:58:28 /source/casa6/casatools/src/code/build/synthesis/MinSizeRel/tCalLibraryParse
07-Oct-2026 13:58:28 /source/casa6/casatools/src/code/build/synthesis/MinSizeRel/tCalLibraryParse
07-Oct-2026 13:58:28 /source/casa6/casatools/src/code/build/synthesis/RelWithDebInfo/tCalLibraryParse
07-Oct-2026 13:58:28 /source/casa6/casatools/src/code/build/synthesis/RelWithDebInfo/tCalLibraryParse
07-Oct-2026 13:58:28 /source/casa6/casatools/src/code/build/synthesis/Deployment/tCalLibraryParse
07-Oct-2026 13:58:28 /source/casa6/casatools/src/code/build/synthesis/Deployment/tCalLibraryParse
07-Oct-2026 13:58:28 /source/casa6/casatools/src/code/build/synthesis/Development/tCalLibraryParse
07-Oct-2026 13:58:28 /source/casa6/casatools/src/code/build/synthesis/Development/tCalLibraryParse
07-Oct-2026 13:58:28 source/casa6/casatools/src/code/build/synthesis/tCalLibraryParse
07-Oct-2026 13:58:28 source/casa6/casatools/src/code/build/synthesis/tCalLibraryParse
07-Oct-2026 13:58:28 source/casa6/casatools/src/code/build/synthesis/Release/tCalLibraryParse
07-Oct-2026 13:58:28 source/casa6/casatools/src/code/build/synthesis/Release/tCalLibraryParse
07-Oct-2026 13:58:28 source/casa6/casatools/src/code/build/synthesis/Debug/tCalLibraryParse
07-Oct-2026 13:58:28 source/casa6/casatools/src/code/build/synthesis/Debug/tCalLibraryParse
07-Oct-2026 13:58:28 source/casa6/casatools/src/code/build/synthesis/MinSizeRel/tCalLibraryParse
07-Oct-2026 13:58:28 source/casa6/casatools/src/code/build/synthesis/MinSizeRel/tCalLibraryParse
07-Oct-2026 13:58:28 source/casa6/casatools/src/code/build/synthesis/RelWithDebInfo/tCalLibraryParse
07-Oct-2026 13:58:28 source/casa6/casatools/src/code/build/synthesis/RelWithDebInfo/tCalLibraryParse
07-Oct-2026 13:58:28 source/casa6/casatools/src/code/build/synthesis/Deployment/tCalLibraryParse
07-Oct-2026 13:58:28 source/casa6/casatools/src/code/build/synthesis/Deployment/tCalLibraryParse
07-Oct-2026 13:58:28 source/casa6/casatools/src/code/build/synthesis/Development/tCalLibraryParse
07-Oct-2026 13:58:28 source/casa6/casatools/src/code/build/synthesis/Development/tCalLibraryParse
07-Oct-2026 13:58:28 19/24 Test #19: tCalLibraryParse .................***Not Run   0.00 sec
07-Oct-2026 13:58:28       Start 20: tCTIter
07-Oct-2026 13:58:28 Could not find executable /source/casa6/casatools/src/code/build/synthesis/tCTIter
07-Oct-2026 13:58:28 Looked in the following places:
07-Oct-2026 13:58:28 /source/casa6/casatools/src/code/build/synthesis/tCTIter
07-Oct-2026 13:58:28 /source/casa6/casatools/src/code/build/synthesis/tCTIter
07-Oct-2026 13:58:28 /source/casa6/casatools/src/code/build/synthesis/Release/tCTIter
07-Oct-2026 13:58:28 /source/casa6/casatools/src/code/build/synthesis/Release/tCTIter
07-Oct-2026 13:58:28 /source/casa6/casatools/src/code/build/synthesis/Debug/tCTIter
07-Oct-2026 13:58:28 /source/casa6/casatools/src/code/build/synthesis/Debug/tCTIter
07-Oct-2026 13:58:28 /source/casa6/casatools/src/code/build/synthesis/MinSizeRel/tCTIter
07-Oct-2026 13:58:28 /source/casa6/casatools/src/code/build/synthesis/MinSizeRel/tCTIter
07-Oct-2026 13:58:28 /source/casa6/casatools/src/code/build/synthesis/RelWithDebInfo/tCTIter
07-Oct-2026 13:58:28 /source/casa6/casatools/src/code/build/synthesis/RelWithDebInfo/tCTIter
07-Oct-2026 13:58:28 /source/casa6/casatools/src/code/build/synthesis/Deployment/tCTIter
07-Oct-2026 13:58:28 /source/casa6/casatools/src/code/build/synthesis/Deployment/tCTIter
07-Oct-2026 13:58:28 /source/casa6/casatools/src/code/build/synthesis/Development/tCTIter
07-Oct-2026 13:58:28 /source/casa6/casatools/src/code/build/synthesis/Development/tCTIter
07-Oct-2026 13:58:28 source/casa6/casatools/src/code/build/synthesis/tCTIter
07-Oct-2026 13:58:28 source/casa6/casatools/src/code/build/synthesis/tCTIter
07-Oct-2026 13:58:28 source/casa6/casatools/src/code/build/synthesis/Release/tCTIter
07-Oct-2026 13:58:28 source/casa6/casatools/src/code/build/synthesis/Release/tCTIter
07-Oct-2026 13:58:28 source/casa6/casatools/src/code/build/synthesis/Debug/tCTIter
07-Oct-2026 13:58:28 source/casa6/casatools/src/code/build/synthesis/Debug/tCTIter
07-Oct-2026 13:58:28 source/casa6/casatools/src/code/build/synthesis/MinSizeRel/tCTIter
07-Oct-2026 13:58:28 source/casa6/casatools/src/code/build/synthesis/MinSizeRel/tCTIter
07-Oct-2026 13:58:28 source/casa6/casatools/src/code/build/synthesis/RelWithDebInfo/tCTIter
07-Oct-2026 13:58:28 source/casa6/casatools/src/code/build/synthesis/RelWithDebInfo/tCTIter
07-Oct-2026 13:58:28 source/casa6/casatools/src/code/build/synthesis/Deployment/tCTIter
07-Oct-2026 13:58:28 source/casa6/casatools/src/code/build/synthesis/Deployment/tCTIter
07-Oct-2026 13:58:28 source/casa6/casatools/src/code/build/synthesis/Development/tCTIter
07-Oct-2026 13:58:28 source/casa6/casatools/src/code/build/synthesis/Development/tCTIter
07-Oct-2026 13:58:28 20/24 Test #20: tCTIter ..........................***Not Run   0.00 sec
07-Oct-2026 13:58:28       Start 21: tGridFT
07-Oct-2026 13:58:28 Could not find executable /source/casa6/casatools/src/code/build/synthesis/tGridFT
07-Oct-2026 13:58:28 Looked in the following places:
07-Oct-2026 13:58:28 /source/casa6/casatools/src/code/build/synthesis/tGridFT
07-Oct-2026 13:58:28 /source/casa6/casatools/src/code/build/synthesis/tGridFT
07-Oct-2026 13:58:28 /source/casa6/casatools/src/code/build/synthesis/Release/tGridFT
07-Oct-2026 13:58:28 /source/casa6/casatools/src/code/build/synthesis/Release/tGridFT
07-Oct-2026 13:58:28 /source/casa6/casatools/src/code/build/synthesis/Debug/tGridFT
07-Oct-2026 13:58:28 /source/casa6/casatools/src/code/build/synthesis/Debug/tGridFT
07-Oct-2026 13:58:28 /source/casa6/casatools/src/code/build/synthesis/MinSizeRel/tGridFT
07-Oct-2026 13:58:28 /source/casa6/casatools/src/code/build/synthesis/MinSizeRel/tGridFT
07-Oct-2026 13:58:28 /source/casa6/casatools/src/code/build/synthesis/RelWithDebInfo/tGridFT
07-Oct-2026 13:58:28 /source/casa6/casatools/src/code/build/synthesis/RelWithDebInfo/tGridFT
07-Oct-2026 13:58:28 /source/casa6/casatools/src/code/build/synthesis/Deployment/tGridFT
07-Oct-2026 13:58:28 /source/casa6/casatools/src/code/build/synthesis/Deployment/tGridFT
07-Oct-2026 13:58:28 /source/casa6/casatools/src/code/build/synthesis/Development/tGridFT
07-Oct-2026 13:58:28 /source/casa6/casatools/src/code/build/synthesis/Development/tGridFT
07-Oct-2026 13:58:28 source/casa6/casatools/src/code/build/synthesis/tGridFT
07-Oct-2026 13:58:28 source/casa6/casatools/src/code/build/synthesis/tGridFT
07-Oct-2026 13:58:28 source/casa6/casatools/src/code/build/synthesis/Release/tGridFT
07-Oct-2026 13:58:28 source/casa6/casatools/src/code/build/synthesis/Release/tGridFT
07-Oct-2026 13:58:28 source/casa6/casatools/src/code/build/synthesis/Debug/tGridFT
07-Oct-2026 13:58:28 source/casa6/casatools/src/code/build/synthesis/Debug/tGridFT
07-Oct-2026 13:58:28 source/casa6/casatools/src/code/build/synthesis/MinSizeRel/tGridFT
07-Oct-2026 13:58:28 source/casa6/casatools/src/code/build/synthesis/MinSizeRel/tGridFT
07-Oct-2026 13:58:28 source/casa6/casatools/src/code/build/synthesis/RelWithDebInfo/tGridFT
07-Oct-2026 13:58:28 source/casa6/casatools/src/code/build/synthesis/RelWithDebInfo/tGridFT
07-Oct-2026 13:58:28 source/casa6/casatools/src/code/build/synthesis/Deployment/tGridFT
07-Oct-2026 13:58:28 source/casa6/casatools/src/code/build/synthesis/Deployment/tGridFT
07-Oct-2026 13:58:28 source/casa6/casatools/src/code/build/synthesis/Development/tGridFT
07-Oct-2026 13:58:28 source/casa6/casatools/src/code/build/synthesis/Development/tGridFT
07-Oct-2026 13:58:28 21/24 Test #21: tGridFT ..........................***Not Run   0.00 sec
07-Oct-2026 13:58:28       Start 22: tAWPHPG
07-Oct-2026 13:58:28 Could not find executable /source/casa6/casatools/src/code/build/synthesis/tAWPHPG
07-Oct-2026 13:58:28 Looked in the following places:
07-Oct-2026 13:58:28 /source/casa6/casatools/src/code/build/synthesis/tAWPHPG
07-Oct-2026 13:58:28 /source/casa6/casatools/src/code/build/synthesis/tAWPHPG
07-Oct-2026 13:58:28 /source/casa6/casatools/src/code/build/synthesis/Release/tAWPHPG
07-Oct-2026 13:58:28 /source/casa6/casatools/src/code/build/synthesis/Release/tAWPHPG
07-Oct-2026 13:58:28 /source/casa6/casatools/src/code/build/synthesis/Debug/tAWPHPG
07-Oct-2026 13:58:28 /source/casa6/casatools/src/code/build/synthesis/Debug/tAWPHPG
07-Oct-2026 13:58:28 /source/casa6/casatools/src/code/build/synthesis/MinSizeRel/tAWPHPG
07-Oct-2026 13:58:28 /source/casa6/casatools/src/code/build/synthesis/MinSizeRel/tAWPHPG
07-Oct-2026 13:58:28 /source/casa6/casatools/src/code/build/synthesis/RelWithDebInfo/tAWPHPG
07-Oct-2026 13:58:28 /source/casa6/casatools/src/code/build/synthesis/RelWithDebInfo/tAWPHPG
07-Oct-2026 13:58:28 /source/casa6/casatools/src/code/build/synthesis/Deployment/tAWPHPG
07-Oct-2026 13:58:28 /source/casa6/casatools/src/code/build/synthesis/Deployment/tAWPHPG
07-Oct-2026 13:58:28 /source/casa6/casatools/src/code/build/synthesis/Development/tAWPHPG
07-Oct-2026 13:58:28 /source/casa6/casatools/src/code/build/synthesis/Development/tAWPHPG
07-Oct-2026 13:58:28 source/casa6/casatools/src/code/build/synthesis/tAWPHPG
07-Oct-2026 13:58:28 source/casa6/casatools/src/code/build/synthesis/tAWPHPG
07-Oct-2026 13:58:28 source/casa6/casatools/src/code/build/synthesis/Release/tAWPHPG
07-Oct-2026 13:58:28 source/casa6/casatools/src/code/build/synthesis/Release/tAWPHPG
07-Oct-2026 13:58:28 source/casa6/casatools/src/code/build/synthesis/Debug/tAWPHPG
07-Oct-2026 13:58:28 source/casa6/casatools/src/code/build/synthesis/Debug/tAWPHPG
07-Oct-2026 13:58:28 source/casa6/casatools/src/code/build/synthesis/MinSizeRel/tAWPHPG
07-Oct-2026 13:58:28 source/casa6/casatools/src/code/build/synthesis/MinSizeRel/tAWPHPG
07-Oct-2026 13:58:28 source/casa6/casatools/src/code/build/synthesis/RelWithDebInfo/tAWPHPG
07-Oct-2026 13:58:28 source/casa6/casatools/src/code/build/synthesis/RelWithDebInfo/tAWPHPG
07-Oct-2026 13:58:28 source/casa6/casatools/src/code/build/synthesis/Deployment/tAWPHPG
07-Oct-2026 13:58:28 source/casa6/casatools/src/code/build/synthesis/Deployment/tAWPHPG
07-Oct-2026 13:58:28 source/casa6/casatools/src/code/build/synthesis/Development/tAWPHPG
07-Oct-2026 13:58:28 source/casa6/casatools/src/code/build/synthesis/Development/tAWPHPG
07-Oct-2026 13:58:28 22/24 Test #22: tAWPHPG ..........................***Not Run   0.00 sec
07-Oct-2026 13:58:28       Start 23: tVisModelDataRefim
07-Oct-2026 13:58:28 Could not find executable /source/casa6/casatools/src/code/build/synthesis/tVisModelDataRefim
07-Oct-2026 13:58:28 Looked in the following places:
07-Oct-2026 13:58:28 /source/casa6/casatools/src/code/build/synthesis/tVisModelDataRefim
07-Oct-2026 13:58:28 /source/casa6/casatools/src/code/build/synthesis/tVisModelDataRefim
07-Oct-2026 13:58:28 /source/casa6/casatools/src/code/build/synthesis/Release/tVisModelDataRefim
07-Oct-2026 13:58:28 /source/casa6/casatools/src/code/build/synthesis/Release/tVisModelDataRefim
07-Oct-2026 13:58:28 /source/casa6/casatools/src/code/build/synthesis/Debug/tVisModelDataRefim
07-Oct-2026 13:58:28 /source/casa6/casatools/src/code/build/synthesis/Debug/tVisModelDataRefim
07-Oct-2026 13:58:28 /source/casa6/casatools/src/code/build/synthesis/MinSizeRel/tVisModelDataRefim
07-Oct-2026 13:58:28 /source/casa6/casatools/src/code/build/synthesis/MinSizeRel/tVisModelDataRefim
07-Oct-2026 13:58:28 /source/casa6/casatools/src/code/build/synthesis/RelWithDebInfo/tVisModelDataRefim
07-Oct-2026 13:58:28 /source/casa6/casatools/src/code/build/synthesis/RelWithDebInfo/tVisModelDataRefim
07-Oct-2026 13:58:28 /source/casa6/casatools/src/code/build/synthesis/Deployment/tVisModelDataRefim
07-Oct-2026 13:58:28 /source/casa6/casatools/src/code/build/synthesis/Deployment/tVisModelDataRefim
07-Oct-2026 13:58:28 /source/casa6/casatools/src/code/build/synthesis/Development/tVisModelDataRefim
07-Oct-2026 13:58:28 /source/casa6/casatools/src/code/build/synthesis/Development/tVisModelDataRefim
07-Oct-2026 13:58:28 source/casa6/casatools/src/code/build/synthesis/tVisModelDataRefim
07-Oct-2026 13:58:28 source/casa6/casatools/src/code/build/synthesis/tVisModelDataRefim
07-Oct-2026 13:58:28 source/casa6/casatools/src/code/build/synthesis/Release/tVisModelDataRefim
07-Oct-2026 13:58:28 source/casa6/casatools/src/code/build/synthesis/Release/tVisModelDataRefim
07-Oct-2026 13:58:28 source/casa6/casatools/src/code/build/synthesis/Debug/tVisModelDataRefim
07-Oct-2026 13:58:28 source/casa6/casatools/src/code/build/synthesis/Debug/tVisModelDataRefim
07-Oct-2026 13:58:28 source/casa6/casatools/src/code/build/synthesis/MinSizeRel/tVisModelDataRefim
07-Oct-2026 13:58:28 source/casa6/casatools/src/code/build/synthesis/MinSizeRel/tVisModelDataRefim
07-Oct-2026 13:58:28 source/casa6/casatools/src/code/build/synthesis/RelWithDebInfo/tVisModelDataRefim
07-Oct-2026 13:58:28 source/casa6/casatools/src/code/build/synthesis/RelWithDebInfo/tVisModelDataRefim
07-Oct-2026 13:58:28 source/casa6/casatools/src/code/build/synthesis/Deployment/tVisModelDataRefim
07-Oct-2026 13:58:28 source/casa6/casatools/src/code/build/synthesis/Deployment/tVisModelDataRefim
07-Oct-2026 13:58:28 source/casa6/casatools/src/code/build/synthesis/Development/tVisModelDataRefim
07-Oct-2026 13:58:28 source/casa6/casatools/src/code/build/synthesis/Development/tVisModelDataRefim
07-Oct-2026 13:58:28 23/24 Test #23: tVisModelDataRefim ...............***Not Run   0.00 sec
07-Oct-2026 13:58:28       Start 24: tFFT2D
07-Oct-2026 13:58:28 Could not find executable /source/casa6/casatools/src/code/build/synthesis/tFFT2D
07-Oct-2026 13:58:28 Looked in the following places:
07-Oct-2026 13:58:28 /source/casa6/casatools/src/code/build/synthesis/tFFT2D
07-Oct-2026 13:58:28 /source/casa6/casatools/src/code/build/synthesis/tFFT2D
07-Oct-2026 13:58:28 /source/casa6/casatools/src/code/build/synthesis/Release/tFFT2D
07-Oct-2026 13:58:28 /source/casa6/casatools/src/code/build/synthesis/Release/tFFT2D
07-Oct-2026 13:58:28 /source/casa6/casatools/src/code/build/synthesis/Debug/tFFT2D
07-Oct-2026 13:58:28 /source/casa6/casatools/src/code/build/synthesis/Debug/tFFT2D
07-Oct-2026 13:58:28 /source/casa6/casatools/src/code/build/synthesis/MinSizeRel/tFFT2D
07-Oct-2026 13:58:28 /source/casa6/casatools/src/code/build/synthesis/MinSizeRel/tFFT2D
07-Oct-2026 13:58:28 /source/casa6/casatools/src/code/build/synthesis/RelWithDebInfo/tFFT2D
07-Oct-2026 13:58:28 /source/casa6/casatools/src/code/build/synthesis/RelWithDebInfo/tFFT2D
07-Oct-2026 13:58:28 /source/casa6/casatools/src/code/build/synthesis/Deployment/tFFT2D
07-Oct-2026 13:58:28 /source/casa6/casatools/src/code/build/synthesis/Deployment/tFFT2D
07-Oct-2026 13:58:28 /source/casa6/casatools/src/code/build/synthesis/Development/tFFT2D
07-Oct-2026 13:58:28 /source/casa6/casatools/src/code/build/synthesis/Development/tFFT2D
07-Oct-2026 13:58:28 source/casa6/casatools/src/code/build/synthesis/tFFT2D
07-Oct-2026 13:58:28 source/casa6/casatools/src/code/build/synthesis/tFFT2D
07-Oct-2026 13:58:28 source/casa6/casatools/src/code/build/synthesis/Release/tFFT2D
07-Oct-2026 13:58:28 source/casa6/casatools/src/code/build/synthesis/Release/tFFT2D
07-Oct-2026 13:58:28 source/casa6/casatools/src/code/build/synthesis/Debug/tFFT2D
07-Oct-2026 13:58:28 source/casa6/casatools/src/code/build/synthesis/Debug/tFFT2D
07-Oct-2026 13:58:28 source/casa6/casatools/src/code/build/synthesis/MinSizeRel/tFFT2D
07-Oct-2026 13:58:28 source/casa6/casatools/src/code/build/synthesis/MinSizeRel/tFFT2D
07-Oct-2026 13:58:28 source/casa6/casatools/src/code/build/synthesis/RelWithDebInfo/tFFT2D
07-Oct-2026 13:58:28 source/casa6/casatools/src/code/build/synthesis/RelWithDebInfo/tFFT2D
07-Oct-2026 13:58:28 source/casa6/casatools/src/code/build/synthesis/Deployment/tFFT2D
07-Oct-2026 13:58:28 source/casa6/casatools/src/code/build/synthesis/Deployment/tFFT2D
07-Oct-2026 13:58:28 source/casa6/casatools/src/code/build/synthesis/Development/tFFT2D
07-Oct-2026 13:58:28 source/casa6/casatools/src/code/build/synthesis/Development/tFFT2D
07-Oct-2026 13:58:28 24/24 Test #24: tFFT2D ...........................***Not Run   0.00 sec
07-Oct-2026 13:58:28
07-Oct-2026 13:58:28 71% tests passed, 7 tests failed out of 24
07-Oct-2026 13:58:28
07-Oct-2026 13:58:28 Total Test time (real) =  12.75 sec
07-Oct-2026 13:58:28
07-Oct-2026 13:58:28 The following tests FAILED:
07-Oct-2026 13:58:28          11 - tCalStats0 (Not Run)
07-Oct-2026 13:58:28          19 - tCalLibraryParse (Not Run)
07-Oct-2026 13:58:28          20 - tCTIter (Not Run)
07-Oct-2026 13:58:28          21 - tGridFT (Not Run)
07-Oct-2026 13:58:28          22 - tAWPHPG (Not Run)
07-Oct-2026 13:58:28          23 - tVisModelDataRefim (Not Run)
07-Oct-2026 13:58:28          24 - tFFT2D (Not Run)
07-Oct-2026 13:58:29 Failing task since return code of [/export/home/cbt-el7-1/bamboo-home/temp/CASASPECS-CI335-ML228-3-ScriptBuildTask-17030041827960314779.sh] was 8 while expected 0
07-Oct-2026 13:58:29 Finished task 'Run c++ tests' with result: Failed
07-Oct-2026 13:58:29 Starting task 'Clean up' of type 'com.atlassian.bamboo.plugins.scripttask:task.builder.script'
07-Oct-2026 13:58:29
Beginning to execute external process for build 'CASASPECS - CI Build - CAS-14900 - ManyLinux 2.28 #3 (CASASPECS-CI335-ML228-3)'
... running command line:
/export/home/cbt-el7-1/bamboo-home/temp/CASASPECS-CI335-ML228-3-ScriptBuildTask-4275764266695244333.sh
... in: /export/home/cbt-el7-1/bamboo-home/xml-data/build-dir/CASASPECS-CI335-ML228
07-Oct-2026 13:58:29 Starting cleanup
07-Oct-2026 13:58:29 Error response from daemon: No such container: build_container
07-Oct-2026 13:58:39 casalith_container
07-Oct-2026 13:58:39 Error response from daemon: No such container: build_container
07-Oct-2026 13:58:39 casalith_container
07-Oct-2026 13:58:39 Cleanup complete
07-Oct-2026 13:58:39 Finished task 'Clean up' with result: Success
07-Oct-2026 13:58:39 Running post build plugin 'Docker Container Cleanup'
07-Oct-2026 13:58:39
Beginning to execute external process for build 'CASASPECS - CI Build - CAS-14900 - ManyLinux 2.28 #3 (CASASPECS-CI335-ML228-3)'
... running command line:
/usr/bin/docker rm -f casalith_container
... in: /export/home/cbt-el7-1/bamboo-home/xml-data/build-dir/CASASPECS-CI335-ML228
07-Oct-2026 13:58:39 Error response from daemon: No such container: casalith_container
07-Oct-2026 13:58:39 Running post build plugin 'NCover Results Collector'
07-Oct-2026 13:58:39 Running post build plugin 'Build Results Label Collector'
07-Oct-2026 13:58:39 Running post build plugin 'Clover Results Collector'
07-Oct-2026 13:58:39 Running post build plugin 'npm Cache Cleanup'
07-Oct-2026 13:58:39 Running post build plugin 'Artifact Copier'
07-Oct-2026 13:58:39 Publishing an artifact: ManyLinux228 Casatestutils
07-Oct-2026 13:58:39 Finished publishing of artifact Required shared artifact Http Compression On : [ManyLinux228 Casatestutils], patterns: [casatestutils*.whl] anchored at: [source/wheels] in 97.89 ms
07-Oct-2026 13:58:39 Publishing an artifact: ManyLinux228 Python 3.12 Tool wheel
07-Oct-2026 13:58:39 Failing as no matching files has been found and empty artifacts are not allowed.
07-Oct-2026 13:58:40 Unable to publish artifact [ManyLinux228 Python 3.12 Tool wheel]:
07-Oct-2026 13:58:40 The artifact is required, build will now fail.
07-Oct-2026 13:58:40 The artifact hasn't been successfully published after 265.3 ms
07-Oct-2026 13:58:40 Finalising the build...
07-Oct-2026 13:58:40 Stopping timer.
07-Oct-2026 13:58:40 Build CASASPECS-CI335-ML228-3 completed.
07-Oct-2026 13:58:40 Running on server: post build plugin 'Build Hanging Detection Configuration'
07-Oct-2026 13:58:40 Running on server: post build plugin 'NCover Results Collector'
07-Oct-2026 13:58:40 Running on server: post build plugin 'Build Labeller'
07-Oct-2026 13:58:40 Running on server: post build plugin 'Clover Delta Calculator'
07-Oct-2026 13:58:40 Running on server: post build plugin 'Maven Dependencies Postprocessor'
07-Oct-2026 13:58:40 All post build plugins have finished
07-Oct-2026 13:58:40 Generating build results summary...
07-Oct-2026 13:58:40 Saving build results to disk...
07-Oct-2026 13:58:40 Store variable context...
07-Oct-2026 13:58:40 Finished building CASASPECS-CI335-ML228-3.