Build: #25 failed

Job: ManyLinux 2.28 failed

Stages & jobs

  1. Default Stage

  2. Test

Build log

The build generated 80,257 lines of output.   The output is too long and has been truncated to the last 1,000 lines. Download or view full build log.

24-Aug-2026 18:42:08 copying src/tools/build_env/lib64/python3.12/site-packages/setuptools/command/install.py -> casatools-6.7.7.4a13522.dev22+dirty/src/tools/build_env/lib64/python3.12/site-packages/setuptools/command
24-Aug-2026 18:42:08 copying src/tools/build_env/lib64/python3.12/site-packages/setuptools/command/install_egg_info.py -> casatools-6.7.7.4a13522.dev22+dirty/src/tools/build_env/lib64/python3.12/site-packages/setuptools/command
24-Aug-2026 18:42:08 copying src/tools/build_env/lib64/python3.12/site-packages/setuptools/command/install_lib.py -> casatools-6.7.7.4a13522.dev22+dirty/src/tools/build_env/lib64/python3.12/site-packages/setuptools/command
24-Aug-2026 18:42:08 copying src/tools/build_env/lib64/python3.12/site-packages/setuptools/command/install_scripts.py -> casatools-6.7.7.4a13522.dev22+dirty/src/tools/build_env/lib64/python3.12/site-packages/setuptools/command
24-Aug-2026 18:42:08 copying src/tools/build_env/lib64/python3.12/site-packages/setuptools/command/rotate.py -> casatools-6.7.7.4a13522.dev22+dirty/src/tools/build_env/lib64/python3.12/site-packages/setuptools/command
24-Aug-2026 18:42:08 copying src/tools/build_env/lib64/python3.12/site-packages/setuptools/command/saveopts.py -> casatools-6.7.7.4a13522.dev22+dirty/src/tools/build_env/lib64/python3.12/site-packages/setuptools/command
24-Aug-2026 18:42:08 copying src/tools/build_env/lib64/python3.12/site-packages/setuptools/command/sdist.py -> casatools-6.7.7.4a13522.dev22+dirty/src/tools/build_env/lib64/python3.12/site-packages/setuptools/command
24-Aug-2026 18:42:08 copying src/tools/build_env/lib64/python3.12/site-packages/setuptools/command/setopt.py -> casatools-6.7.7.4a13522.dev22+dirty/src/tools/build_env/lib64/python3.12/site-packages/setuptools/command
24-Aug-2026 18:42:08 copying src/tools/build_env/lib64/python3.12/site-packages/setuptools/command/test.py -> casatools-6.7.7.4a13522.dev22+dirty/src/tools/build_env/lib64/python3.12/site-packages/setuptools/command
24-Aug-2026 18:42:08 copying src/tools/build_env/lib64/python3.12/site-packages/setuptools/command/__pycache__/__init__.cpython-312.pyc -> casatools-6.7.7.4a13522.dev22+dirty/src/tools/build_env/lib64/python3.12/site-packages/setuptools/command/__pycache__
24-Aug-2026 18:42:08 copying src/tools/build_env/lib64/python3.12/site-packages/setuptools/command/__pycache__/_requirestxt.cpython-312.pyc -> casatools-6.7.7.4a13522.dev22+dirty/src/tools/build_env/lib64/python3.12/site-packages/setuptools/command/__pycache__
24-Aug-2026 18:42:08 copying src/tools/build_env/lib64/python3.12/site-packages/setuptools/command/__pycache__/alias.cpython-312.pyc -> casatools-6.7.7.4a13522.dev22+dirty/src/tools/build_env/lib64/python3.12/site-packages/setuptools/command/__pycache__
24-Aug-2026 18:42:08 copying src/tools/build_env/lib64/python3.12/site-packages/setuptools/command/__pycache__/bdist_egg.cpython-312.pyc -> casatools-6.7.7.4a13522.dev22+dirty/src/tools/build_env/lib64/python3.12/site-packages/setuptools/command/__pycache__
24-Aug-2026 18:42:08 copying src/tools/build_env/lib64/python3.12/site-packages/setuptools/command/__pycache__/bdist_rpm.cpython-312.pyc -> casatools-6.7.7.4a13522.dev22+dirty/src/tools/build_env/lib64/python3.12/site-packages/setuptools/command/__pycache__
24-Aug-2026 18:42:08 copying src/tools/build_env/lib64/python3.12/site-packages/setuptools/command/__pycache__/bdist_wheel.cpython-312.pyc -> casatools-6.7.7.4a13522.dev22+dirty/src/tools/build_env/lib64/python3.12/site-packages/setuptools/command/__pycache__
24-Aug-2026 18:42:08 copying src/tools/build_env/lib64/python3.12/site-packages/setuptools/command/__pycache__/build.cpython-312.pyc -> casatools-6.7.7.4a13522.dev22+dirty/src/tools/build_env/lib64/python3.12/site-packages/setuptools/command/__pycache__
24-Aug-2026 18:42:08 copying src/tools/build_env/lib64/python3.12/site-packages/setuptools/command/__pycache__/build_clib.cpython-312.pyc -> casatools-6.7.7.4a13522.dev22+dirty/src/tools/build_env/lib64/python3.12/site-packages/setuptools/command/__pycache__
24-Aug-2026 18:42:08 copying src/tools/build_env/lib64/python3.12/site-packages/setuptools/command/__pycache__/build_ext.cpython-312.pyc -> casatools-6.7.7.4a13522.dev22+dirty/src/tools/build_env/lib64/python3.12/site-packages/setuptools/command/__pycache__
24-Aug-2026 18:42:08 copying src/tools/build_env/lib64/python3.12/site-packages/setuptools/command/__pycache__/build_py.cpython-312.pyc -> casatools-6.7.7.4a13522.dev22+dirty/src/tools/build_env/lib64/python3.12/site-packages/setuptools/command/__pycache__
24-Aug-2026 18:42:08 copying src/tools/build_env/lib64/python3.12/site-packages/setuptools/command/__pycache__/develop.cpython-312.pyc -> casatools-6.7.7.4a13522.dev22+dirty/src/tools/build_env/lib64/python3.12/site-packages/setuptools/command/__pycache__
24-Aug-2026 18:42:08 copying src/tools/build_env/lib64/python3.12/site-packages/setuptools/command/__pycache__/dist_info.cpython-312.pyc -> casatools-6.7.7.4a13522.dev22+dirty/src/tools/build_env/lib64/python3.12/site-packages/setuptools/command/__pycache__
24-Aug-2026 18:42:08 copying src/tools/build_env/lib64/python3.12/site-packages/setuptools/command/__pycache__/easy_install.cpython-312.pyc -> casatools-6.7.7.4a13522.dev22+dirty/src/tools/build_env/lib64/python3.12/site-packages/setuptools/command/__pycache__
24-Aug-2026 18:42:08 copying src/tools/build_env/lib64/python3.12/site-packages/setuptools/command/__pycache__/editable_wheel.cpython-312.pyc -> casatools-6.7.7.4a13522.dev22+dirty/src/tools/build_env/lib64/python3.12/site-packages/setuptools/command/__pycache__
24-Aug-2026 18:42:08 copying src/tools/build_env/lib64/python3.12/site-packages/setuptools/command/__pycache__/egg_info.cpython-312.pyc -> casatools-6.7.7.4a13522.dev22+dirty/src/tools/build_env/lib64/python3.12/site-packages/setuptools/command/__pycache__
24-Aug-2026 18:42:08 copying src/tools/build_env/lib64/python3.12/site-packages/setuptools/command/__pycache__/install.cpython-312.pyc -> casatools-6.7.7.4a13522.dev22+dirty/src/tools/build_env/lib64/python3.12/site-packages/setuptools/command/__pycache__
24-Aug-2026 18:42:08 copying src/tools/build_env/lib64/python3.12/site-packages/setuptools/command/__pycache__/install_egg_info.cpython-312.pyc -> casatools-6.7.7.4a13522.dev22+dirty/src/tools/build_env/lib64/python3.12/site-packages/setuptools/command/__pycache__
24-Aug-2026 18:42:08 copying src/tools/build_env/lib64/python3.12/site-packages/setuptools/command/__pycache__/install_lib.cpython-312.pyc -> casatools-6.7.7.4a13522.dev22+dirty/src/tools/build_env/lib64/python3.12/site-packages/setuptools/command/__pycache__
24-Aug-2026 18:42:08 copying src/tools/build_env/lib64/python3.12/site-packages/setuptools/command/__pycache__/install_scripts.cpython-312.pyc -> casatools-6.7.7.4a13522.dev22+dirty/src/tools/build_env/lib64/python3.12/site-packages/setuptools/command/__pycache__
24-Aug-2026 18:42:08 copying src/tools/build_env/lib64/python3.12/site-packages/setuptools/command/__pycache__/rotate.cpython-312.pyc -> casatools-6.7.7.4a13522.dev22+dirty/src/tools/build_env/lib64/python3.12/site-packages/setuptools/command/__pycache__
24-Aug-2026 18:42:08 copying src/tools/build_env/lib64/python3.12/site-packages/setuptools/command/__pycache__/saveopts.cpython-312.pyc -> casatools-6.7.7.4a13522.dev22+dirty/src/tools/build_env/lib64/python3.12/site-packages/setuptools/command/__pycache__
24-Aug-2026 18:42:08 copying src/tools/build_env/lib64/python3.12/site-packages/setuptools/command/__pycache__/sdist.cpython-312.pyc -> casatools-6.7.7.4a13522.dev22+dirty/src/tools/build_env/lib64/python3.12/site-packages/setuptools/command/__pycache__
24-Aug-2026 18:42:08 copying src/tools/build_env/lib64/python3.12/site-packages/setuptools/command/__pycache__/setopt.cpython-312.pyc -> casatools-6.7.7.4a13522.dev22+dirty/src/tools/build_env/lib64/python3.12/site-packages/setuptools/command/__pycache__
24-Aug-2026 18:42:08 copying src/tools/build_env/lib64/python3.12/site-packages/setuptools/command/__pycache__/test.cpython-312.pyc -> casatools-6.7.7.4a13522.dev22+dirty/src/tools/build_env/lib64/python3.12/site-packages/setuptools/command/__pycache__
24-Aug-2026 18:42:08 copying src/tools/build_env/lib64/python3.12/site-packages/setuptools/compat/__init__.py -> casatools-6.7.7.4a13522.dev22+dirty/src/tools/build_env/lib64/python3.12/site-packages/setuptools/compat
24-Aug-2026 18:42:08 copying src/tools/build_env/lib64/python3.12/site-packages/setuptools/compat/py310.py -> casatools-6.7.7.4a13522.dev22+dirty/src/tools/build_env/lib64/python3.12/site-packages/setuptools/compat
24-Aug-2026 18:42:08 copying src/tools/build_env/lib64/python3.12/site-packages/setuptools/compat/py311.py -> casatools-6.7.7.4a13522.dev22+dirty/src/tools/build_env/lib64/python3.12/site-packages/setuptools/compat
24-Aug-2026 18:42:08 copying src/tools/build_env/lib64/python3.12/site-packages/setuptools/compat/py312.py -> casatools-6.7.7.4a13522.dev22+dirty/src/tools/build_env/lib64/python3.12/site-packages/setuptools/compat
24-Aug-2026 18:42:08 copying src/tools/build_env/lib64/python3.12/site-packages/setuptools/compat/py39.py -> casatools-6.7.7.4a13522.dev22+dirty/src/tools/build_env/lib64/python3.12/site-packages/setuptools/compat
24-Aug-2026 18:42:08 copying src/tools/build_env/lib64/python3.12/site-packages/setuptools/compat/__pycache__/__init__.cpython-312.pyc -> casatools-6.7.7.4a13522.dev22+dirty/src/tools/build_env/lib64/python3.12/site-packages/setuptools/compat/__pycache__
24-Aug-2026 18:42:08 copying src/tools/build_env/lib64/python3.12/site-packages/setuptools/compat/__pycache__/py310.cpython-312.pyc -> casatools-6.7.7.4a13522.dev22+dirty/src/tools/build_env/lib64/python3.12/site-packages/setuptools/compat/__pycache__
24-Aug-2026 18:42:08 copying src/tools/build_env/lib64/python3.12/site-packages/setuptools/compat/__pycache__/py311.cpython-312.pyc -> casatools-6.7.7.4a13522.dev22+dirty/src/tools/build_env/lib64/python3.12/site-packages/setuptools/compat/__pycache__
24-Aug-2026 18:42:08 copying src/tools/build_env/lib64/python3.12/site-packages/setuptools/compat/__pycache__/py312.cpython-312.pyc -> casatools-6.7.7.4a13522.dev22+dirty/src/tools/build_env/lib64/python3.12/site-packages/setuptools/compat/__pycache__
24-Aug-2026 18:42:08 copying src/tools/build_env/lib64/python3.12/site-packages/setuptools/compat/__pycache__/py39.cpython-312.pyc -> casatools-6.7.7.4a13522.dev22+dirty/src/tools/build_env/lib64/python3.12/site-packages/setuptools/compat/__pycache__
24-Aug-2026 18:42:08 copying src/tools/build_env/lib64/python3.12/site-packages/setuptools/config/NOTICE -> casatools-6.7.7.4a13522.dev22+dirty/src/tools/build_env/lib64/python3.12/site-packages/setuptools/config
24-Aug-2026 18:42:08 copying src/tools/build_env/lib64/python3.12/site-packages/setuptools/config/__init__.py -> casatools-6.7.7.4a13522.dev22+dirty/src/tools/build_env/lib64/python3.12/site-packages/setuptools/config
24-Aug-2026 18:42:08 copying src/tools/build_env/lib64/python3.12/site-packages/setuptools/config/_apply_pyprojecttoml.py -> casatools-6.7.7.4a13522.dev22+dirty/src/tools/build_env/lib64/python3.12/site-packages/setuptools/config
24-Aug-2026 18:42:08 copying src/tools/build_env/lib64/python3.12/site-packages/setuptools/config/distutils.schema.json -> casatools-6.7.7.4a13522.dev22+dirty/src/tools/build_env/lib64/python3.12/site-packages/setuptools/config
24-Aug-2026 18:42:08 copying src/tools/build_env/lib64/python3.12/site-packages/setuptools/config/expand.py -> casatools-6.7.7.4a13522.dev22+dirty/src/tools/build_env/lib64/python3.12/site-packages/setuptools/config
24-Aug-2026 18:42:08 copying src/tools/build_env/lib64/python3.12/site-packages/setuptools/config/pyprojecttoml.py -> casatools-6.7.7.4a13522.dev22+dirty/src/tools/build_env/lib64/python3.12/site-packages/setuptools/config
24-Aug-2026 18:42:08 copying src/tools/build_env/lib64/python3.12/site-packages/setuptools/config/setupcfg.py -> casatools-6.7.7.4a13522.dev22+dirty/src/tools/build_env/lib64/python3.12/site-packages/setuptools/config
24-Aug-2026 18:42:08 copying src/tools/build_env/lib64/python3.12/site-packages/setuptools/config/setuptools.schema.json -> casatools-6.7.7.4a13522.dev22+dirty/src/tools/build_env/lib64/python3.12/site-packages/setuptools/config
24-Aug-2026 18:42:08 copying src/tools/build_env/lib64/python3.12/site-packages/setuptools/config/__pycache__/__init__.cpython-312.pyc -> casatools-6.7.7.4a13522.dev22+dirty/src/tools/build_env/lib64/python3.12/site-packages/setuptools/config/__pycache__
24-Aug-2026 18:42:08 copying src/tools/build_env/lib64/python3.12/site-packages/setuptools/config/__pycache__/_apply_pyprojecttoml.cpython-312.pyc -> casatools-6.7.7.4a13522.dev22+dirty/src/tools/build_env/lib64/python3.12/site-packages/setuptools/config/__pycache__
24-Aug-2026 18:42:08 copying src/tools/build_env/lib64/python3.12/site-packages/setuptools/config/__pycache__/expand.cpython-312.pyc -> casatools-6.7.7.4a13522.dev22+dirty/src/tools/build_env/lib64/python3.12/site-packages/setuptools/config/__pycache__
24-Aug-2026 18:42:08 copying src/tools/build_env/lib64/python3.12/site-packages/setuptools/config/__pycache__/pyprojecttoml.cpython-312.pyc -> casatools-6.7.7.4a13522.dev22+dirty/src/tools/build_env/lib64/python3.12/site-packages/setuptools/config/__pycache__
24-Aug-2026 18:42:08 copying src/tools/build_env/lib64/python3.12/site-packages/setuptools/config/__pycache__/setupcfg.cpython-312.pyc -> casatools-6.7.7.4a13522.dev22+dirty/src/tools/build_env/lib64/python3.12/site-packages/setuptools/config/__pycache__
24-Aug-2026 18:42:08 copying src/tools/build_env/lib64/python3.12/site-packages/setuptools/config/_validate_pyproject/NOTICE -> casatools-6.7.7.4a13522.dev22+dirty/src/tools/build_env/lib64/python3.12/site-packages/setuptools/config/_validate_pyproject
24-Aug-2026 18:42:08 copying src/tools/build_env/lib64/python3.12/site-packages/setuptools/config/_validate_pyproject/__init__.py -> casatools-6.7.7.4a13522.dev22+dirty/src/tools/build_env/lib64/python3.12/site-packages/setuptools/config/_validate_pyproject
24-Aug-2026 18:42:08 copying src/tools/build_env/lib64/python3.12/site-packages/setuptools/config/_validate_pyproject/error_reporting.py -> casatools-6.7.7.4a13522.dev22+dirty/src/tools/build_env/lib64/python3.12/site-packages/setuptools/config/_validate_pyproject
24-Aug-2026 18:42:08 copying src/tools/build_env/lib64/python3.12/site-packages/setuptools/config/_validate_pyproject/extra_validations.py -> casatools-6.7.7.4a13522.dev22+dirty/src/tools/build_env/lib64/python3.12/site-packages/setuptools/config/_validate_pyproject
24-Aug-2026 18:42:08 copying src/tools/build_env/lib64/python3.12/site-packages/setuptools/config/_validate_pyproject/fastjsonschema_exceptions.py -> casatools-6.7.7.4a13522.dev22+dirty/src/tools/build_env/lib64/python3.12/site-packages/setuptools/config/_validate_pyproject
24-Aug-2026 18:42:08 copying src/tools/build_env/lib64/python3.12/site-packages/setuptools/config/_validate_pyproject/fastjsonschema_validations.py -> casatools-6.7.7.4a13522.dev22+dirty/src/tools/build_env/lib64/python3.12/site-packages/setuptools/config/_validate_pyproject
24-Aug-2026 18:42:08 copying src/tools/build_env/lib64/python3.12/site-packages/setuptools/config/_validate_pyproject/formats.py -> casatools-6.7.7.4a13522.dev22+dirty/src/tools/build_env/lib64/python3.12/site-packages/setuptools/config/_validate_pyproject
24-Aug-2026 18:42:08 copying src/tools/build_env/lib64/python3.12/site-packages/setuptools/config/_validate_pyproject/__pycache__/__init__.cpython-312.pyc -> casatools-6.7.7.4a13522.dev22+dirty/src/tools/build_env/lib64/python3.12/site-packages/setuptools/config/_validate_pyproject/__pycache__
24-Aug-2026 18:42:08 copying src/tools/build_env/lib64/python3.12/site-packages/setuptools/config/_validate_pyproject/__pycache__/error_reporting.cpython-312.pyc -> casatools-6.7.7.4a13522.dev22+dirty/src/tools/build_env/lib64/python3.12/site-packages/setuptools/config/_validate_pyproject/__pycache__
24-Aug-2026 18:42:08 copying src/tools/build_env/lib64/python3.12/site-packages/setuptools/config/_validate_pyproject/__pycache__/extra_validations.cpython-312.pyc -> casatools-6.7.7.4a13522.dev22+dirty/src/tools/build_env/lib64/python3.12/site-packages/setuptools/config/_validate_pyproject/__pycache__
24-Aug-2026 18:42:08 copying src/tools/build_env/lib64/python3.12/site-packages/setuptools/config/_validate_pyproject/__pycache__/fastjsonschema_exceptions.cpython-312.pyc -> casatools-6.7.7.4a13522.dev22+dirty/src/tools/build_env/lib64/python3.12/site-packages/setuptools/config/_validate_pyproject/__pycache__
24-Aug-2026 18:42:08 copying src/tools/build_env/lib64/python3.12/site-packages/setuptools/config/_validate_pyproject/__pycache__/fastjsonschema_validations.cpython-312.pyc -> casatools-6.7.7.4a13522.dev22+dirty/src/tools/build_env/lib64/python3.12/site-packages/setuptools/config/_validate_pyproject/__pycache__
24-Aug-2026 18:42:08 copying src/tools/build_env/lib64/python3.12/site-packages/setuptools/config/_validate_pyproject/__pycache__/formats.cpython-312.pyc -> casatools-6.7.7.4a13522.dev22+dirty/src/tools/build_env/lib64/python3.12/site-packages/setuptools/config/_validate_pyproject/__pycache__
24-Aug-2026 18:42:08 copying src/tools/build_env/lib64/python3.12/site-packages/wheel/__init__.py -> casatools-6.7.7.4a13522.dev22+dirty/src/tools/build_env/lib64/python3.12/site-packages/wheel
24-Aug-2026 18:42:08 copying src/tools/build_env/lib64/python3.12/site-packages/wheel/__main__.py -> casatools-6.7.7.4a13522.dev22+dirty/src/tools/build_env/lib64/python3.12/site-packages/wheel
24-Aug-2026 18:42:08 copying src/tools/build_env/lib64/python3.12/site-packages/wheel/_bdist_wheel.py -> casatools-6.7.7.4a13522.dev22+dirty/src/tools/build_env/lib64/python3.12/site-packages/wheel
24-Aug-2026 18:42:08 copying src/tools/build_env/lib64/python3.12/site-packages/wheel/_metadata.py -> casatools-6.7.7.4a13522.dev22+dirty/src/tools/build_env/lib64/python3.12/site-packages/wheel
24-Aug-2026 18:42:08 copying src/tools/build_env/lib64/python3.12/site-packages/wheel/_setuptools_logging.py -> casatools-6.7.7.4a13522.dev22+dirty/src/tools/build_env/lib64/python3.12/site-packages/wheel
24-Aug-2026 18:42:08 copying src/tools/build_env/lib64/python3.12/site-packages/wheel/bdist_wheel.py -> casatools-6.7.7.4a13522.dev22+dirty/src/tools/build_env/lib64/python3.12/site-packages/wheel
24-Aug-2026 18:42:08 copying src/tools/build_env/lib64/python3.12/site-packages/wheel/macosx_libfile.py -> casatools-6.7.7.4a13522.dev22+dirty/src/tools/build_env/lib64/python3.12/site-packages/wheel
24-Aug-2026 18:42:08 copying src/tools/build_env/lib64/python3.12/site-packages/wheel/metadata.py -> casatools-6.7.7.4a13522.dev22+dirty/src/tools/build_env/lib64/python3.12/site-packages/wheel
24-Aug-2026 18:42:08 copying src/tools/build_env/lib64/python3.12/site-packages/wheel/wheelfile.py -> casatools-6.7.7.4a13522.dev22+dirty/src/tools/build_env/lib64/python3.12/site-packages/wheel
24-Aug-2026 18:42:08 copying src/tools/build_env/lib64/python3.12/site-packages/wheel-0.48.0.dist-info/INSTALLER -> casatools-6.7.7.4a13522.dev22+dirty/src/tools/build_env/lib64/python3.12/site-packages/wheel-0.48.0.dist-info
24-Aug-2026 18:42:08 copying src/tools/build_env/lib64/python3.12/site-packages/wheel-0.48.0.dist-info/METADATA -> casatools-6.7.7.4a13522.dev22+dirty/src/tools/build_env/lib64/python3.12/site-packages/wheel-0.48.0.dist-info
24-Aug-2026 18:42:08 copying src/tools/build_env/lib64/python3.12/site-packages/wheel-0.48.0.dist-info/RECORD -> casatools-6.7.7.4a13522.dev22+dirty/src/tools/build_env/lib64/python3.12/site-packages/wheel-0.48.0.dist-info
24-Aug-2026 18:42:08 copying src/tools/build_env/lib64/python3.12/site-packages/wheel-0.48.0.dist-info/REQUESTED -> casatools-6.7.7.4a13522.dev22+dirty/src/tools/build_env/lib64/python3.12/site-packages/wheel-0.48.0.dist-info
24-Aug-2026 18:42:08 copying src/tools/build_env/lib64/python3.12/site-packages/wheel-0.48.0.dist-info/WHEEL -> casatools-6.7.7.4a13522.dev22+dirty/src/tools/build_env/lib64/python3.12/site-packages/wheel-0.48.0.dist-info
24-Aug-2026 18:42:08 copying src/tools/build_env/lib64/python3.12/site-packages/wheel-0.48.0.dist-info/entry_points.txt -> casatools-6.7.7.4a13522.dev22+dirty/src/tools/build_env/lib64/python3.12/site-packages/wheel-0.48.0.dist-info
24-Aug-2026 18:42:08 copying src/tools/build_env/lib64/python3.12/site-packages/wheel-0.48.0.dist-info/licenses/LICENSE.txt -> casatools-6.7.7.4a13522.dev22+dirty/src/tools/build_env/lib64/python3.12/site-packages/wheel-0.48.0.dist-info/licenses
24-Aug-2026 18:42:08 copying src/tools/build_env/lib64/python3.12/site-packages/wheel/__pycache__/__init__.cpython-312.pyc -> casatools-6.7.7.4a13522.dev22+dirty/src/tools/build_env/lib64/python3.12/site-packages/wheel/__pycache__
24-Aug-2026 18:42:08 copying src/tools/build_env/lib64/python3.12/site-packages/wheel/__pycache__/__main__.cpython-312.pyc -> casatools-6.7.7.4a13522.dev22+dirty/src/tools/build_env/lib64/python3.12/site-packages/wheel/__pycache__
24-Aug-2026 18:42:08 copying src/tools/build_env/lib64/python3.12/site-packages/wheel/__pycache__/_bdist_wheel.cpython-312.pyc -> casatools-6.7.7.4a13522.dev22+dirty/src/tools/build_env/lib64/python3.12/site-packages/wheel/__pycache__
24-Aug-2026 18:42:09 copying src/tools/build_env/lib64/python3.12/site-packages/wheel/__pycache__/_metadata.cpython-312.pyc -> casatools-6.7.7.4a13522.dev22+dirty/src/tools/build_env/lib64/python3.12/site-packages/wheel/__pycache__
24-Aug-2026 18:42:09 copying src/tools/build_env/lib64/python3.12/site-packages/wheel/__pycache__/_setuptools_logging.cpython-312.pyc -> casatools-6.7.7.4a13522.dev22+dirty/src/tools/build_env/lib64/python3.12/site-packages/wheel/__pycache__
24-Aug-2026 18:42:09 copying src/tools/build_env/lib64/python3.12/site-packages/wheel/__pycache__/bdist_wheel.cpython-312.pyc -> casatools-6.7.7.4a13522.dev22+dirty/src/tools/build_env/lib64/python3.12/site-packages/wheel/__pycache__
24-Aug-2026 18:42:09 copying src/tools/build_env/lib64/python3.12/site-packages/wheel/__pycache__/macosx_libfile.cpython-312.pyc -> casatools-6.7.7.4a13522.dev22+dirty/src/tools/build_env/lib64/python3.12/site-packages/wheel/__pycache__
24-Aug-2026 18:42:09 copying src/tools/build_env/lib64/python3.12/site-packages/wheel/__pycache__/metadata.cpython-312.pyc -> casatools-6.7.7.4a13522.dev22+dirty/src/tools/build_env/lib64/python3.12/site-packages/wheel/__pycache__
24-Aug-2026 18:42:09 copying src/tools/build_env/lib64/python3.12/site-packages/wheel/__pycache__/wheelfile.cpython-312.pyc -> casatools-6.7.7.4a13522.dev22+dirty/src/tools/build_env/lib64/python3.12/site-packages/wheel/__pycache__
24-Aug-2026 18:42:09 copying src/tools/build_env/lib64/python3.12/site-packages/wheel/_commands/__init__.py -> casatools-6.7.7.4a13522.dev22+dirty/src/tools/build_env/lib64/python3.12/site-packages/wheel/_commands
24-Aug-2026 18:42:09 copying src/tools/build_env/lib64/python3.12/site-packages/wheel/_commands/convert.py -> casatools-6.7.7.4a13522.dev22+dirty/src/tools/build_env/lib64/python3.12/site-packages/wheel/_commands
24-Aug-2026 18:42:09 copying src/tools/build_env/lib64/python3.12/site-packages/wheel/_commands/info.py -> casatools-6.7.7.4a13522.dev22+dirty/src/tools/build_env/lib64/python3.12/site-packages/wheel/_commands
24-Aug-2026 18:42:09 copying src/tools/build_env/lib64/python3.12/site-packages/wheel/_commands/pack.py -> casatools-6.7.7.4a13522.dev22+dirty/src/tools/build_env/lib64/python3.12/site-packages/wheel/_commands
24-Aug-2026 18:42:09 copying src/tools/build_env/lib64/python3.12/site-packages/wheel/_commands/tags.py -> casatools-6.7.7.4a13522.dev22+dirty/src/tools/build_env/lib64/python3.12/site-packages/wheel/_commands
24-Aug-2026 18:42:09 copying src/tools/build_env/lib64/python3.12/site-packages/wheel/_commands/unpack.py -> casatools-6.7.7.4a13522.dev22+dirty/src/tools/build_env/lib64/python3.12/site-packages/wheel/_commands
24-Aug-2026 18:42:09 copying src/tools/build_env/lib64/python3.12/site-packages/wheel/_commands/__pycache__/__init__.cpython-312.pyc -> casatools-6.7.7.4a13522.dev22+dirty/src/tools/build_env/lib64/python3.12/site-packages/wheel/_commands/__pycache__
24-Aug-2026 18:42:09 copying src/tools/build_env/lib64/python3.12/site-packages/wheel/_commands/__pycache__/convert.cpython-312.pyc -> casatools-6.7.7.4a13522.dev22+dirty/src/tools/build_env/lib64/python3.12/site-packages/wheel/_commands/__pycache__
24-Aug-2026 18:42:09 copying src/tools/build_env/lib64/python3.12/site-packages/wheel/_commands/__pycache__/info.cpython-312.pyc -> casatools-6.7.7.4a13522.dev22+dirty/src/tools/build_env/lib64/python3.12/site-packages/wheel/_commands/__pycache__
24-Aug-2026 18:42:09 copying src/tools/build_env/lib64/python3.12/site-packages/wheel/_commands/__pycache__/pack.cpython-312.pyc -> casatools-6.7.7.4a13522.dev22+dirty/src/tools/build_env/lib64/python3.12/site-packages/wheel/_commands/__pycache__
24-Aug-2026 18:42:09 copying src/tools/build_env/lib64/python3.12/site-packages/wheel/_commands/__pycache__/tags.cpython-312.pyc -> casatools-6.7.7.4a13522.dev22+dirty/src/tools/build_env/lib64/python3.12/site-packages/wheel/_commands/__pycache__
24-Aug-2026 18:42:09 copying src/tools/build_env/lib64/python3.12/site-packages/wheel/_commands/__pycache__/unpack.cpython-312.pyc -> casatools-6.7.7.4a13522.dev22+dirty/src/tools/build_env/lib64/python3.12/site-packages/wheel/_commands/__pycache__
24-Aug-2026 18:42:09 copying src/tools/calanalysis/calanalysis_cmpt.cc -> casatools-6.7.7.4a13522.dev22+dirty/src/tools/calanalysis
24-Aug-2026 18:42:09 copying src/tools/calanalysis/calanalysis_forward.h -> casatools-6.7.7.4a13522.dev22+dirty/src/tools/calanalysis
24-Aug-2026 18:42:09 copying src/tools/calanalysis/calanalysis_private.h -> casatools-6.7.7.4a13522.dev22+dirty/src/tools/calanalysis
24-Aug-2026 18:42:09 copying src/tools/calanalysis/calanalysis_template.h -> casatools-6.7.7.4a13522.dev22+dirty/src/tools/calanalysis
24-Aug-2026 18:42:09 copying src/tools/calibrater/calibrater_cmpt.cc -> casatools-6.7.7.4a13522.dev22+dirty/src/tools/calibrater
24-Aug-2026 18:42:09 copying src/tools/calibrater/calibrater_forward.h -> casatools-6.7.7.4a13522.dev22+dirty/src/tools/calibrater
24-Aug-2026 18:42:09 copying src/tools/calibrater/calibrater_private.h -> casatools-6.7.7.4a13522.dev22+dirty/src/tools/calibrater
24-Aug-2026 18:42:09 copying src/tools/componentlist/componentlist_cmpt.cc -> casatools-6.7.7.4a13522.dev22+dirty/src/tools/componentlist
24-Aug-2026 18:42:09 copying src/tools/componentlist/componentlist_forward.h -> casatools-6.7.7.4a13522.dev22+dirty/src/tools/componentlist
24-Aug-2026 18:42:09 copying src/tools/componentlist/componentlist_private.h -> casatools-6.7.7.4a13522.dev22+dirty/src/tools/componentlist
24-Aug-2026 18:42:09 copying src/tools/coordsys/coordsys_cmpt.cc -> casatools-6.7.7.4a13522.dev22+dirty/src/tools/coordsys
24-Aug-2026 18:42:09 copying src/tools/coordsys/coordsys_forward.h -> casatools-6.7.7.4a13522.dev22+dirty/src/tools/coordsys
24-Aug-2026 18:42:09 copying src/tools/coordsys/coordsys_private.h -> casatools-6.7.7.4a13522.dev22+dirty/src/tools/coordsys
24-Aug-2026 18:42:09 copying src/tools/functional/functional_cmpt.cc -> casatools-6.7.7.4a13522.dev22+dirty/src/tools/functional
24-Aug-2026 18:42:09 copying src/tools/functional/functional_forward.h -> casatools-6.7.7.4a13522.dev22+dirty/src/tools/functional
24-Aug-2026 18:42:09 copying src/tools/functional/functional_private.h -> casatools-6.7.7.4a13522.dev22+dirty/src/tools/functional
24-Aug-2026 18:42:09 copying src/tools/image/image_cmpt.cc -> casatools-6.7.7.4a13522.dev22+dirty/src/tools/image
24-Aug-2026 18:42:09 copying src/tools/image/image_fitsheader.cc -> casatools-6.7.7.4a13522.dev22+dirty/src/tools/image
24-Aug-2026 18:42:09 copying src/tools/image/image_forward.h -> casatools-6.7.7.4a13522.dev22+dirty/src/tools/image
24-Aug-2026 18:42:09 copying src/tools/image/image_private.h -> casatools-6.7.7.4a13522.dev22+dirty/src/tools/image
24-Aug-2026 18:42:09 copying src/tools/imagemetadata/imagemetadata_cmpt.cc -> casatools-6.7.7.4a13522.dev22+dirty/src/tools/imagemetadata
24-Aug-2026 18:42:09 copying src/tools/imagemetadata/imagemetadata_forward.h -> casatools-6.7.7.4a13522.dev22+dirty/src/tools/imagemetadata
24-Aug-2026 18:42:09 copying src/tools/imagemetadata/imagemetadata_private.h -> casatools-6.7.7.4a13522.dev22+dirty/src/tools/imagemetadata
24-Aug-2026 18:42:09 copying src/tools/imagepol/imagepol_cmpt.cc -> casatools-6.7.7.4a13522.dev22+dirty/src/tools/imagepol
24-Aug-2026 18:42:09 copying src/tools/imagepol/imagepol_forward.h -> casatools-6.7.7.4a13522.dev22+dirty/src/tools/imagepol
24-Aug-2026 18:42:09 copying src/tools/imagepol/imagepol_private.h -> casatools-6.7.7.4a13522.dev22+dirty/src/tools/imagepol
24-Aug-2026 18:42:09 copying src/tools/imager/imager_cmpt.cc -> casatools-6.7.7.4a13522.dev22+dirty/src/tools/imager
24-Aug-2026 18:42:09 copying src/tools/imager/imager_forward.h -> casatools-6.7.7.4a13522.dev22+dirty/src/tools/imager
24-Aug-2026 18:42:09 copying src/tools/imager/imager_private.h -> casatools-6.7.7.4a13522.dev22+dirty/src/tools/imager
24-Aug-2026 18:42:09 copying src/tools/iterbotsink/iterbotsink_cmpt.cc -> casatools-6.7.7.4a13522.dev22+dirty/src/tools/iterbotsink
24-Aug-2026 18:42:09 copying src/tools/iterbotsink/iterbotsink_forward.h -> casatools-6.7.7.4a13522.dev22+dirty/src/tools/iterbotsink
24-Aug-2026 18:42:09 copying src/tools/iterbotsink/iterbotsink_private.h -> casatools-6.7.7.4a13522.dev22+dirty/src/tools/iterbotsink
24-Aug-2026 18:42:09 copying src/tools/linearmosaic/linearmosaic_cmpt.cc -> casatools-6.7.7.4a13522.dev22+dirty/src/tools/linearmosaic
24-Aug-2026 18:42:09 copying src/tools/linearmosaic/linearmosaic_forward.h -> casatools-6.7.7.4a13522.dev22+dirty/src/tools/linearmosaic
24-Aug-2026 18:42:09 copying src/tools/linearmosaic/linearmosaic_private.h -> casatools-6.7.7.4a13522.dev22+dirty/src/tools/linearmosaic
24-Aug-2026 18:42:09 copying src/tools/logsink/logsink_cmpt.cc -> casatools-6.7.7.4a13522.dev22+dirty/src/tools/logsink
24-Aug-2026 18:42:09 copying src/tools/logsink/logsink_forward.h -> casatools-6.7.7.4a13522.dev22+dirty/src/tools/logsink
24-Aug-2026 18:42:09 copying src/tools/logsink/logsink_private.h -> casatools-6.7.7.4a13522.dev22+dirty/src/tools/logsink
24-Aug-2026 18:42:09 copying src/tools/measures/measures_cmpt.cc -> casatools-6.7.7.4a13522.dev22+dirty/src/tools/measures
24-Aug-2026 18:42:09 copying src/tools/measures/measures_forward.h -> casatools-6.7.7.4a13522.dev22+dirty/src/tools/measures
24-Aug-2026 18:42:09 copying src/tools/measures/measures_private.h -> casatools-6.7.7.4a13522.dev22+dirty/src/tools/measures
24-Aug-2026 18:42:09 copying src/tools/miriadfiller/miriadfiller_cmpt.cc -> casatools-6.7.7.4a13522.dev22+dirty/src/tools/miriadfiller
24-Aug-2026 18:42:09 copying src/tools/ms/ms_cmpt.cc -> casatools-6.7.7.4a13522.dev22+dirty/src/tools/ms
24-Aug-2026 18:42:09 copying src/tools/ms/ms_forward.h -> casatools-6.7.7.4a13522.dev22+dirty/src/tools/ms
24-Aug-2026 18:42:09 copying src/tools/ms/ms_private.h -> casatools-6.7.7.4a13522.dev22+dirty/src/tools/ms
24-Aug-2026 18:42:09 copying src/tools/msmetadata/msmetadata_cmpt.cc -> casatools-6.7.7.4a13522.dev22+dirty/src/tools/msmetadata
24-Aug-2026 18:42:09 copying src/tools/msmetadata/msmetadata_forward.h -> casatools-6.7.7.4a13522.dev22+dirty/src/tools/msmetadata
24-Aug-2026 18:42:09 copying src/tools/msmetadata/msmetadata_private.h -> casatools-6.7.7.4a13522.dev22+dirty/src/tools/msmetadata
24-Aug-2026 18:42:09 copying src/tools/mstransformer/mstransformer_cmpt.cc -> casatools-6.7.7.4a13522.dev22+dirty/src/tools/mstransformer
24-Aug-2026 18:42:09 copying src/tools/mstransformer/mstransformer_forward.h -> casatools-6.7.7.4a13522.dev22+dirty/src/tools/mstransformer
24-Aug-2026 18:42:09 copying src/tools/mstransformer/mstransformer_private.h -> casatools-6.7.7.4a13522.dev22+dirty/src/tools/mstransformer
24-Aug-2026 18:42:09 copying src/tools/msuvbinner/msuvbinner_cmpt.cc -> casatools-6.7.7.4a13522.dev22+dirty/src/tools/msuvbinner
24-Aug-2026 18:42:09 copying src/tools/msuvbinner/msuvbinner_forward.h -> casatools-6.7.7.4a13522.dev22+dirty/src/tools/msuvbinner
24-Aug-2026 18:42:09 copying src/tools/msuvbinner/msuvbinner_private.h -> casatools-6.7.7.4a13522.dev22+dirty/src/tools/msuvbinner
24-Aug-2026 18:42:09 copying src/tools/quanta/quanta_cmpt.cc -> casatools-6.7.7.4a13522.dev22+dirty/src/tools/quanta
24-Aug-2026 18:42:09 copying src/tools/quanta/quanta_forward.h -> casatools-6.7.7.4a13522.dev22+dirty/src/tools/quanta
24-Aug-2026 18:42:09 copying src/tools/quanta/quanta_private.h -> casatools-6.7.7.4a13522.dev22+dirty/src/tools/quanta
24-Aug-2026 18:42:09 copying src/tools/regionmanager/regionmanager_cmpt.cc -> casatools-6.7.7.4a13522.dev22+dirty/src/tools/regionmanager
24-Aug-2026 18:42:09 copying src/tools/regionmanager/regionmanager_forward.h -> casatools-6.7.7.4a13522.dev22+dirty/src/tools/regionmanager
24-Aug-2026 18:42:09 copying src/tools/regionmanager/regionmanager_private.h -> casatools-6.7.7.4a13522.dev22+dirty/src/tools/regionmanager
24-Aug-2026 18:42:09 copying src/tools/sakura/sakura_cmpt.cc -> casatools-6.7.7.4a13522.dev22+dirty/src/tools/sakura
24-Aug-2026 18:42:09 copying src/tools/sakura/sakura_forward.h -> casatools-6.7.7.4a13522.dev22+dirty/src/tools/sakura
24-Aug-2026 18:42:09 copying src/tools/sakura/sakura_private.h -> casatools-6.7.7.4a13522.dev22+dirty/src/tools/sakura
24-Aug-2026 18:42:09 copying src/tools/sdm/ASDM2MSException.h -> casatools-6.7.7.4a13522.dev22+dirty/src/tools/sdm
24-Aug-2026 18:42:09 copying src/tools/sdm/ASDM2MSFiller.cc -> casatools-6.7.7.4a13522.dev22+dirty/src/tools/sdm
24-Aug-2026 18:42:09 copying src/tools/sdm/ASDM2MSFiller.h -> casatools-6.7.7.4a13522.dev22+dirty/src/tools/sdm
24-Aug-2026 18:42:09 copying src/tools/sdm/ASDMTableBase.cc -> casatools-6.7.7.4a13522.dev22+dirty/src/tools/sdm
24-Aug-2026 18:42:09 copying src/tools/sdm/ASDMTableBase.h -> casatools-6.7.7.4a13522.dev22+dirty/src/tools/sdm
24-Aug-2026 18:42:09 copying src/tools/sdm/ASDMTables.cc -> casatools-6.7.7.4a13522.dev22+dirty/src/tools/sdm
24-Aug-2026 18:42:09 copying src/tools/sdm/ASDMTables.h -> casatools-6.7.7.4a13522.dev22+dirty/src/tools/sdm
24-Aug-2026 18:42:09 copying src/tools/sdm/ASDMVerbatimFiller.cc -> casatools-6.7.7.4a13522.dev22+dirty/src/tools/sdm
24-Aug-2026 18:42:09 copying src/tools/sdm/ASDMVerbatimFiller.h -> casatools-6.7.7.4a13522.dev22+dirty/src/tools/sdm
24-Aug-2026 18:42:09 copying src/tools/sdm/BDF2AsdmStManIndex.cc -> casatools-6.7.7.4a13522.dev22+dirty/src/tools/sdm
24-Aug-2026 18:42:09 copying src/tools/sdm/BDF2AsdmStManIndex.h -> casatools-6.7.7.4a13522.dev22+dirty/src/tools/sdm
24-Aug-2026 18:42:09 copying src/tools/sdm/BdFlagger.inc -> casatools-6.7.7.4a13522.dev22+dirty/src/tools/sdm
24-Aug-2026 18:42:09 copying src/tools/sdm/Name2Table.cc -> casatools-6.7.7.4a13522.dev22+dirty/src/tools/sdm
24-Aug-2026 18:42:09 copying src/tools/sdm/Name2Table.h -> casatools-6.7.7.4a13522.dev22+dirty/src/tools/sdm
24-Aug-2026 18:42:09 copying src/tools/sdm/SDMMSTooLargeException.h -> casatools-6.7.7.4a13522.dev22+dirty/src/tools/sdm
24-Aug-2026 18:42:09 copying src/tools/sdm/ScansParser.cc -> casatools-6.7.7.4a13522.dev22+dirty/src/tools/sdm
24-Aug-2026 18:42:09 copying src/tools/sdm/ScansParser.h -> casatools-6.7.7.4a13522.dev22+dirty/src/tools/sdm
24-Aug-2026 18:42:09 copying src/tools/sdm/UvwCoords.cc -> casatools-6.7.7.4a13522.dev22+dirty/src/tools/sdm
24-Aug-2026 18:42:09 copying src/tools/sdm/UvwCoords.h -> casatools-6.7.7.4a13522.dev22+dirty/src/tools/sdm
24-Aug-2026 18:42:09 copying src/tools/sdm/asdm2MSGeneric.h -> casatools-6.7.7.4a13522.dev22+dirty/src/tools/sdm
24-Aug-2026 18:42:09 copying src/tools/sdm/sdm_cmpt.cc -> casatools-6.7.7.4a13522.dev22+dirty/src/tools/sdm
24-Aug-2026 18:42:09 copying src/tools/sdm/sdm_forward.h -> casatools-6.7.7.4a13522.dev22+dirty/src/tools/sdm
24-Aug-2026 18:42:09 copying src/tools/sdm/sdm_private.h -> casatools-6.7.7.4a13522.dev22+dirty/src/tools/sdm
24-Aug-2026 18:42:09 copying src/tools/sidebandseparator/sidebandseparator_cmpt.cc -> casatools-6.7.7.4a13522.dev22+dirty/src/tools/sidebandseparator
24-Aug-2026 18:42:09 copying src/tools/sidebandseparator/sidebandseparator_forward.h -> casatools-6.7.7.4a13522.dev22+dirty/src/tools/sidebandseparator
24-Aug-2026 18:42:09 copying src/tools/sidebandseparator/sidebandseparator_private.h -> casatools-6.7.7.4a13522.dev22+dirty/src/tools/sidebandseparator
24-Aug-2026 18:42:09 copying src/tools/simulator/simulator_cmpt.cc -> casatools-6.7.7.4a13522.dev22+dirty/src/tools/simulator
24-Aug-2026 18:42:09 copying src/tools/simulator/simulator_forward.h -> casatools-6.7.7.4a13522.dev22+dirty/src/tools/simulator
24-Aug-2026 18:42:09 copying src/tools/simulator/simulator_private.h -> casatools-6.7.7.4a13522.dev22+dirty/src/tools/simulator
24-Aug-2026 18:42:09 copying src/tools/singledishms/singledishms_cmpt.cc -> casatools-6.7.7.4a13522.dev22+dirty/src/tools/singledishms
24-Aug-2026 18:42:09 copying src/tools/singledishms/singledishms_forward.h -> casatools-6.7.7.4a13522.dev22+dirty/src/tools/singledishms
24-Aug-2026 18:42:09 copying src/tools/singledishms/singledishms_private.h -> casatools-6.7.7.4a13522.dev22+dirty/src/tools/singledishms
24-Aug-2026 18:42:09 copying src/tools/spectralline/spectralline_cmpt.cc -> casatools-6.7.7.4a13522.dev22+dirty/src/tools/spectralline
24-Aug-2026 18:42:09 copying src/tools/spectralline/spectralline_forward.h -> casatools-6.7.7.4a13522.dev22+dirty/src/tools/spectralline
24-Aug-2026 18:42:09 copying src/tools/spectralline/spectralline_private.h -> casatools-6.7.7.4a13522.dev22+dirty/src/tools/spectralline
24-Aug-2026 18:42:09 copying src/tools/synthesisdeconvolver/synthesisdeconvolver_cmpt.cc -> casatools-6.7.7.4a13522.dev22+dirty/src/tools/synthesisdeconvolver
24-Aug-2026 18:42:09 copying src/tools/synthesisdeconvolver/synthesisdeconvolver_forward.h -> casatools-6.7.7.4a13522.dev22+dirty/src/tools/synthesisdeconvolver
24-Aug-2026 18:42:09 copying src/tools/synthesisdeconvolver/synthesisdeconvolver_private.h -> casatools-6.7.7.4a13522.dev22+dirty/src/tools/synthesisdeconvolver
24-Aug-2026 18:42:09 copying src/tools/synthesisimager/synthesisimager_cmpt.cc -> casatools-6.7.7.4a13522.dev22+dirty/src/tools/synthesisimager
24-Aug-2026 18:42:09 copying src/tools/synthesisimager/synthesisimager_forward.h -> casatools-6.7.7.4a13522.dev22+dirty/src/tools/synthesisimager
24-Aug-2026 18:42:09 copying src/tools/synthesisimager/synthesisimager_private.h -> casatools-6.7.7.4a13522.dev22+dirty/src/tools/synthesisimager
24-Aug-2026 18:42:09 copying src/tools/synthesisimstore/synthesisimstore_cmpt.cc -> casatools-6.7.7.4a13522.dev22+dirty/src/tools/synthesisimstore
24-Aug-2026 18:42:09 copying src/tools/synthesisimstore/synthesisimstore_forward.h -> casatools-6.7.7.4a13522.dev22+dirty/src/tools/synthesisimstore
24-Aug-2026 18:42:09 copying src/tools/synthesisimstore/synthesisimstore_private.h -> casatools-6.7.7.4a13522.dev22+dirty/src/tools/synthesisimstore
24-Aug-2026 18:42:09 copying src/tools/synthesismaskhandler/synthesismaskhandler_cmpt.cc -> casatools-6.7.7.4a13522.dev22+dirty/src/tools/synthesismaskhandler
24-Aug-2026 18:42:09 copying src/tools/synthesismaskhandler/synthesismaskhandler_forward.h -> casatools-6.7.7.4a13522.dev22+dirty/src/tools/synthesismaskhandler
24-Aug-2026 18:42:09 copying src/tools/synthesismaskhandler/synthesismaskhandler_private.h -> casatools-6.7.7.4a13522.dev22+dirty/src/tools/synthesismaskhandler
24-Aug-2026 18:42:09 copying src/tools/synthesisnormalizer/synthesisnormalizer_cmpt.cc -> casatools-6.7.7.4a13522.dev22+dirty/src/tools/synthesisnormalizer
24-Aug-2026 18:42:09 copying src/tools/synthesisnormalizer/synthesisnormalizer_forward.h -> casatools-6.7.7.4a13522.dev22+dirty/src/tools/synthesisnormalizer
24-Aug-2026 18:42:09 copying src/tools/synthesisnormalizer/synthesisnormalizer_private.h -> casatools-6.7.7.4a13522.dev22+dirty/src/tools/synthesisnormalizer
24-Aug-2026 18:42:09 copying src/tools/synthesisutils/synthesisutils_cmpt.cc -> casatools-6.7.7.4a13522.dev22+dirty/src/tools/synthesisutils
24-Aug-2026 18:42:09 copying src/tools/synthesisutils/synthesisutils_forward.h -> casatools-6.7.7.4a13522.dev22+dirty/src/tools/synthesisutils
24-Aug-2026 18:42:09 copying src/tools/synthesisutils/synthesisutils_private.h -> casatools-6.7.7.4a13522.dev22+dirty/src/tools/synthesisutils
24-Aug-2026 18:42:09 copying src/tools/table/asdmCasaSaxHandler.cc -> casatools-6.7.7.4a13522.dev22+dirty/src/tools/table
24-Aug-2026 18:42:09 copying src/tools/table/asdmCasaSaxHandler.h -> casatools-6.7.7.4a13522.dev22+dirty/src/tools/table
24-Aug-2026 18:42:09 copying src/tools/table/asdmCasaXMLUtil.cc -> casatools-6.7.7.4a13522.dev22+dirty/src/tools/table
24-Aug-2026 18:42:09 copying src/tools/table/asdmCasaXMLUtil.h -> casatools-6.7.7.4a13522.dev22+dirty/src/tools/table
24-Aug-2026 18:42:09 copying src/tools/table/table_cmpt.cc -> casatools-6.7.7.4a13522.dev22+dirty/src/tools/table
24-Aug-2026 18:42:09 copying src/tools/table/table_forward.h -> casatools-6.7.7.4a13522.dev22+dirty/src/tools/table
24-Aug-2026 18:42:09 copying src/tools/table/table_getcoliter.cc -> casatools-6.7.7.4a13522.dev22+dirty/src/tools/table
24-Aug-2026 18:42:09 copying src/tools/table/table_private.h -> casatools-6.7.7.4a13522.dev22+dirty/src/tools/table
24-Aug-2026 18:42:09 copying src/tools/tablerow/tablerow_cmpt.cc -> casatools-6.7.7.4a13522.dev22+dirty/src/tools/tablerow
24-Aug-2026 18:42:09 copying src/tools/tablerow/tablerow_forward.h -> casatools-6.7.7.4a13522.dev22+dirty/src/tools/tablerow
24-Aug-2026 18:42:09 copying src/tools/tablerow/tablerow_private.h -> casatools-6.7.7.4a13522.dev22+dirty/src/tools/tablerow
24-Aug-2026 18:42:09 copying src/tools/utils/BaseInterface.cc -> casatools-6.7.7.4a13522.dev22+dirty/src/tools/utils
24-Aug-2026 18:42:09 copying src/tools/utils/BaseInterface.h -> casatools-6.7.7.4a13522.dev22+dirty/src/tools/utils
24-Aug-2026 18:42:09 copying src/tools/utils/stdBaseInterface.cc -> casatools-6.7.7.4a13522.dev22+dirty/src/tools/utils
24-Aug-2026 18:42:09 copying src/tools/utils/stdBaseInterface.h -> casatools-6.7.7.4a13522.dev22+dirty/src/tools/utils
24-Aug-2026 18:42:09 copying src/tools/utils/utils_cmpt.cc -> casatools-6.7.7.4a13522.dev22+dirty/src/tools/utils
24-Aug-2026 18:42:09 copying src/tools/utils/utils_forward.h -> casatools-6.7.7.4a13522.dev22+dirty/src/tools/utils
24-Aug-2026 18:42:09 copying src/tools/utils/utils_private.h -> casatools-6.7.7.4a13522.dev22+dirty/src/tools/utils
24-Aug-2026 18:42:09 copying src/tools/vlafiller/vlafiller_cmpt.cc -> casatools-6.7.7.4a13522.dev22+dirty/src/tools/vlafiller
24-Aug-2026 18:42:09 copying src/tools/vpmanager/vpmanager_cmpt.cc -> casatools-6.7.7.4a13522.dev22+dirty/src/tools/vpmanager
24-Aug-2026 18:42:09 copying src/tools/vpmanager/vpmanager_forward.h -> casatools-6.7.7.4a13522.dev22+dirty/src/tools/vpmanager
24-Aug-2026 18:42:09 copying src/tools/vpmanager/vpmanager_private.h -> casatools-6.7.7.4a13522.dev22+dirty/src/tools/vpmanager
24-Aug-2026 18:42:09 copying src/tools/wvr/wvr_cmpt.cc -> casatools-6.7.7.4a13522.dev22+dirty/src/tools/wvr
24-Aug-2026 18:42:09 copying src/tools/wvr/wvr_forward.h -> casatools-6.7.7.4a13522.dev22+dirty/src/tools/wvr
24-Aug-2026 18:42:09 copying src/tools/wvr/wvr_private.h -> casatools-6.7.7.4a13522.dev22+dirty/src/tools/wvr
24-Aug-2026 18:42:09 copying src/tools/wvr/wvrgcalargs.h -> casatools-6.7.7.4a13522.dev22+dirty/src/tools/wvr
24-Aug-2026 18:42:09 copying src/tools/wvr/wvrgcalerrors.cc -> casatools-6.7.7.4a13522.dev22+dirty/src/tools/wvr
24-Aug-2026 18:42:09 copying src/tools/wvr/wvrgcalerrors.h -> casatools-6.7.7.4a13522.dev22+dirty/src/tools/wvr
24-Aug-2026 18:42:09 copying src/tools/wvr/wvrgcalfeedback.cc -> casatools-6.7.7.4a13522.dev22+dirty/src/tools/wvr
24-Aug-2026 18:42:09 copying src/tools/wvr/wvrgcalfeedback.h -> casatools-6.7.7.4a13522.dev22+dirty/src/tools/wvr
24-Aug-2026 18:42:09 copying xml/agentflagger.xml -> casatools-6.7.7.4a13522.dev22+dirty/xml
24-Aug-2026 18:42:09 copying xml/atcafiller.xml -> casatools-6.7.7.4a13522.dev22+dirty/xml
24-Aug-2026 18:42:09 copying xml/atmosphere.xml -> casatools-6.7.7.4a13522.dev22+dirty/xml
24-Aug-2026 18:42:09 copying xml/calanalysis.xml -> casatools-6.7.7.4a13522.dev22+dirty/xml
24-Aug-2026 18:42:09 copying xml/calibrater.xml -> casatools-6.7.7.4a13522.dev22+dirty/xml
24-Aug-2026 18:42:09 copying xml/componentlist.xml -> casatools-6.7.7.4a13522.dev22+dirty/xml
24-Aug-2026 18:42:09 copying xml/coordsys.xml -> casatools-6.7.7.4a13522.dev22+dirty/xml
24-Aug-2026 18:42:09 copying xml/functional.xml -> casatools-6.7.7.4a13522.dev22+dirty/xml
24-Aug-2026 18:42:09 copying xml/image.xml -> casatools-6.7.7.4a13522.dev22+dirty/xml
24-Aug-2026 18:42:09 copying xml/imagemetadata.xml -> casatools-6.7.7.4a13522.dev22+dirty/xml
24-Aug-2026 18:42:09 copying xml/imagepol.xml -> casatools-6.7.7.4a13522.dev22+dirty/xml
24-Aug-2026 18:42:09 copying xml/imager.xml -> casatools-6.7.7.4a13522.dev22+dirty/xml
24-Aug-2026 18:42:09 copying xml/iterbotsink.xml -> casatools-6.7.7.4a13522.dev22+dirty/xml
24-Aug-2026 18:42:09 copying xml/linearmosaic.xml -> casatools-6.7.7.4a13522.dev22+dirty/xml
24-Aug-2026 18:42:09 copying xml/logsink.xml -> casatools-6.7.7.4a13522.dev22+dirty/xml
24-Aug-2026 18:42:09 copying xml/measures.xml -> casatools-6.7.7.4a13522.dev22+dirty/xml
24-Aug-2026 18:42:09 copying xml/miriadfiller.xml -> casatools-6.7.7.4a13522.dev22+dirty/xml
24-Aug-2026 18:42:09 copying xml/ms.xml -> casatools-6.7.7.4a13522.dev22+dirty/xml
24-Aug-2026 18:42:55 copying xml/msmetadata.xml -> casatools-6.7.7.4a13522.dev22+dirty/xml
24-Aug-2026 18:42:55 copying xml/mstransformer.xml -> casatools-6.7.7.4a13522.dev22+dirty/xml
24-Aug-2026 18:42:55 copying xml/msuvbinner.xml -> casatools-6.7.7.4a13522.dev22+dirty/xml
24-Aug-2026 18:42:55 copying xml/quanta.xml -> casatools-6.7.7.4a13522.dev22+dirty/xml
24-Aug-2026 18:42:55 copying xml/regionmanager.xml -> casatools-6.7.7.4a13522.dev22+dirty/xml
24-Aug-2026 18:42:55 copying xml/sakura.xml -> casatools-6.7.7.4a13522.dev22+dirty/xml
24-Aug-2026 18:42:55 copying xml/sdm.xml -> casatools-6.7.7.4a13522.dev22+dirty/xml
24-Aug-2026 18:42:55 copying xml/sidebandseparator.xml -> casatools-6.7.7.4a13522.dev22+dirty/xml
24-Aug-2026 18:42:55 copying xml/simulator.xml -> casatools-6.7.7.4a13522.dev22+dirty/xml
24-Aug-2026 18:42:55 copying xml/singledishms.xml -> casatools-6.7.7.4a13522.dev22+dirty/xml
24-Aug-2026 18:42:55 copying xml/spectralline.xml -> casatools-6.7.7.4a13522.dev22+dirty/xml
24-Aug-2026 18:42:55 copying xml/synthesisdeconvolver.xml -> casatools-6.7.7.4a13522.dev22+dirty/xml
24-Aug-2026 18:42:55 copying xml/synthesisimager.xml -> casatools-6.7.7.4a13522.dev22+dirty/xml
24-Aug-2026 18:42:55 copying xml/synthesisimstore.xml -> casatools-6.7.7.4a13522.dev22+dirty/xml
24-Aug-2026 18:42:55 copying xml/synthesismaskhandler.xml -> casatools-6.7.7.4a13522.dev22+dirty/xml
24-Aug-2026 18:42:55 copying xml/synthesisnormalizer.xml -> casatools-6.7.7.4a13522.dev22+dirty/xml
24-Aug-2026 18:42:55 copying xml/synthesisutils.xml -> casatools-6.7.7.4a13522.dev22+dirty/xml
24-Aug-2026 18:42:55 copying xml/table.xml -> casatools-6.7.7.4a13522.dev22+dirty/xml
24-Aug-2026 18:42:55 copying xml/tablerow.xml -> casatools-6.7.7.4a13522.dev22+dirty/xml
24-Aug-2026 18:42:55 copying xml/utils.xml -> casatools-6.7.7.4a13522.dev22+dirty/xml
24-Aug-2026 18:42:55 copying xml/vlafiller.xml -> casatools-6.7.7.4a13522.dev22+dirty/xml
24-Aug-2026 18:42:55 copying xml/vpmanager.xml -> casatools-6.7.7.4a13522.dev22+dirty/xml
24-Aug-2026 18:42:55 copying xml/wvr.xml -> casatools-6.7.7.4a13522.dev22+dirty/xml
24-Aug-2026 18:42:55 Writing casatools-6.7.7.4a13522.dev22+dirty/setup.cfg
24-Aug-2026 18:42:55 Creating tar archive
24-Aug-2026 18:42:55 removing 'casatools-6.7.7.4a13522.dev22+dirty' (and everything under it)
24-Aug-2026 18:42:55 * Building wheel from sdist
24-Aug-2026 18:42:55 * Getting build dependencies for wheel...
24-Aug-2026 18:42:55 /source/casa6/casatools/src/tools/build_env/lib/python3.12/site-packages/setuptools/dist.py:765: SetuptoolsDeprecationWarning: License classifiers are deprecated.
24-Aug-2026 18:42:55 !!
24-Aug-2026 18:42:55
24-Aug-2026 18:42:55 ********************************************************************************
24-Aug-2026 18:42:55 Please consider removing the following classifiers in favor of a SPDX license expression:
24-Aug-2026 18:42:55
24-Aug-2026 18:42:55 License :: OSI Approved :: GNU Library or Lesser General Public License (LGPL)
24-Aug-2026 18:42:55
24-Aug-2026 18:42:55 See https://packaging.python.org/en/latest/guides/writing-pyproject-toml/#license for details.
24-Aug-2026 18:42:55 ********************************************************************************
24-Aug-2026 18:42:55
24-Aug-2026 18:42:55 !!
24-Aug-2026 18:42:55 self._finalize_license_expression()
24-Aug-2026 18:42:55 /source/casa6/casatools/src/tools/build_env/lib/python3.12/site-packages/setuptools/dist.py:483: SetuptoolsDeprecationWarning: Cannot find any files for the given pattern.
24-Aug-2026 18:42:55 !!
24-Aug-2026 18:42:55
24-Aug-2026 18:42:55 ********************************************************************************
24-Aug-2026 18:42:55 Pattern 'LICENSE.txt' did not match any files.
24-Aug-2026 18:42:55
24-Aug-2026 18:42:55 By 2027-Feb-18, you need to update your project and remove deprecated calls
24-Aug-2026 18:42:55 or your builds will no longer be supported.
24-Aug-2026 18:42:55 ********************************************************************************
24-Aug-2026 18:42:55
24-Aug-2026 18:42:55 !!
24-Aug-2026 18:42:55 for path in sorted(cls._find_pattern(pattern, enforce_match))
24-Aug-2026 18:42:55 running egg_info
24-Aug-2026 18:42:55 writing casatools.egg-info/PKG-INFO
24-Aug-2026 18:42:55 writing dependency_links to casatools.egg-info/dependency_links.txt
24-Aug-2026 18:42:55 writing requirements to casatools.egg-info/requires.txt
24-Aug-2026 18:42:55 writing top-level names to casatools.egg-info/top_level.txt
24-Aug-2026 18:42:55 reading manifest file 'casatools.egg-info/SOURCES.txt'
24-Aug-2026 18:42:55 reading manifest template 'MANIFEST.in'
24-Aug-2026 18:42:55 writing manifest file 'casatools.egg-info/SOURCES.txt'
24-Aug-2026 18:42:55 * Building wheel...
24-Aug-2026 18:42:55 /source/casa6/casatools/src/tools/build_env/lib/python3.12/site-packages/setuptools/dist.py:765: SetuptoolsDeprecationWarning: License classifiers are deprecated.
24-Aug-2026 18:42:55 !!
24-Aug-2026 18:42:55
24-Aug-2026 18:42:55 ********************************************************************************
24-Aug-2026 18:42:55 Please consider removing the following classifiers in favor of a SPDX license expression:
24-Aug-2026 18:42:55
24-Aug-2026 18:42:55 License :: OSI Approved :: GNU Library or Lesser General Public License (LGPL)
24-Aug-2026 18:42:55
24-Aug-2026 18:42:55 See https://packaging.python.org/en/latest/guides/writing-pyproject-toml/#license for details.
24-Aug-2026 18:42:55 ********************************************************************************
24-Aug-2026 18:42:55
24-Aug-2026 18:42:55 !!
24-Aug-2026 18:42:55 self._finalize_license_expression()
24-Aug-2026 18:43:09 /source/casa6/casatools/src/tools/build_env/lib/python3.12/site-packages/setuptools/dist.py:483: SetuptoolsDeprecationWarning: Cannot find any files for the given pattern.
24-Aug-2026 18:43:09 !!
24-Aug-2026 18:43:09
24-Aug-2026 18:43:09 ********************************************************************************
24-Aug-2026 18:43:09 Pattern 'LICENSE.txt' did not match any files.
24-Aug-2026 18:43:09
24-Aug-2026 18:43:09 By 2027-Feb-18, you need to update your project and remove deprecated calls
24-Aug-2026 18:43:09 or your builds will no longer be supported.
24-Aug-2026 18:43:09 ********************************************************************************
24-Aug-2026 18:43:09
24-Aug-2026 18:43:09 !!
24-Aug-2026 18:43:09 for path in sorted(cls._find_pattern(pattern, enforce_match))
24-Aug-2026 18:43:09 Latest commit doesn't have a tag. Adding -dirty flag to version string.
24-Aug-2026 18:43:09 casatools version:  6.7.7.4a13522.dev22+dirty
24-Aug-2026 18:43:09 running bdist_wheel
24-Aug-2026 18:43:09 running build
24-Aug-2026 18:43:09 running build_py
24-Aug-2026 18:43:09 creating build/lib.linux-x86_64-cpython-312/casatools
24-Aug-2026 18:43:09 copying src/casatools/errors.py -> build/lib.linux-x86_64-cpython-312/casatools
24-Aug-2026 18:43:09 copying src/casatools/constants.py -> build/lib.linux-x86_64-cpython-312/casatools
24-Aug-2026 18:43:09 copying src/casatools/platform.py -> build/lib.linux-x86_64-cpython-312/casatools
24-Aug-2026 18:43:09 copying src/casatools/coercetype.py -> build/lib.linux-x86_64-cpython-312/casatools
24-Aug-2026 18:43:09 copying src/casatools/__init__.py -> build/lib.linux-x86_64-cpython-312/casatools
24-Aug-2026 18:43:09 creating build/lib.linux-x86_64-cpython-312/casatools/__cerberus__
24-Aug-2026 18:43:09 copying src/casa_cerberus/errors.py -> build/lib.linux-x86_64-cpython-312/casatools/__cerberus__
24-Aug-2026 18:43:09 copying src/casa_cerberus/schema.py -> build/lib.linux-x86_64-cpython-312/casatools/__cerberus__
24-Aug-2026 18:43:09 copying src/casa_cerberus/platform.py -> build/lib.linux-x86_64-cpython-312/casatools/__cerberus__
24-Aug-2026 18:43:09 copying src/casa_cerberus/validator.py -> build/lib.linux-x86_64-cpython-312/casatools/__cerberus__
24-Aug-2026 18:43:09 copying src/casa_cerberus/utils.py -> build/lib.linux-x86_64-cpython-312/casatools/__cerberus__
24-Aug-2026 18:43:09 copying src/casa_cerberus/__init__.py -> build/lib.linux-x86_64-cpython-312/casatools/__cerberus__
24-Aug-2026 18:43:09 running build_ext
24-Aug-2026 18:43:09 -- The CXX compiler identification is GNU 11.2.1
24-Aug-2026 18:43:09 -- Detecting CXX compiler ABI info
24-Aug-2026 18:43:09 -- Detecting CXX compiler ABI info - done
24-Aug-2026 18:43:09 -- Check for working CXX compiler: /usr/lib64/ccache/c++ - skipped
24-Aug-2026 18:43:09 -- Detecting CXX compile features
24-Aug-2026 18:43:09 -- Detecting CXX compile features - done
24-Aug-2026 18:43:09 -- Found PkgConfig: /usr/bin/pkg-config (found version "1.4.2")
24-Aug-2026 18:43:09 -- CMAKE_CXX_STANDARD 17
24-Aug-2026 18:43:09 -- CMAKE_CXX_FLAGS  -std=c++17
24-Aug-2026 18:43:09 -- Found Python3: /usr/local/include/python3.12 (found version "3.12.1") found components: Development NumPy Interpreter Development.Module Development.Embed
24-Aug-2026 18:43:09 -- Found SWIG: /usr/bin/swig (found version "3.0.12") found components: python
24-Aug-2026 18:43:09 -- Checking for module 'xerces-c'
24-Aug-2026 18:43:09 --   Found xerces-c, version 3.2.5
24-Aug-2026 18:43:09 -- Checking for module 'casacpp'
24-Aug-2026 18:43:09 --   Package 'casacpp', required by 'virtual:world', not found
24-Aug-2026 18:43:09 CMake Error at /usr/share/cmake/Modules/FindPkgConfig.cmake:607 (message):
24-Aug-2026 18:43:09 A required package was not found
24-Aug-2026 18:43:09 Call Stack (most recent call first):
24-Aug-2026 18:43:09 /usr/share/cmake/Modules/FindPkgConfig.cmake:829 (_pkg_check_modules_internal)
24-Aug-2026 18:43:09 CMakeLists.txt:79 (pkg_check_modules)
24-Aug-2026 18:43:09
24-Aug-2026 18:43:09
24-Aug-2026 18:43:09 -- Configuring incomplete, errors occurred!
24-Aug-2026 18:43:09 Traceback (most recent call last):
24-Aug-2026 18:43:09 File "/source/casa6/casatools/src/tools/build_env/lib/python3.12/site-packages/pyproject_hooks/_in_process/_in_process.py", line 389, in <module>
24-Aug-2026 18:43:09 Generating bindings from XML /tmp/build-via-sdist-wjneangf/casatools-6.7.7.4a13522.dev22+dirty/scripts/java/xml-casa-assembly-1.89.jar
24-Aug-2026 18:43:09
24-Aug-2026 18:43:09 * Found destination dir for SWIG generated tool modules / .py files: build/lib.linux-x86_64-cpython-312/casatools
24-Aug-2026 18:43:09 * Copying SWIG generated files for every tool module into build/lib.linux-x86_64-cpython-312/casatools...
24-Aug-2026 18:43:09 Copying file src/casatools/errors.py -> build/lib.linux-x86_64-cpython-312/casatools
24-Aug-2026 18:43:09 Copying file src/casatools/functional.py -> build/lib.linux-x86_64-cpython-312/casatools
24-Aug-2026 18:43:09 Copying file src/casatools/image.py -> build/lib.linux-x86_64-cpython-312/casatools
24-Aug-2026 18:43:09 Copying file src/casatools/miriadfiller.py -> build/lib.linux-x86_64-cpython-312/casatools
24-Aug-2026 18:43:09 Copying file src/casatools/mstransformer.py -> build/lib.linux-x86_64-cpython-312/casatools
24-Aug-2026 18:43:09 Copying file src/casatools/typecheck.py -> build/lib.linux-x86_64-cpython-312/casatools
24-Aug-2026 18:43:09 Copying file src/casatools/sakura.py -> build/lib.linux-x86_64-cpython-312/casatools
24-Aug-2026 18:43:09 Copying file src/casatools/linearmosaic.py -> build/lib.linux-x86_64-cpython-312/casatools
24-Aug-2026 18:43:09 Copying file src/casatools/tablerow.py -> build/lib.linux-x86_64-cpython-312/casatools
24-Aug-2026 18:43:09 Copying file src/casatools/sidebandseparator.py -> build/lib.linux-x86_64-cpython-312/casatools
24-Aug-2026 18:43:09 Copying file src/casatools/constants.py -> build/lib.linux-x86_64-cpython-312/casatools
24-Aug-2026 18:43:09 Copying file src/casatools/componentlist.py -> build/lib.linux-x86_64-cpython-312/casatools
24-Aug-2026 18:43:09 Copying file src/casatools/msuvbinner.py -> build/lib.linux-x86_64-cpython-312/casatools
24-Aug-2026 18:43:09 Copying file src/casatools/quanta.py -> build/lib.linux-x86_64-cpython-312/casatools
24-Aug-2026 18:43:09 Copying file src/casatools/ms.py -> build/lib.linux-x86_64-cpython-312/casatools
24-Aug-2026 18:43:09 Copying file src/casatools/synthesisdeconvolver.py -> build/lib.linux-x86_64-cpython-312/casatools
24-Aug-2026 18:43:09 Copying file src/casatools/table.py -> build/lib.linux-x86_64-cpython-312/casatools
24-Aug-2026 18:43:09 Copying file src/casatools/regionmanager.py -> build/lib.linux-x86_64-cpython-312/casatools
24-Aug-2026 18:43:09 Copying file src/casatools/atcafiller.py -> build/lib.linux-x86_64-cpython-312/casatools
24-Aug-2026 18:43:09 Copying file src/casatools/calibrater.py -> build/lib.linux-x86_64-cpython-312/casatools
24-Aug-2026 18:43:09 Copying file src/casatools/vpmanager.py -> build/lib.linux-x86_64-cpython-312/casatools
24-Aug-2026 18:43:09 Copying file src/casatools/synthesisutils.py -> build/lib.linux-x86_64-cpython-312/casatools
24-Aug-2026 18:43:09 Copying file src/casatools/synthesismaskhandler.py -> build/lib.linux-x86_64-cpython-312/casatools
24-Aug-2026 18:43:09 Copying file src/casatools/synthesisimstore.py -> build/lib.linux-x86_64-cpython-312/casatools
24-Aug-2026 18:43:09 Copying file src/casatools/coordsys.py -> build/lib.linux-x86_64-cpython-312/casatools
24-Aug-2026 18:43:09 Copying file src/casatools/synthesisnormalizer.py -> build/lib.linux-x86_64-cpython-312/casatools
24-Aug-2026 18:43:09 Copying file src/casatools/msmetadata.py -> build/lib.linux-x86_64-cpython-312/casatools
24-Aug-2026 18:43:09 Copying file src/casatools/atmosphere.py -> build/lib.linux-x86_64-cpython-312/casatools
24-Aug-2026 18:43:09 Copying file src/casatools/platform.py -> build/lib.linux-x86_64-cpython-312/casatools
24-Aug-2026 18:43:09 Copying file src/casatools/logsink.py -> build/lib.linux-x86_64-cpython-312/casatools
24-Aug-2026 18:43:09 Copying file src/casatools/singledishms.py -> build/lib.linux-x86_64-cpython-312/casatools
24-Aug-2026 18:43:09 Copying file src/casatools/coercetype.py -> build/lib.linux-x86_64-cpython-312/casatools
24-Aug-2026 18:43:09 Copying file src/casatools/spectralline.py -> build/lib.linux-x86_64-cpython-312/casatools
24-Aug-2026 18:43:09 Copying file src/casatools/iterbotsink.py -> build/lib.linux-x86_64-cpython-312/casatools
24-Aug-2026 18:43:09 Copying file src/casatools/synthesisimager.py -> build/lib.linux-x86_64-cpython-312/casatools
24-Aug-2026 18:43:09 Copying file src/casatools/simulator.py -> build/lib.linux-x86_64-cpython-312/casatools
24-Aug-2026 18:43:09 Copying file src/casatools/imagemetadata.py -> build/lib.linux-x86_64-cpython-312/casatools
24-Aug-2026 18:43:09 Copying file src/casatools/wvr.py -> build/lib.linux-x86_64-cpython-312/casatools
24-Aug-2026 18:43:09 Copying file src/casatools/vlafiller.py -> build/lib.linux-x86_64-cpython-312/casatools
24-Aug-2026 18:43:09 Copying file src/casatools/sdm.py -> build/lib.linux-x86_64-cpython-312/casatools
24-Aug-2026 18:43:09 Copying file src/casatools/imager.py -> build/lib.linux-x86_64-cpython-312/casatools
24-Aug-2026 18:43:09 Copying file src/casatools/imagepol.py -> build/lib.linux-x86_64-cpython-312/casatools
24-Aug-2026 18:43:09 Copying file src/casatools/measures.py -> build/lib.linux-x86_64-cpython-312/casatools
24-Aug-2026 18:43:09 Copying file src/casatools/calanalysis.py -> build/lib.linux-x86_64-cpython-312/casatools
24-Aug-2026 18:43:09 Copying file src/casatools/utils.py -> build/lib.linux-x86_64-cpython-312/casatools
24-Aug-2026 18:43:09 Copying file src/casatools/__init__.py -> build/lib.linux-x86_64-cpython-312/casatools
24-Aug-2026 18:43:09 Copying file src/casatools/agentflagger.py -> build/lib.linux-x86_64-cpython-312/casatools
24-Aug-2026 18:43:09 main()
24-Aug-2026 18:43:09 File "/source/casa6/casatools/src/tools/build_env/lib/python3.12/site-packages/pyproject_hooks/_in_process/_in_process.py", line 373, in main
24-Aug-2026 18:43:09 json_out["return_val"] = hook(**hook_input["kwargs"])
24-Aug-2026 18:43:09 ^^^^^^^^^^^^^^^^^^^^^^^^^^^^
24-Aug-2026 18:43:09 File "/source/casa6/casatools/src/tools/build_env/lib/python3.12/site-packages/pyproject_hooks/_in_process/_in_process.py", line 280, in build_wheel
24-Aug-2026 18:43:09 return _build_backend().build_wheel(
24-Aug-2026 18:43:09 ^^^^^^^^^^^^^^^^^^^^^^^^^^^^^
24-Aug-2026 18:43:13 File "/source/casa6/casatools/src/tools/build_env/lib/python3.12/site-packages/setuptools/build_meta.py", line 438, in build_wheel
24-Aug-2026 18:43:13 return _build(['bdist_wheel'])
24-Aug-2026 18:43:13 ^^^^^^^^^^^^^^^^^^^^^^^
24-Aug-2026 18:43:13 File "/source/casa6/casatools/src/tools/build_env/lib/python3.12/site-packages/setuptools/build_meta.py", line 429, in _build
24-Aug-2026 18:43:13 return self._build_with_temp_dir(
24-Aug-2026 18:43:13 ^^^^^^^^^^^^^^^^^^^^^^^^^^
24-Aug-2026 18:43:13 File "/source/casa6/casatools/src/tools/build_env/lib/python3.12/site-packages/setuptools/build_meta.py", line 410, in _build_with_temp_dir
24-Aug-2026 18:43:13 self.run_setup()
24-Aug-2026 18:43:13 File "/source/casa6/casatools/src/tools/build_env/lib/python3.12/site-packages/setuptools/build_meta.py", line 317, in run_setup
24-Aug-2026 18:43:13 exec(code, locals())  # noqa: S102 # exec is intentional here
24-Aug-2026 18:43:13 ^^^^^^^^^^^^^^^^^^^^
24-Aug-2026 18:43:13 File "<string>", line 327, in <module>
24-Aug-2026 18:43:13 File "<string>", line 322, in setup_package
24-Aug-2026 18:43:13 File "/source/casa6/casatools/src/tools/build_env/lib/python3.12/site-packages/setuptools/__init__.py", line 117, in setup
24-Aug-2026 18:43:13 return distutils.core.setup(**attrs)  # type: ignore[return-value]
24-Aug-2026 18:43:13 ^^^^^^^^^^^^^^^^^^^^^^^^^^^^^
24-Aug-2026 18:43:13 File "/source/casa6/casatools/src/tools/build_env/lib/python3.12/site-packages/setuptools/_distutils/core.py", line 168, in setup
24-Aug-2026 18:43:13 return run_commands(dist)
24-Aug-2026 18:43:13 ^^^^^^^^^^^^^^^^^^
24-Aug-2026 18:43:13 File "/source/casa6/casatools/src/tools/build_env/lib/python3.12/site-packages/setuptools/_distutils/core.py", line 184, in run_commands
24-Aug-2026 18:43:13 dist.run_commands()
24-Aug-2026 18:43:13 File "/source/casa6/casatools/src/tools/build_env/lib/python3.12/site-packages/setuptools/_distutils/dist.py", line 1028, in run_commands
24-Aug-2026 18:43:13 self.run_command(cmd)
24-Aug-2026 18:43:13 File "/source/casa6/casatools/src/tools/build_env/lib/python3.12/site-packages/setuptools/dist.py", line 1106, in run_command
24-Aug-2026 18:43:13 super().run_command(command)
24-Aug-2026 18:43:13 File "/source/casa6/casatools/src/tools/build_env/lib/python3.12/site-packages/setuptools/_distutils/dist.py", line 1047, in run_command
24-Aug-2026 18:43:13 cmd_obj.run()
24-Aug-2026 18:43:13 File "/source/casa6/casatools/src/tools/build_env/lib/python3.12/site-packages/setuptools/command/bdist_wheel.py", line 385, in run
24-Aug-2026 18:43:13 self.run_command("build")
24-Aug-2026 18:43:13 File "/source/casa6/casatools/src/tools/build_env/lib/python3.12/site-packages/setuptools/_distutils/cmd.py", line 342, in run_command
24-Aug-2026 18:43:13 self.distribution.run_command(command)
24-Aug-2026 18:43:13 File "/source/casa6/casatools/src/tools/build_env/lib/python3.12/site-packages/setuptools/dist.py", line 1106, in run_command
24-Aug-2026 18:43:13 super().run_command(command)
24-Aug-2026 18:43:13 File "/source/casa6/casatools/src/tools/build_env/lib/python3.12/site-packages/setuptools/_distutils/dist.py", line 1047, in run_command
24-Aug-2026 18:43:13 cmd_obj.run()
24-Aug-2026 18:43:13 File "<string>", line 68, in run
24-Aug-2026 18:43:13 File "/source/casa6/casatools/src/tools/build_env/lib/python3.12/site-packages/setuptools/_distutils/command/build.py", line 137, in run
24-Aug-2026 18:43:13 self.run_command(cmd_name)
24-Aug-2026 18:43:13 File "/source/casa6/casatools/src/tools/build_env/lib/python3.12/site-packages/setuptools/_distutils/cmd.py", line 342, in run_command
24-Aug-2026 18:43:13 self.distribution.run_command(command)
24-Aug-2026 18:43:13 File "/source/casa6/casatools/src/tools/build_env/lib/python3.12/site-packages/setuptools/dist.py", line 1106, in run_command
24-Aug-2026 18:43:13 super().run_command(command)
24-Aug-2026 18:43:13 File "/source/casa6/casatools/src/tools/build_env/lib/python3.12/site-packages/setuptools/_distutils/dist.py", line 1047, in run_command
24-Aug-2026 18:43:13 cmd_obj.run()
24-Aug-2026 18:43:13 File "<string>", line 89, in run
24-Aug-2026 18:43:13 File "<string>", line 207, in build_extension
24-Aug-2026 18:43:13 File "/usr/local/lib/python3.12/subprocess.py", line 413, in check_call
24-Aug-2026 18:43:13 raise CalledProcessError(retcode, cmd)
24-Aug-2026 18:43:13 subprocess.CalledProcessError: Command '['cmake', 'src/tools', '-DCMAKE_LIBRARY_OUTPUT_DIRECTORY=/tmp/build-via-sdist-wjneangf/casatools-6.7.7.4a13522.dev22+dirty/build/lib.linux-x86_64-cpython-312/', '-DPython3_EXECUTABLE=/source/casa6/casatools/src/tools/build_env/bin/python3.12', '-DPython3_FIND_VIRTUALENV=ONLY']' returned non-zero exit status 1.
24-Aug-2026 18:43:13
24-Aug-2026 18:43:13 ERROR Backend subprocess exited when trying to invoke build_wheel
24-Aug-2026 18:43:13 Auditwheel repair
24-Aug-2026 18:43:13 usage: auditwheel [-h] [-V] [-v] command ...
24-Aug-2026 18:43:13 auditwheel: error: cannot access *.whl. No such file
24-Aug-2026 18:43:13 ./build_casalith_cmake: line 246: cd: /source/casainstall/dist/wheelhouse/: No such file or directory
24-Aug-2026 18:43:13 cp: cannot stat '/source/casainstall/dist/wheelhouse/': No such file or directory
24-Aug-2026 18:43:13 <casa_cmake> Building casatestutils
24-Aug-2026 18:43:13 Latest commit doesn't have a tag. Adding -dirty flag to version string.
24-Aug-2026 18:43:13 running bdist_wheel
24-Aug-2026 18:43:13 running build
24-Aug-2026 18:43:13 running build_py
24-Aug-2026 18:43:13 creating build/lib/casatestutils
24-Aug-2026 18:43:13 copying casatestutils/runtest.py -> build/lib/casatestutils
24-Aug-2026 18:43:13 copying casatestutils/weblog.py -> build/lib/casatestutils
24-Aug-2026 18:43:13 copying casatestutils/filltsys.py -> build/lib/casatestutils
24-Aug-2026 18:43:13 copying casatestutils/extractcasascript.py -> build/lib/casatestutils
24-Aug-2026 18:43:13 copying casatestutils/listing.py -> build/lib/casatestutils
24-Aug-2026 18:43:13 copying casatestutils/check.py -> build/lib/casatestutils
24-Aug-2026 18:43:13 copying casatestutils/xmlhelper.py -> build/lib/casatestutils
24-Aug-2026 18:43:13 copying casatestutils/restfreqtool.py -> build/lib/casatestutils
24-Aug-2026 18:43:13 copying casatestutils/compare.py -> build/lib/casatestutils
24-Aug-2026 18:43:13 copying casatestutils/testhelper.py -> build/lib/casatestutils
24-Aug-2026 18:43:13 copying casatestutils/selection_syntax.py -> build/lib/casatestutils
24-Aug-2026 18:43:13 copying casatestutils/sparse_check.py -> build/lib/casatestutils
24-Aug-2026 18:43:13 copying casatestutils/plotutils.py -> build/lib/casatestutils
24-Aug-2026 18:43:13 copying casatestutils/__init__.py -> build/lib/casatestutils
24-Aug-2026 18:43:13 creating build/lib/testrunner
24-Aug-2026 18:43:13 copying testrunner/xunit.py -> build/lib/testrunner
24-Aug-2026 18:43:13 copying testrunner/atlassian_helper.py -> build/lib/testrunner
24-Aug-2026 18:43:13 copying testrunner/run.py -> build/lib/testrunner
24-Aug-2026 18:43:13 copying testrunner/xvfb_helper.py -> build/lib/testrunner
24-Aug-2026 18:43:13 copying testrunner/shell_runner.py -> build/lib/testrunner
24-Aug-2026 18:43:13 copying testrunner/__init__.py -> build/lib/testrunner
24-Aug-2026 18:43:13 creating build/lib/casatestutils/imagerhelpers
24-Aug-2026 18:43:13 copying casatestutils/imagerhelpers/imagetesthelpers.py -> build/lib/casatestutils/imagerhelpers
24-Aug-2026 18:43:13 copying casatestutils/imagerhelpers/__init__.py -> build/lib/casatestutils/imagerhelpers
24-Aug-2026 18:43:13 creating build/lib/casatestutils/stakeholder
24-Aug-2026 18:43:13 copying casatestutils/stakeholder/StkUnitTest.py -> build/lib/casatestutils/stakeholder
24-Aug-2026 18:43:13 copying casatestutils/stakeholder/almastktestutils.py -> build/lib/casatestutils/stakeholder
24-Aug-2026 18:43:13 copying casatestutils/stakeholder/__init__.py -> build/lib/casatestutils/stakeholder
24-Aug-2026 18:43:13 creating build/lib/casatestutils/datahelpers
24-Aug-2026 18:43:13 copying casatestutils/datahelpers/selectTaql.py -> build/lib/casatestutils/datahelpers
24-Aug-2026 18:43:13 copying casatestutils/datahelpers/getTelescope.py -> build/lib/casatestutils/datahelpers
24-Aug-2026 18:43:13 copying casatestutils/datahelpers/__init__.py -> build/lib/casatestutils/datahelpers
24-Aug-2026 18:43:13 creating build/lib/casatestutils/getantposalma_helpers
24-Aug-2026 18:43:13 copying casatestutils/getantposalma_helpers/__init__.py -> build/lib/casatestutils/getantposalma_helpers
24-Aug-2026 18:43:13 creating build/lib/casatestutils/getcalmodvla_helpers
24-Aug-2026 18:43:13 copying casatestutils/getcalmodvla_helpers/__init__.py -> build/lib/casatestutils/getcalmodvla_helpers
24-Aug-2026 18:43:13 running egg_info
24-Aug-2026 18:43:13 creating casatestutils.egg-info
24-Aug-2026 18:43:13 writing casatestutils.egg-info/PKG-INFO
24-Aug-2026 18:43:13 writing dependency_links to casatestutils.egg-info/dependency_links.txt
24-Aug-2026 18:43:13 writing requirements to casatestutils.egg-info/requires.txt
24-Aug-2026 18:43:13 writing top-level names to casatestutils.egg-info/top_level.txt
24-Aug-2026 18:43:13 writing manifest file 'casatestutils.egg-info/SOURCES.txt'
24-Aug-2026 18:43:13 reading manifest file 'casatestutils.egg-info/SOURCES.txt'
24-Aug-2026 18:43:13 adding license file 'LICENSE'
24-Aug-2026 18:43:13 writing manifest file 'casatestutils.egg-info/SOURCES.txt'
24-Aug-2026 18:43:13 copying casatestutils/component_to_test_map.json -> build/lib/casatestutils
24-Aug-2026 18:43:13 copying casatestutils/getcalmodvla_helpers/query1.json -> build/lib/casatestutils/getcalmodvla_helpers
24-Aug-2026 18:43:13 copying casatestutils/getantposalma_helpers/query1.json -> build/lib/casatestutils/getantposalma_helpers
24-Aug-2026 18:43:13 /source/casa6/casatools/src/tools/build_env/lib/python3.12/site-packages/setuptools/_distutils/cmd.py:90: SetuptoolsDeprecationWarning: setup.py install is deprecated.
24-Aug-2026 18:43:13 !!
24-Aug-2026 18:43:13
24-Aug-2026 18:43:13 ********************************************************************************
24-Aug-2026 18:43:13 Please avoid running ``setup.py`` directly.
24-Aug-2026 18:43:13 Instead, use pypa/build, pypa/installer or other
24-Aug-2026 18:43:13 standards-based tools.
24-Aug-2026 18:43:13
24-Aug-2026 18:43:13 This deprecation is overdue, please update your project and remove deprecated
24-Aug-2026 18:43:13 calls to avoid build errors in the future.
24-Aug-2026 18:43:13
24-Aug-2026 18:43:13 See https://blog.ganssle.io/articles/2021/10/setup-py-deprecated.html for details.
24-Aug-2026 18:43:13 ********************************************************************************
24-Aug-2026 18:43:13
24-Aug-2026 18:43:13 !!
24-Aug-2026 18:43:13 self.initialize_options()
24-Aug-2026 18:43:13 installing to build/bdist.linux-x86_64/wheel
24-Aug-2026 18:43:13 running install
24-Aug-2026 18:43:13 running install_lib
24-Aug-2026 18:43:13 creating build/bdist.linux-x86_64/wheel
24-Aug-2026 18:43:13 creating build/bdist.linux-x86_64/wheel/casatestutils
24-Aug-2026 18:43:13 copying build/lib/casatestutils/runtest.py -> build/bdist.linux-x86_64/wheel/./casatestutils
24-Aug-2026 18:43:13 creating build/bdist.linux-x86_64/wheel/casatestutils/imagerhelpers
24-Aug-2026 18:43:13 copying build/lib/casatestutils/imagerhelpers/imagetesthelpers.py -> build/bdist.linux-x86_64/wheel/./casatestutils/imagerhelpers
24-Aug-2026 18:43:13 copying build/lib/casatestutils/imagerhelpers/__init__.py -> build/bdist.linux-x86_64/wheel/./casatestutils/imagerhelpers
24-Aug-2026 18:43:13 creating build/bdist.linux-x86_64/wheel/casatestutils/stakeholder
24-Aug-2026 18:43:13 copying build/lib/casatestutils/stakeholder/StkUnitTest.py -> build/bdist.linux-x86_64/wheel/./casatestutils/stakeholder
24-Aug-2026 18:43:13 copying build/lib/casatestutils/stakeholder/almastktestutils.py -> build/bdist.linux-x86_64/wheel/./casatestutils/stakeholder
24-Aug-2026 18:43:13 copying build/lib/casatestutils/stakeholder/__init__.py -> build/bdist.linux-x86_64/wheel/./casatestutils/stakeholder
24-Aug-2026 18:43:13 copying build/lib/casatestutils/weblog.py -> build/bdist.linux-x86_64/wheel/./casatestutils
24-Aug-2026 18:43:13 copying build/lib/casatestutils/filltsys.py -> build/bdist.linux-x86_64/wheel/./casatestutils
24-Aug-2026 18:43:13 copying build/lib/casatestutils/extractcasascript.py -> build/bdist.linux-x86_64/wheel/./casatestutils
24-Aug-2026 18:43:13 copying build/lib/casatestutils/listing.py -> build/bdist.linux-x86_64/wheel/./casatestutils
24-Aug-2026 18:43:13 copying build/lib/casatestutils/check.py -> build/bdist.linux-x86_64/wheel/./casatestutils
24-Aug-2026 18:43:13 copying build/lib/casatestutils/xmlhelper.py -> build/bdist.linux-x86_64/wheel/./casatestutils
24-Aug-2026 18:43:13 copying build/lib/casatestutils/restfreqtool.py -> build/bdist.linux-x86_64/wheel/./casatestutils
24-Aug-2026 18:43:13 copying build/lib/casatestutils/compare.py -> build/bdist.linux-x86_64/wheel/./casatestutils
24-Aug-2026 18:43:13 copying build/lib/casatestutils/testhelper.py -> build/bdist.linux-x86_64/wheel/./casatestutils
24-Aug-2026 18:43:13 creating build/bdist.linux-x86_64/wheel/casatestutils/datahelpers
24-Aug-2026 18:43:13 copying build/lib/casatestutils/datahelpers/selectTaql.py -> build/bdist.linux-x86_64/wheel/./casatestutils/datahelpers
24-Aug-2026 18:43:13 copying build/lib/casatestutils/datahelpers/getTelescope.py -> build/bdist.linux-x86_64/wheel/./casatestutils/datahelpers
24-Aug-2026 18:43:13 copying build/lib/casatestutils/datahelpers/__init__.py -> build/bdist.linux-x86_64/wheel/./casatestutils/datahelpers
24-Aug-2026 18:43:13 creating build/bdist.linux-x86_64/wheel/casatestutils/getantposalma_helpers
24-Aug-2026 18:43:13 copying build/lib/casatestutils/getantposalma_helpers/query1.json -> build/bdist.linux-x86_64/wheel/./casatestutils/getantposalma_helpers
24-Aug-2026 18:43:13 copying build/lib/casatestutils/getantposalma_helpers/__init__.py -> build/bdist.linux-x86_64/wheel/./casatestutils/getantposalma_helpers
24-Aug-2026 18:43:13 copying build/lib/casatestutils/selection_syntax.py -> build/bdist.linux-x86_64/wheel/./casatestutils
24-Aug-2026 18:43:13 copying build/lib/casatestutils/component_to_test_map.json -> build/bdist.linux-x86_64/wheel/./casatestutils
24-Aug-2026 18:43:13 copying build/lib/casatestutils/sparse_check.py -> build/bdist.linux-x86_64/wheel/./casatestutils
24-Aug-2026 18:43:13 copying build/lib/casatestutils/plotutils.py -> build/bdist.linux-x86_64/wheel/./casatestutils
24-Aug-2026 18:43:13 creating build/bdist.linux-x86_64/wheel/casatestutils/getcalmodvla_helpers
24-Aug-2026 18:43:13 copying build/lib/casatestutils/getcalmodvla_helpers/query1.json -> build/bdist.linux-x86_64/wheel/./casatestutils/getcalmodvla_helpers
24-Aug-2026 18:43:13 copying build/lib/casatestutils/getcalmodvla_helpers/__init__.py -> build/bdist.linux-x86_64/wheel/./casatestutils/getcalmodvla_helpers
24-Aug-2026 18:43:13 copying build/lib/casatestutils/__init__.py -> build/bdist.linux-x86_64/wheel/./casatestutils
24-Aug-2026 18:43:13 creating build/bdist.linux-x86_64/wheel/testrunner
24-Aug-2026 18:43:13 copying build/lib/testrunner/xunit.py -> build/bdist.linux-x86_64/wheel/./testrunner
24-Aug-2026 18:43:13 copying build/lib/testrunner/atlassian_helper.py -> build/bdist.linux-x86_64/wheel/./testrunner
24-Aug-2026 18:43:13 copying build/lib/testrunner/run.py -> build/bdist.linux-x86_64/wheel/./testrunner
24-Aug-2026 18:43:13 copying build/lib/testrunner/xvfb_helper.py -> build/bdist.linux-x86_64/wheel/./testrunner
24-Aug-2026 18:43:13 copying build/lib/testrunner/shell_runner.py -> build/bdist.linux-x86_64/wheel/./testrunner
24-Aug-2026 18:43:13 copying build/lib/testrunner/__init__.py -> build/bdist.linux-x86_64/wheel/./testrunner
24-Aug-2026 18:43:13 running install_egg_info
24-Aug-2026 18:43:13 Copying casatestutils.egg-info to build/bdist.linux-x86_64/wheel/./casatestutils-6.7.7.4a13522.dev22+dirty-py3.12.egg-info
24-Aug-2026 18:43:13 running install_scripts
24-Aug-2026 18:43:13 creating build/bdist.linux-x86_64/wheel/casatestutils-6.7.7.4a13522.dev22+dirty.dist-info/WHEEL
24-Aug-2026 18:43:13 creating 'dist/casatestutils-6.7.7.4a13522.dev22+dirty-py3-none-any.whl' and adding 'build/bdist.linux-x86_64/wheel' to it
24-Aug-2026 18:43:13 adding 'casatestutils/__init__.py'
24-Aug-2026 18:43:13 adding 'casatestutils/check.py'
24-Aug-2026 18:43:13 adding 'casatestutils/compare.py'
24-Aug-2026 18:43:13 adding 'casatestutils/component_to_test_map.json'
24-Aug-2026 18:43:13 adding 'casatestutils/extractcasascript.py'
24-Aug-2026 18:43:13 adding 'casatestutils/filltsys.py'
24-Aug-2026 18:43:13 adding 'casatestutils/listing.py'
24-Aug-2026 18:43:13 adding 'casatestutils/plotutils.py'
24-Aug-2026 18:43:13 adding 'casatestutils/restfreqtool.py'
24-Aug-2026 18:43:13 adding 'casatestutils/runtest.py'
24-Aug-2026 18:43:13 adding 'casatestutils/selection_syntax.py'
24-Aug-2026 18:43:13 adding 'casatestutils/sparse_check.py'
24-Aug-2026 18:43:13 adding 'casatestutils/testhelper.py'
24-Aug-2026 18:43:13 adding 'casatestutils/weblog.py'
24-Aug-2026 18:43:13 adding 'casatestutils/xmlhelper.py'
24-Aug-2026 18:43:13 adding 'casatestutils/datahelpers/__init__.py'
24-Aug-2026 18:43:13 adding 'casatestutils/datahelpers/getTelescope.py'
24-Aug-2026 18:43:13 adding 'casatestutils/datahelpers/selectTaql.py'
24-Aug-2026 18:43:13 adding 'casatestutils/getantposalma_helpers/__init__.py'
24-Aug-2026 18:43:13 adding 'casatestutils/getantposalma_helpers/query1.json'
24-Aug-2026 18:43:13 adding 'casatestutils/getcalmodvla_helpers/__init__.py'
24-Aug-2026 18:43:13 adding 'casatestutils/getcalmodvla_helpers/query1.json'
24-Aug-2026 18:43:13 adding 'casatestutils/imagerhelpers/__init__.py'
24-Aug-2026 18:43:13 adding 'casatestutils/imagerhelpers/imagetesthelpers.py'
24-Aug-2026 18:43:13 adding 'casatestutils/stakeholder/StkUnitTest.py'
24-Aug-2026 18:43:13 adding 'casatestutils/stakeholder/__init__.py'
24-Aug-2026 18:43:13 adding 'casatestutils/stakeholder/almastktestutils.py'
24-Aug-2026 18:43:13 adding 'casatestutils-6.7.7.4a13522.dev22+dirty.dist-info/licenses/LICENSE'
24-Aug-2026 18:43:13 adding 'testrunner/__init__.py'
24-Aug-2026 18:43:13 adding 'testrunner/atlassian_helper.py'
24-Aug-2026 18:43:13 adding 'testrunner/run.py'
24-Aug-2026 18:43:13 adding 'testrunner/shell_runner.py'
24-Aug-2026 18:43:13 adding 'testrunner/xunit.py'
24-Aug-2026 18:43:13 adding 'testrunner/xvfb_helper.py'
24-Aug-2026 18:43:13 adding 'casatestutils-6.7.7.4a13522.dev22+dirty.dist-info/METADATA'
24-Aug-2026 18:43:13 adding 'casatestutils-6.7.7.4a13522.dev22+dirty.dist-info/WHEEL'
24-Aug-2026 18:43:13 adding 'casatestutils-6.7.7.4a13522.dev22+dirty.dist-info/top_level.txt'
24-Aug-2026 18:43:13 adding 'casatestutils-6.7.7.4a13522.dev22+dirty.dist-info/RECORD'
24-Aug-2026 18:43:13 removing build/bdist.linux-x86_64/wheel
24-Aug-2026 18:43:13 Build target set to casatools. Done.
24-Aug-2026 18:43:13 Finished task 'Create Casatools Wheel' with result: Success
24-Aug-2026 18:43:13 Starting task 'Run c++ tests' of type 'com.atlassian.bamboo.plugins.scripttask:task.builder.script'
24-Aug-2026 18:43:13
Beginning to execute external process for build 'CASASPECS - CI Build - CAS-13522 - ManyLinux 2.28 #25 (CASASPECS-CI300-ML228-25)'
... running command line:
/export/home/cbt-el7-6/bamboohome/temp/CASASPECS-CI300-ML228-25-ScriptBuildTask-15688062681173107841.sh
... in: /export/home/cbt-el7-6/bamboohome/xml-data/build-dir/CASASPECS-CI300-ML228
24-Aug-2026 18:43:13    Site: 712243e70692
24-Aug-2026 18:43:13    Build name: Linux-c++
24-Aug-2026 18:43:13 Create new tag: 20260824-2243 - Experimental
24-Aug-2026 18:43:13 Test project /source/casa6/casatools/src/code/build
24-Aug-2026 18:43:13       Start  1: APEX_SkyDipTest
24-Aug-2026 18:43:13 1/24 Test  #1: APEX_SkyDipTest ..................   Passed    0.23 sec
24-Aug-2026 18:43:13       Start  2: ATMDiscontinuityTest
24-Aug-2026 18:43:13 2/24 Test  #2: ATMDiscontinuityTest .............   Passed    0.04 sec
24-Aug-2026 18:43:13       Start  3: ATMVersionTest
24-Aug-2026 18:43:13 3/24 Test  #3: ATMVersionTest ...................   Passed    0.04 sec
24-Aug-2026 18:43:13       Start  4: AtmBasicTest
24-Aug-2026 18:43:19 4/24 Test  #4: AtmBasicTest .....................   Passed    5.73 sec
24-Aug-2026 18:43:19       Start  5: AtmProfileTest
24-Aug-2026 18:43:19 5/24 Test  #5: AtmProfileTest ...................   Passed    0.04 sec
24-Aug-2026 18:43:19       Start  6: LengthTest
24-Aug-2026 18:43:19 6/24 Test  #6: LengthTest .......................   Passed    0.06 sec
24-Aug-2026 18:43:19       Start  7: RefractiveIndexProfileTest
24-Aug-2026 18:43:19 7/24 Test  #7: RefractiveIndexProfileTest .......   Passed    0.05 sec
24-Aug-2026 18:43:19       Start  8: SkyStatusTest
24-Aug-2026 18:43:21 8/24 Test  #8: SkyStatusTest ....................   Passed    2.02 sec
24-Aug-2026 18:43:21       Start  9: SpectralGridTest
24-Aug-2026 18:43:21 9/24 Test  #9: SpectralGridTest .................   Passed    0.05 sec
24-Aug-2026 18:43:21       Start 10: simpleSpectralGridTest
24-Aug-2026 18:43:21 10/24 Test #10: simpleSpectralGridTest ...........   Passed    0.05 sec
24-Aug-2026 18:43:21       Start 11: tCalStats0
24-Aug-2026 18:43:21 Unable to find executable: /source/casa6/casatools/src/code/build/calanalysis/tCalStats0
24-Aug-2026 18:43:21 Could not find executable /source/casa6/casatools/src/code/build/calanalysis/tCalStats0
24-Aug-2026 18:43:21 Looked in the following places:
24-Aug-2026 18:43:21 /source/casa6/casatools/src/code/build/calanalysis/tCalStats0
24-Aug-2026 18:43:21 /source/casa6/casatools/src/code/build/calanalysis/tCalStats0
24-Aug-2026 18:43:21 /source/casa6/casatools/src/code/build/calanalysis/Release/tCalStats0
24-Aug-2026 18:43:21 /source/casa6/casatools/src/code/build/calanalysis/Release/tCalStats0
24-Aug-2026 18:43:21 /source/casa6/casatools/src/code/build/calanalysis/Debug/tCalStats0
24-Aug-2026 18:43:21 /source/casa6/casatools/src/code/build/calanalysis/Debug/tCalStats0
24-Aug-2026 18:43:21 /source/casa6/casatools/src/code/build/calanalysis/MinSizeRel/tCalStats0
24-Aug-2026 18:43:21 /source/casa6/casatools/src/code/build/calanalysis/MinSizeRel/tCalStats0
24-Aug-2026 18:43:21 /source/casa6/casatools/src/code/build/calanalysis/RelWithDebInfo/tCalStats0
24-Aug-2026 18:43:21 /source/casa6/casatools/src/code/build/calanalysis/RelWithDebInfo/tCalStats0
24-Aug-2026 18:43:21 /source/casa6/casatools/src/code/build/calanalysis/Deployment/tCalStats0
24-Aug-2026 18:43:21 /source/casa6/casatools/src/code/build/calanalysis/Deployment/tCalStats0
24-Aug-2026 18:43:21 /source/casa6/casatools/src/code/build/calanalysis/Development/tCalStats0
24-Aug-2026 18:43:21 /source/casa6/casatools/src/code/build/calanalysis/Development/tCalStats0
24-Aug-2026 18:43:21 source/casa6/casatools/src/code/build/calanalysis/tCalStats0
24-Aug-2026 18:43:21 source/casa6/casatools/src/code/build/calanalysis/tCalStats0
24-Aug-2026 18:43:21 source/casa6/casatools/src/code/build/calanalysis/Release/tCalStats0
24-Aug-2026 18:43:21 source/casa6/casatools/src/code/build/calanalysis/Release/tCalStats0
24-Aug-2026 18:43:21 source/casa6/casatools/src/code/build/calanalysis/Debug/tCalStats0
24-Aug-2026 18:43:21 source/casa6/casatools/src/code/build/calanalysis/Debug/tCalStats0
24-Aug-2026 18:43:21 source/casa6/casatools/src/code/build/calanalysis/MinSizeRel/tCalStats0
24-Aug-2026 18:43:21 source/casa6/casatools/src/code/build/calanalysis/MinSizeRel/tCalStats0
24-Aug-2026 18:43:21 source/casa6/casatools/src/code/build/calanalysis/RelWithDebInfo/tCalStats0
24-Aug-2026 18:43:21 source/casa6/casatools/src/code/build/calanalysis/RelWithDebInfo/tCalStats0
24-Aug-2026 18:43:21 source/casa6/casatools/src/code/build/calanalysis/Deployment/tCalStats0
24-Aug-2026 18:43:21 source/casa6/casatools/src/code/build/calanalysis/Deployment/tCalStats0
24-Aug-2026 18:43:21 source/casa6/casatools/src/code/build/calanalysis/Development/tCalStats0
24-Aug-2026 18:43:21 source/casa6/casatools/src/code/build/calanalysis/Development/tCalStats0
24-Aug-2026 18:43:21 11/24 Test #11: tCalStats0 .......................***Not Run   0.00 sec
24-Aug-2026 18:43:21       Start 12: tSakuraUtils
24-Aug-2026 18:43:21 12/24 Test #12: tSakuraUtils .....................   Passed    0.07 sec
24-Aug-2026 18:43:21       Start 13: dPointShape
24-Aug-2026 18:43:22 13/24 Test #13: dPointShape ......................   Passed    0.09 sec
24-Aug-2026 18:43:22       Start 14: dImageHistograms
24-Aug-2026 18:43:22 14/24 Test #14: dImageHistograms .................   Passed    0.08 sec
24-Aug-2026 18:43:22       Start 15: tHanningSmooth
24-Aug-2026 18:43:22 15/24 Test #15: tHanningSmooth ...................   Passed    0.54 sec
24-Aug-2026 18:43:22       Start 16: tVLABuffer
24-Aug-2026 18:43:22 16/24 Test #16: tVLABuffer .......................   Passed    0.07 sec
24-Aug-2026 18:43:22       Start 17: tLineFinder
24-Aug-2026 18:43:22 17/24 Test #17: tLineFinder ......................   Passed    0.09 sec
24-Aug-2026 18:43:22       Start 18: tVersionInfo
24-Aug-2026 18:43:22 Unable to find executable: /source/casa6/casatools/src/code/build/synthesis/tCalLibraryParse
24-Aug-2026 18:43:22 Unable to find executable: /source/casa6/casatools/src/code/build/synthesis/tCTIter
24-Aug-2026 18:43:22 Unable to find executable: /source/casa6/casatools/src/code/build/synthesis/tGridFT
24-Aug-2026 18:43:22 Unable to find executable: /source/casa6/casatools/src/code/build/synthesis/tAWPHPG
24-Aug-2026 18:43:22 18/24 Test #18: tVersionInfo .....................   Passed    0.06 sec
24-Aug-2026 18:43:22       Start 19: tCalLibraryParse
24-Aug-2026 18:43:22 Could not find executable /source/casa6/casatools/src/code/build/synthesis/tCalLibraryParse
24-Aug-2026 18:43:22 Looked in the following places:
24-Aug-2026 18:43:22 /source/casa6/casatools/src/code/build/synthesis/tCalLibraryParse
24-Aug-2026 18:43:22 /source/casa6/casatools/src/code/build/synthesis/tCalLibraryParse
24-Aug-2026 18:43:22 /source/casa6/casatools/src/code/build/synthesis/Release/tCalLibraryParse
24-Aug-2026 18:43:22 /source/casa6/casatools/src/code/build/synthesis/Release/tCalLibraryParse
24-Aug-2026 18:43:22 /source/casa6/casatools/src/code/build/synthesis/Debug/tCalLibraryParse
24-Aug-2026 18:43:22 /source/casa6/casatools/src/code/build/synthesis/Debug/tCalLibraryParse
24-Aug-2026 18:43:22 /source/casa6/casatools/src/code/build/synthesis/MinSizeRel/tCalLibraryParse
24-Aug-2026 18:43:22 /source/casa6/casatools/src/code/build/synthesis/MinSizeRel/tCalLibraryParse
24-Aug-2026 18:43:22 /source/casa6/casatools/src/code/build/synthesis/RelWithDebInfo/tCalLibraryParse
24-Aug-2026 18:43:22 /source/casa6/casatools/src/code/build/synthesis/RelWithDebInfo/tCalLibraryParse
24-Aug-2026 18:43:22 /source/casa6/casatools/src/code/build/synthesis/Deployment/tCalLibraryParse
24-Aug-2026 18:43:22 /source/casa6/casatools/src/code/build/synthesis/Deployment/tCalLibraryParse
24-Aug-2026 18:43:22 /source/casa6/casatools/src/code/build/synthesis/Development/tCalLibraryParse
24-Aug-2026 18:43:22 /source/casa6/casatools/src/code/build/synthesis/Development/tCalLibraryParse
24-Aug-2026 18:43:22 source/casa6/casatools/src/code/build/synthesis/tCalLibraryParse
24-Aug-2026 18:43:22 source/casa6/casatools/src/code/build/synthesis/tCalLibraryParse
24-Aug-2026 18:43:22 source/casa6/casatools/src/code/build/synthesis/Release/tCalLibraryParse
24-Aug-2026 18:43:22 source/casa6/casatools/src/code/build/synthesis/Release/tCalLibraryParse
24-Aug-2026 18:43:22 source/casa6/casatools/src/code/build/synthesis/Debug/tCalLibraryParse
24-Aug-2026 18:43:22 source/casa6/casatools/src/code/build/synthesis/Debug/tCalLibraryParse
24-Aug-2026 18:43:22 source/casa6/casatools/src/code/build/synthesis/MinSizeRel/tCalLibraryParse
24-Aug-2026 18:43:22 source/casa6/casatools/src/code/build/synthesis/MinSizeRel/tCalLibraryParse
24-Aug-2026 18:43:22 source/casa6/casatools/src/code/build/synthesis/RelWithDebInfo/tCalLibraryParse
24-Aug-2026 18:43:22 source/casa6/casatools/src/code/build/synthesis/RelWithDebInfo/tCalLibraryParse
24-Aug-2026 18:43:22 source/casa6/casatools/src/code/build/synthesis/Deployment/tCalLibraryParse
24-Aug-2026 18:43:22 source/casa6/casatools/src/code/build/synthesis/Deployment/tCalLibraryParse
24-Aug-2026 18:43:22 source/casa6/casatools/src/code/build/synthesis/Development/tCalLibraryParse
24-Aug-2026 18:43:22 source/casa6/casatools/src/code/build/synthesis/Development/tCalLibraryParse
24-Aug-2026 18:43:22 19/24 Test #19: tCalLibraryParse .................***Not Run   0.00 sec
24-Aug-2026 18:43:22       Start 20: tCTIter
24-Aug-2026 18:43:22 Could not find executable /source/casa6/casatools/src/code/build/synthesis/tCTIter
24-Aug-2026 18:43:22 Looked in the following places:
24-Aug-2026 18:43:22 /source/casa6/casatools/src/code/build/synthesis/tCTIter
24-Aug-2026 18:43:22 /source/casa6/casatools/src/code/build/synthesis/tCTIter
24-Aug-2026 18:43:22 /source/casa6/casatools/src/code/build/synthesis/Release/tCTIter
24-Aug-2026 18:43:22 /source/casa6/casatools/src/code/build/synthesis/Release/tCTIter
24-Aug-2026 18:43:22 /source/casa6/casatools/src/code/build/synthesis/Debug/tCTIter
24-Aug-2026 18:43:22 /source/casa6/casatools/src/code/build/synthesis/Debug/tCTIter
24-Aug-2026 18:43:22 /source/casa6/casatools/src/code/build/synthesis/MinSizeRel/tCTIter
24-Aug-2026 18:43:22 /source/casa6/casatools/src/code/build/synthesis/MinSizeRel/tCTIter
24-Aug-2026 18:43:22 /source/casa6/casatools/src/code/build/synthesis/RelWithDebInfo/tCTIter
24-Aug-2026 18:43:22 /source/casa6/casatools/src/code/build/synthesis/RelWithDebInfo/tCTIter
24-Aug-2026 18:43:22 /source/casa6/casatools/src/code/build/synthesis/Deployment/tCTIter
24-Aug-2026 18:43:22 /source/casa6/casatools/src/code/build/synthesis/Deployment/tCTIter
24-Aug-2026 18:43:22 /source/casa6/casatools/src/code/build/synthesis/Development/tCTIter
24-Aug-2026 18:43:22 /source/casa6/casatools/src/code/build/synthesis/Development/tCTIter
24-Aug-2026 18:43:22 source/casa6/casatools/src/code/build/synthesis/tCTIter
24-Aug-2026 18:43:22 source/casa6/casatools/src/code/build/synthesis/tCTIter
24-Aug-2026 18:43:22 source/casa6/casatools/src/code/build/synthesis/Release/tCTIter
24-Aug-2026 18:43:22 source/casa6/casatools/src/code/build/synthesis/Release/tCTIter
24-Aug-2026 18:43:22 source/casa6/casatools/src/code/build/synthesis/Debug/tCTIter
24-Aug-2026 18:43:22 source/casa6/casatools/src/code/build/synthesis/Debug/tCTIter
24-Aug-2026 18:43:22 source/casa6/casatools/src/code/build/synthesis/MinSizeRel/tCTIter
24-Aug-2026 18:43:22 source/casa6/casatools/src/code/build/synthesis/MinSizeRel/tCTIter
24-Aug-2026 18:43:22 source/casa6/casatools/src/code/build/synthesis/RelWithDebInfo/tCTIter
24-Aug-2026 18:43:22 source/casa6/casatools/src/code/build/synthesis/RelWithDebInfo/tCTIter
24-Aug-2026 18:43:22 source/casa6/casatools/src/code/build/synthesis/Deployment/tCTIter
24-Aug-2026 18:43:22 source/casa6/casatools/src/code/build/synthesis/Deployment/tCTIter
24-Aug-2026 18:43:22 source/casa6/casatools/src/code/build/synthesis/Development/tCTIter
24-Aug-2026 18:43:22 source/casa6/casatools/src/code/build/synthesis/Development/tCTIter
24-Aug-2026 18:43:22 20/24 Test #20: tCTIter ..........................***Not Run   0.00 sec
24-Aug-2026 18:43:22       Start 21: tGridFT
24-Aug-2026 18:43:22 Could not find executable /source/casa6/casatools/src/code/build/synthesis/tGridFT
24-Aug-2026 18:43:22 Looked in the following places:
24-Aug-2026 18:43:22 /source/casa6/casatools/src/code/build/synthesis/tGridFT
24-Aug-2026 18:43:22 /source/casa6/casatools/src/code/build/synthesis/tGridFT
24-Aug-2026 18:43:22 /source/casa6/casatools/src/code/build/synthesis/Release/tGridFT
24-Aug-2026 18:43:22 /source/casa6/casatools/src/code/build/synthesis/Release/tGridFT
24-Aug-2026 18:43:22 /source/casa6/casatools/src/code/build/synthesis/Debug/tGridFT
24-Aug-2026 18:43:22 /source/casa6/casatools/src/code/build/synthesis/Debug/tGridFT
24-Aug-2026 18:43:22 /source/casa6/casatools/src/code/build/synthesis/MinSizeRel/tGridFT
24-Aug-2026 18:43:22 /source/casa6/casatools/src/code/build/synthesis/MinSizeRel/tGridFT
24-Aug-2026 18:43:22 /source/casa6/casatools/src/code/build/synthesis/RelWithDebInfo/tGridFT
24-Aug-2026 18:43:22 /source/casa6/casatools/src/code/build/synthesis/RelWithDebInfo/tGridFT
24-Aug-2026 18:43:22 /source/casa6/casatools/src/code/build/synthesis/Deployment/tGridFT
24-Aug-2026 18:43:22 /source/casa6/casatools/src/code/build/synthesis/Deployment/tGridFT
24-Aug-2026 18:43:22 /source/casa6/casatools/src/code/build/synthesis/Development/tGridFT
24-Aug-2026 18:43:22 /source/casa6/casatools/src/code/build/synthesis/Development/tGridFT
24-Aug-2026 18:43:22 source/casa6/casatools/src/code/build/synthesis/tGridFT
24-Aug-2026 18:43:22 source/casa6/casatools/src/code/build/synthesis/tGridFT
24-Aug-2026 18:43:22 source/casa6/casatools/src/code/build/synthesis/Release/tGridFT
24-Aug-2026 18:43:22 source/casa6/casatools/src/code/build/synthesis/Release/tGridFT
24-Aug-2026 18:43:22 source/casa6/casatools/src/code/build/synthesis/Debug/tGridFT
24-Aug-2026 18:43:22 source/casa6/casatools/src/code/build/synthesis/Debug/tGridFT
24-Aug-2026 18:43:22 source/casa6/casatools/src/code/build/synthesis/MinSizeRel/tGridFT
24-Aug-2026 18:43:22 source/casa6/casatools/src/code/build/synthesis/MinSizeRel/tGridFT
24-Aug-2026 18:43:22 source/casa6/casatools/src/code/build/synthesis/RelWithDebInfo/tGridFT
24-Aug-2026 18:43:22 source/casa6/casatools/src/code/build/synthesis/RelWithDebInfo/tGridFT
24-Aug-2026 18:43:22 source/casa6/casatools/src/code/build/synthesis/Deployment/tGridFT
24-Aug-2026 18:43:22 source/casa6/casatools/src/code/build/synthesis/Deployment/tGridFT
24-Aug-2026 18:43:22 source/casa6/casatools/src/code/build/synthesis/Development/tGridFT
24-Aug-2026 18:43:22 source/casa6/casatools/src/code/build/synthesis/Development/tGridFT
24-Aug-2026 18:43:22 21/24 Test #21: tGridFT ..........................***Not Run   0.00 sec
24-Aug-2026 18:43:22       Start 22: tAWPHPG
24-Aug-2026 18:43:22 Could not find executable /source/casa6/casatools/src/code/build/synthesis/tAWPHPG
24-Aug-2026 18:43:22 Looked in the following places:
24-Aug-2026 18:43:22 /source/casa6/casatools/src/code/build/synthesis/tAWPHPG
24-Aug-2026 18:43:22 /source/casa6/casatools/src/code/build/synthesis/tAWPHPG
24-Aug-2026 18:43:22 /source/casa6/casatools/src/code/build/synthesis/Release/tAWPHPG
24-Aug-2026 18:43:22 /source/casa6/casatools/src/code/build/synthesis/Release/tAWPHPG
24-Aug-2026 18:43:22 /source/casa6/casatools/src/code/build/synthesis/Debug/tAWPHPG
24-Aug-2026 18:43:22 /source/casa6/casatools/src/code/build/synthesis/Debug/tAWPHPG
24-Aug-2026 18:43:22 /source/casa6/casatools/src/code/build/synthesis/MinSizeRel/tAWPHPG
24-Aug-2026 18:43:22 /source/casa6/casatools/src/code/build/synthesis/MinSizeRel/tAWPHPG
24-Aug-2026 18:43:22 /source/casa6/casatools/src/code/build/synthesis/RelWithDebInfo/tAWPHPG
24-Aug-2026 18:43:22 /source/casa6/casatools/src/code/build/synthesis/RelWithDebInfo/tAWPHPG
24-Aug-2026 18:43:22 /source/casa6/casatools/src/code/build/synthesis/Deployment/tAWPHPG
24-Aug-2026 18:43:22 /source/casa6/casatools/src/code/build/synthesis/Deployment/tAWPHPG
24-Aug-2026 18:43:22 /source/casa6/casatools/src/code/build/synthesis/Development/tAWPHPG
24-Aug-2026 18:43:22 /source/casa6/casatools/src/code/build/synthesis/Development/tAWPHPG
24-Aug-2026 18:43:22 source/casa6/casatools/src/code/build/synthesis/tAWPHPG
24-Aug-2026 18:43:22 source/casa6/casatools/src/code/build/synthesis/tAWPHPG
24-Aug-2026 18:43:22 source/casa6/casatools/src/code/build/synthesis/Release/tAWPHPG
24-Aug-2026 18:43:22 source/casa6/casatools/src/code/build/synthesis/Release/tAWPHPG
24-Aug-2026 18:43:22 source/casa6/casatools/src/code/build/synthesis/Debug/tAWPHPG
24-Aug-2026 18:43:22 source/casa6/casatools/src/code/build/synthesis/Debug/tAWPHPG
24-Aug-2026 18:43:22 source/casa6/casatools/src/code/build/synthesis/MinSizeRel/tAWPHPG
24-Aug-2026 18:43:22 source/casa6/casatools/src/code/build/synthesis/MinSizeRel/tAWPHPG
24-Aug-2026 18:43:22 source/casa6/casatools/src/code/build/synthesis/RelWithDebInfo/tAWPHPG
24-Aug-2026 18:43:22 source/casa6/casatools/src/code/build/synthesis/RelWithDebInfo/tAWPHPG
24-Aug-2026 18:43:22 source/casa6/casatools/src/code/build/synthesis/Deployment/tAWPHPG
24-Aug-2026 18:43:22 source/casa6/casatools/src/code/build/synthesis/Deployment/tAWPHPG
24-Aug-2026 18:43:22 source/casa6/casatools/src/code/build/synthesis/Development/tAWPHPG
24-Aug-2026 18:43:22 source/casa6/casatools/src/code/build/synthesis/Development/tAWPHPG
24-Aug-2026 18:43:22 22/24 Test #22: tAWPHPG ..........................***Not Run   0.00 sec
24-Aug-2026 18:43:22       Start 23: tVisModelDataRefim
24-Aug-2026 18:43:22 Could not find executable /source/casa6/casatools/src/code/build/synthesis/tVisModelDataRefim
24-Aug-2026 18:43:22 Looked in the following places:
24-Aug-2026 18:43:22 /source/casa6/casatools/src/code/build/synthesis/tVisModelDataRefim
24-Aug-2026 18:43:22 /source/casa6/casatools/src/code/build/synthesis/tVisModelDataRefim
24-Aug-2026 18:43:22 /source/casa6/casatools/src/code/build/synthesis/Release/tVisModelDataRefim
24-Aug-2026 18:43:22 /source/casa6/casatools/src/code/build/synthesis/Release/tVisModelDataRefim
24-Aug-2026 18:43:22 /source/casa6/casatools/src/code/build/synthesis/Debug/tVisModelDataRefim
24-Aug-2026 18:43:22 /source/casa6/casatools/src/code/build/synthesis/Debug/tVisModelDataRefim
24-Aug-2026 18:43:22 /source/casa6/casatools/src/code/build/synthesis/MinSizeRel/tVisModelDataRefim
24-Aug-2026 18:43:22 /source/casa6/casatools/src/code/build/synthesis/MinSizeRel/tVisModelDataRefim
24-Aug-2026 18:43:22 /source/casa6/casatools/src/code/build/synthesis/RelWithDebInfo/tVisModelDataRefim
24-Aug-2026 18:43:22 /source/casa6/casatools/src/code/build/synthesis/RelWithDebInfo/tVisModelDataRefim
24-Aug-2026 18:43:22 /source/casa6/casatools/src/code/build/synthesis/Deployment/tVisModelDataRefim
24-Aug-2026 18:43:22 /source/casa6/casatools/src/code/build/synthesis/Deployment/tVisModelDataRefim
24-Aug-2026 18:43:22 /source/casa6/casatools/src/code/build/synthesis/Development/tVisModelDataRefim
24-Aug-2026 18:43:22 /source/casa6/casatools/src/code/build/synthesis/Development/tVisModelDataRefim
24-Aug-2026 18:43:22 source/casa6/casatools/src/code/build/synthesis/tVisModelDataRefim
24-Aug-2026 18:43:22 source/casa6/casatools/src/code/build/synthesis/tVisModelDataRefim
24-Aug-2026 18:43:22 source/casa6/casatools/src/code/build/synthesis/Release/tVisModelDataRefim
24-Aug-2026 18:43:22 source/casa6/casatools/src/code/build/synthesis/Release/tVisModelDataRefim
24-Aug-2026 18:43:22 source/casa6/casatools/src/code/build/synthesis/Debug/tVisModelDataRefim
24-Aug-2026 18:43:22 source/casa6/casatools/src/code/build/synthesis/Debug/tVisModelDataRefim
24-Aug-2026 18:43:22 source/casa6/casatools/src/code/build/synthesis/MinSizeRel/tVisModelDataRefim
24-Aug-2026 18:43:22 source/casa6/casatools/src/code/build/synthesis/MinSizeRel/tVisModelDataRefim
24-Aug-2026 18:43:22 source/casa6/casatools/src/code/build/synthesis/RelWithDebInfo/tVisModelDataRefim
24-Aug-2026 18:43:22 source/casa6/casatools/src/code/build/synthesis/RelWithDebInfo/tVisModelDataRefim
24-Aug-2026 18:43:22 source/casa6/casatools/src/code/build/synthesis/Deployment/tVisModelDataRefim
24-Aug-2026 18:43:22 source/casa6/casatools/src/code/build/synthesis/Deployment/tVisModelDataRefim
24-Aug-2026 18:43:22 source/casa6/casatools/src/code/build/synthesis/Development/tVisModelDataRefim
24-Aug-2026 18:43:22 source/casa6/casatools/src/code/build/synthesis/Development/tVisModelDataRefim
24-Aug-2026 18:43:22 23/24 Test #23: tVisModelDataRefim ...............***Not Run   0.00 sec
24-Aug-2026 18:43:22 Unable to find executable: /source/casa6/casatools/src/code/build/synthesis/tVisModelDataRefim
24-Aug-2026 18:43:22       Start 24: tFFT2D
24-Aug-2026 18:43:22 Could not find executable /source/casa6/casatools/src/code/build/synthesis/tFFT2D
24-Aug-2026 18:43:22 Unable to find executable: /source/casa6/casatools/src/code/build/synthesis/tFFT2D
24-Aug-2026 18:43:22 Looked in the following places:
24-Aug-2026 18:43:22 /source/casa6/casatools/src/code/build/synthesis/tFFT2D
24-Aug-2026 18:43:22 /source/casa6/casatools/src/code/build/synthesis/tFFT2D
24-Aug-2026 18:43:22 /source/casa6/casatools/src/code/build/synthesis/Release/tFFT2D
24-Aug-2026 18:43:22 /source/casa6/casatools/src/code/build/synthesis/Release/tFFT2D
24-Aug-2026 18:43:22 /source/casa6/casatools/src/code/build/synthesis/Debug/tFFT2D
24-Aug-2026 18:43:22 /source/casa6/casatools/src/code/build/synthesis/Debug/tFFT2D
24-Aug-2026 18:43:22 /source/casa6/casatools/src/code/build/synthesis/MinSizeRel/tFFT2D
24-Aug-2026 18:43:22 /source/casa6/casatools/src/code/build/synthesis/MinSizeRel/tFFT2D
24-Aug-2026 18:43:22 /source/casa6/casatools/src/code/build/synthesis/RelWithDebInfo/tFFT2D
24-Aug-2026 18:43:22 /source/casa6/casatools/src/code/build/synthesis/RelWithDebInfo/tFFT2D
24-Aug-2026 18:43:22 /source/casa6/casatools/src/code/build/synthesis/Deployment/tFFT2D
24-Aug-2026 18:43:22 /source/casa6/casatools/src/code/build/synthesis/Deployment/tFFT2D
24-Aug-2026 18:43:22 /source/casa6/casatools/src/code/build/synthesis/Development/tFFT2D
24-Aug-2026 18:43:22 /source/casa6/casatools/src/code/build/synthesis/Development/tFFT2D
24-Aug-2026 18:43:22 source/casa6/casatools/src/code/build/synthesis/tFFT2D
24-Aug-2026 18:43:22 source/casa6/casatools/src/code/build/synthesis/tFFT2D
24-Aug-2026 18:43:22 source/casa6/casatools/src/code/build/synthesis/Release/tFFT2D
24-Aug-2026 18:43:22 source/casa6/casatools/src/code/build/synthesis/Release/tFFT2D
24-Aug-2026 18:43:22 source/casa6/casatools/src/code/build/synthesis/Debug/tFFT2D
24-Aug-2026 18:43:22 source/casa6/casatools/src/code/build/synthesis/Debug/tFFT2D
24-Aug-2026 18:43:22 source/casa6/casatools/src/code/build/synthesis/MinSizeRel/tFFT2D
24-Aug-2026 18:43:22 source/casa6/casatools/src/code/build/synthesis/MinSizeRel/tFFT2D
24-Aug-2026 18:43:22 source/casa6/casatools/src/code/build/synthesis/RelWithDebInfo/tFFT2D
24-Aug-2026 18:43:22 source/casa6/casatools/src/code/build/synthesis/RelWithDebInfo/tFFT2D
24-Aug-2026 18:43:22 source/casa6/casatools/src/code/build/synthesis/Deployment/tFFT2D
24-Aug-2026 18:43:22 source/casa6/casatools/src/code/build/synthesis/Deployment/tFFT2D
24-Aug-2026 18:43:22 source/casa6/casatools/src/code/build/synthesis/Development/tFFT2D
24-Aug-2026 18:43:22 source/casa6/casatools/src/code/build/synthesis/Development/tFFT2D
24-Aug-2026 18:43:22 24/24 Test #24: tFFT2D ...........................***Not Run   0.00 sec
24-Aug-2026 18:43:22
24-Aug-2026 18:43:22 71% tests passed, 7 tests failed out of 24
24-Aug-2026 18:43:22
24-Aug-2026 18:43:22 Total Test time (real) =   9.32 sec
24-Aug-2026 18:43:22
24-Aug-2026 18:43:22 The following tests FAILED:
24-Aug-2026 18:43:22          11 - tCalStats0 (Not Run)
24-Aug-2026 18:43:22          19 - tCalLibraryParse (Not Run)
24-Aug-2026 18:43:22          20 - tCTIter (Not Run)
24-Aug-2026 18:43:22          21 - tGridFT (Not Run)
24-Aug-2026 18:43:22          22 - tAWPHPG (Not Run)
24-Aug-2026 18:43:22          23 - tVisModelDataRefim (Not Run)
24-Aug-2026 18:43:22          24 - tFFT2D (Not Run)
24-Aug-2026 18:43:22 Errors while running CTest
24-Aug-2026 18:43:22 Failing task since return code of [/export/home/cbt-el7-6/bamboohome/temp/CASASPECS-CI300-ML228-25-ScriptBuildTask-15688062681173107841.sh] was 8 while expected 0
24-Aug-2026 18:43:22 Finished task 'Run c++ tests' with result: Failed
24-Aug-2026 18:43:22 Starting task 'Clean up' of type 'com.atlassian.bamboo.plugins.scripttask:task.builder.script'
24-Aug-2026 18:43:22
Beginning to execute external process for build 'CASASPECS - CI Build - CAS-13522 - ManyLinux 2.28 #25 (CASASPECS-CI300-ML228-25)'
... running command line:
/export/home/cbt-el7-6/bamboohome/temp/CASASPECS-CI300-ML228-25-ScriptBuildTask-15213795025818174333.sh
... in: /export/home/cbt-el7-6/bamboohome/xml-data/build-dir/CASASPECS-CI300-ML228
24-Aug-2026 18:43:22 Starting cleanup
24-Aug-2026 18:43:22 Error response from daemon: No such container: build_container
24-Aug-2026 18:43:33 casalith_container
24-Aug-2026 18:43:33 Error response from daemon: No such container: build_container
24-Aug-2026 18:43:33 casalith_container
24-Aug-2026 18:43:33 Cleanup complete
24-Aug-2026 18:43:33 Finished task 'Clean up' with result: Success
24-Aug-2026 18:43:33 Running post build plugin 'Docker Container Cleanup'
24-Aug-2026 18:43:33
Beginning to execute external process for build 'CASASPECS - CI Build - CAS-13522 - ManyLinux 2.28 #25 (CASASPECS-CI300-ML228-25)'
... running command line:
/usr/bin/docker rm -f casalith_container
... in: /export/home/cbt-el7-6/bamboohome/xml-data/build-dir/CASASPECS-CI300-ML228
24-Aug-2026 18:43:33 Error response from daemon: No such container: casalith_container
24-Aug-2026 18:43:33 Running post build plugin 'NCover Results Collector'
24-Aug-2026 18:43:33 Running post build plugin 'Build Results Label Collector'
24-Aug-2026 18:43:33 Running post build plugin 'Clover Results Collector'
24-Aug-2026 18:43:33 Running post build plugin 'npm Cache Cleanup'
24-Aug-2026 18:43:33 Running post build plugin 'Artifact Copier'
24-Aug-2026 18:43:33 Publishing an artifact: ManyLinux228 Casatestutils
24-Aug-2026 18:43:34 Finished publishing of artifact Required shared artifact Http Compression On : [ManyLinux228 Casatestutils], patterns: [casatestutils*.whl] anchored at: [source/wheels] in 92.93 ms
24-Aug-2026 18:43:34 Publishing an artifact: ManyLinux228 Python 3.12 Tool wheel
24-Aug-2026 18:43:34 Failing as no matching files has been found and empty artifacts are not allowed.
24-Aug-2026 18:43:34 Unable to publish artifact [ManyLinux228 Python 3.12 Tool wheel]:
24-Aug-2026 18:43:34 The artifact is required, build will now fail.
24-Aug-2026 18:43:34 The artifact hasn't been successfully published after 27.46 ms
24-Aug-2026 18:43:34 Finalising the build...
24-Aug-2026 18:43:34 Stopping timer.
24-Aug-2026 18:43:34 Build CASASPECS-CI300-ML228-25 completed.
24-Aug-2026 18:43:34 Running on server: post build plugin 'Build Hanging Detection Configuration'
24-Aug-2026 18:43:34 Running on server: post build plugin 'NCover Results Collector'
24-Aug-2026 18:43:34 Running on server: post build plugin 'Build Labeller'
24-Aug-2026 18:43:34 Running on server: post build plugin 'Clover Delta Calculator'
24-Aug-2026 18:43:34 Running on server: post build plugin 'Maven Dependencies Postprocessor'
24-Aug-2026 18:43:34 All post build plugins have finished
24-Aug-2026 18:43:34 Generating build results summary...
24-Aug-2026 18:43:34 Saving build results to disk...
24-Aug-2026 18:43:34 Store variable context...
24-Aug-2026 18:43:34 Finished building CASASPECS-CI300-ML228-25.