Test Tools and Tasks using https://go.nrao.edu/iers/

Build: #5 failed

Job: Test Tools Many Linux 2.28 Rocky 8.10 Py3.12 failed

Build log

The build generated 53,208 lines of output.   The output is too long and has been truncated to the last 1,000 lines. Download or view full build log.

05-Oct-2026 13:09:33 2026-10-05 17:09:34        INFO        CasacRegionManager::fromBCS        No directional region specified. Using full positional plane.
05-Oct-2026 13:09:33 2026-10-05 17:09:34        INFO        CasacRegionManager::fromBCS        Using all spectral channels.
05-Oct-2026 13:09:33 2026-10-05 17:09:34        INFO        CasacRegionManager::fromBCS        Using polarizations ALL
05-Oct-2026 13:09:33 2026-10-05 17:09:34        INFO        ImageMaskAttacher::makeMask        Created and initialized mask `mask0'
05-Oct-2026 13:09:33 2026-10-05 17:09:34        INFO        ImageMaskAttacher::makeMask        Created mask `mask0'
05-Oct-2026 13:09:33 2026-10-05 17:09:34        INFO        ImageRegion::fromRecord        Selected bounding box :
05-Oct-2026 13:09:33 2026-10-05 17:09:34        INFO        ImageRegion::fromRecord+            [149, 188, 0, 0] to [282, 188, 0, 2]  (18:53:58.333, +02.01.34.243, I, 2.369292e+10Hz to 18:54:01.612, +02.00.49.462, I, 2.369285e+10Hz)
05-Oct-2026 13:09:33 2026-10-05 17:09:34        INFO        ImageCollapser::_doDegenerateAxesCase        All subimage axes to be collapsed are degenerate, using algorithm optimized for that case.
05-Oct-2026 13:09:33 2026-10-05 17:09:34        INFO        name::        No table opened.
05-Oct-2026 13:09:33 2026-10-05 17:09:34        INFO        showcache::        The Table Cache is empty.
05-Oct-2026 13:09:33 test_tool_image_pv.py::ia_pv_test::test_CAS_2996
05-Oct-2026 13:09:33 ia.pv(): Test issues raised in CAS-2996
05-Oct-2026 13:09:33 PASSED
05-Oct-2026 13:09:33
05-Oct-2026 13:09:33 2026-10-05 17:09:34        INFO        PVGenerator::generate         Rotating image by -45 degrees about direction coordinate pixel (140, 140) to align specified slice with the x axis
05-Oct-2026 13:09:33 2026-10-05 17:09:34        INFO        PVGenerator::generate         Some pixels will fall outside the rotated image, so padding before rotating with 17 pixels.
05-Oct-2026 13:09:33 2026-10-05 17:09:34        INFO        CasacRegionManager::fromBCS        No directional region specified. Using full positional plane.
05-Oct-2026 13:09:33 2026-10-05 17:09:34        INFO        CasacRegionManager::fromBCS        Using all spectral channels.
05-Oct-2026 13:09:33 2026-10-05 17:09:34        INFO        CasacRegionManager::fromBCS        Using polarizations ALL
05-Oct-2026 13:09:33 2026-10-05 17:09:34        INFO        ImageRegion::fromRecord        Selected bounding box :
05-Oct-2026 13:09:33 2026-10-05 17:09:34        INFO        ImageRegion::fromRecord+            [0, 0, 0, 0] to [299, 299, 0, 2]  (09:48:01.492, +13.15.40.658, I, 3.63994e+10Hz to 09:47:53.299, +13.17.40.258, I, 3.63991e+10Hz)
05-Oct-2026 13:09:33 2026-10-05 17:09:34        INFO        ImageRegion::fromRecord        Original Temporary_Image size => [300, 300, 1, 3]
05-Oct-2026 13:09:33 2026-10-05 17:09:34        INFO        ImageRegion::fromRecord        New  size => [334, 334, 1, 3]
05-Oct-2026 13:09:33 2026-10-05 17:09:34        INFO        ImageRegion::fromRecord        Selected bounding box :
05-Oct-2026 13:09:33 2026-10-05 17:09:34        INFO        ImageRegion::fromRecord+            [0, 0, 0, 0] to [316, 316, 0, 2]  (09:48:01.957, +13.15.33.858, I, 3.63994e+10Hz to 09:47:53.299, +13.17.40.258, I, 3.63991e+10Hz)
05-Oct-2026 13:09:33 2026-10-05 17:09:34        INFO        ImageRegion::fromRecord        Rotating DirectionCoordinate holding axes [0, 1]
05-Oct-2026 13:09:33 2026-10-05 17:09:34        INFO        CasacRegionManager::fromBCS        No directional region specified. Using full positional plane.
05-Oct-2026 13:09:33 2026-10-05 17:09:34        INFO        CasacRegionManager::fromBCS        Using all spectral channels.
05-Oct-2026 13:09:33 2026-10-05 17:09:34        INFO        CasacRegionManager::fromBCS        Using polarizations ALL
05-Oct-2026 13:09:33 2026-10-05 17:09:34        INFO        ImageMaskAttacher::makeMask        Created and initialized mask `mask0'
05-Oct-2026 13:09:33 2026-10-05 17:09:34        INFO        ImageMaskAttacher::makeMask        Created mask `mask0'
05-Oct-2026 13:09:33 2026-10-05 17:09:34        INFO        ImageRegion::fromRecord        Selected bounding box :
05-Oct-2026 13:09:33 2026-10-05 17:09:34        INFO        ImageRegion::fromRecord+            [1, 157, 0, 0] to [313, 157, 0, 2]  (09:48:00.678, +13.15.52.535, I, 3.63994e+10Hz to 09:47:54.633, +13.17.20.782, I, 3.63991e+10Hz)
05-Oct-2026 13:09:33 2026-10-05 17:09:34        INFO        ImageCollapser::_doDegenerateAxesCase        All subimage axes to be collapsed are degenerate, using algorithm optimized for that case.
05-Oct-2026 13:09:33 2026-10-05 17:09:34        INFO        ImageFitsConverter::ImageHeaderToFITS         Truncating miscinfo field secondary_coordinates to secondar
05-Oct-2026 13:09:33 2026-10-05 17:09:34        INFO        ImageFitsConverter::ImageHeaderToFITS         Not writing miscInfo field 'secondar' - cannot handle type Record
05-Oct-2026 13:09:33 2026-10-05 17:09:34        WARN        image::open (file src/tools/image/image_cmpt.cc, line 4208)        Another image is already open, closing first
05-Oct-2026 13:09:33 2026-10-05 17:09:34        INFO        ImageFitsConverter::ImageHeaderToFITS         Truncating miscinfo field secondary_coordinates to secondar
05-Oct-2026 13:09:33 2026-10-05 17:09:34        INFO        ImageFitsConverter::ImageHeaderToFITS         Not writing miscInfo field 'secondar' - cannot handle type Record
05-Oct-2026 13:09:33 2026-10-05 17:09:34        WARN        image::open (file src/tools/image/image_cmpt.cc, line 4208)        Another image is already open, closing first
05-Oct-2026 13:09:33 2026-10-05 17:09:34        INFO        name::        No table opened.
05-Oct-2026 13:09:33 2026-10-05 17:09:34        INFO        showcache::        The Table Cache is empty.
05-Oct-2026 13:09:33 test_tool_image_pv.py::ia_pv_test::test_fits
05-Oct-2026 13:09:33 ia.pv(): Test exporting and importing to/from FITS
05-Oct-2026 13:09:33 PASSED
05-Oct-2026 13:09:33
05-Oct-2026 13:09:33 2026-10-05 17:09:34        INFO        ImageFactory::createImage        Created Paged image 'zz.im' of shape [30, 30, 30] with float valued pixels.
05-Oct-2026 13:09:33 2026-10-05 17:09:34        INFO        PVGenerator::setEndpoints         Setting pixel end points [10.0503, 19.9497], [19.9497, 10.0503]
05-Oct-2026 13:09:33 2026-10-05 17:09:34        INFO        PVGenerator::generate         Rotating image by 45 degrees about direction coordinate pixel (15, 15) to align specified slice with the x axis
05-Oct-2026 13:09:33 2026-10-05 17:09:34        INFO        ImageRegion::fromRecord        Selected bounding box :
05-Oct-2026 13:09:33 2026-10-05 17:09:34        INFO        ImageRegion::fromRecord+            [0, 0, 0] to [29, 29, 29]  (00:01:00.001, -00.15.00.003, 1.41498e+09Hz to 23:59:03.999, +00.14.00.002, 1.41501e+09Hz)
05-Oct-2026 13:09:33 2026-10-05 17:09:34        INFO        ImageRegion::fromRecord        Rotating DirectionCoordinate holding axes [0, 1]
05-Oct-2026 13:09:33 2026-10-05 17:09:34        INFO        CasacRegionManager::fromBCS        No directional region specified. Using full positional plane.
05-Oct-2026 13:09:33 2026-10-05 17:09:34        INFO        CasacRegionManager::fromBCS        Using all spectral channels.
05-Oct-2026 13:09:33 2026-10-05 17:09:34        INFO        ImageMaskAttacher::makeMask        Created and initialized mask `mask0'
05-Oct-2026 13:09:33 2026-10-05 17:09:34        INFO        ImageMaskAttacher::makeMask        Created mask `mask0'
05-Oct-2026 13:09:33 2026-10-05 17:09:34        INFO        ImageRegion::fromRecord        Selected bounding box :
05-Oct-2026 13:09:33 2026-10-05 17:09:34        INFO        ImageRegion::fromRecord+            [8, 15, 0] to [22, 15, 29]  (00:00:19.799, +00.04.56.985, 1.41498e+09Hz to 23:59:40.201, -00.04.56.985, 1.41501e+09Hz)
05-Oct-2026 13:09:33 2026-10-05 17:09:34        INFO        ImageCollapser::_doDegenerateAxesCase        All subimage axes to be collapsed are degenerate, using algorithm optimized for that case.
05-Oct-2026 13:09:33 2026-10-05 17:09:34        INFO        ::::ImageFactory::createImage        Created Paged image 'zz.im' of shape [30, 30, 30] with float valued pixels.
05-Oct-2026 13:09:33 2026-10-05 17:09:34        INFO        ::::image::fromshape        Ran ia.fromshape
05-Oct-2026 13:09:33 2026-10-05 17:09:34        INFO        ::::image::fromshape        ia.fromshape(outfile="zz.im", shape=[30,30,30], csys={...}, linear=false, overwrite=false, log=true, type="f")
05-Oct-2026 13:09:33 2026-10-05 17:09:34        INFO        ::::image::pv        Ran ia.pv
05-Oct-2026 13:09:33 2026-10-05 17:09:34        INFO        ::::image::pv        ia.pv(outfile="", start=[], end=[], center=[15,15], length="14arcmin", pa="45deg", width=1, unit="arcsec", overwrite=false, region={...}, chans="", stokes="", mask="", stretch=false, wantreturn=true)
05-Oct-2026 13:09:33 2026-10-05 17:09:34        INFO        name::        No table opened.
05-Oct-2026 13:09:33 2026-10-05 17:09:34        INFO        showcache::        The Table Cache is empty.
05-Oct-2026 13:09:33 test_tool_image_pv.py::ia_pv_test::test_history
05-Oct-2026 13:09:33 Verify history is written to created image
05-Oct-2026 13:09:33 PASSED
05-Oct-2026 13:09:33
05-Oct-2026 13:09:33 2026-10-05 17:09:34        INFO        ImageFactory::createImage        Created Paged image 'zxye.im' of shape [10, 10, 10] with float valued pixels.
05-Oct-2026 13:09:33 2026-10-05 17:09:34        INFO        name::        No table opened.
05-Oct-2026 13:09:33 2026-10-05 17:09:34        INFO        showcache::        The Table Cache is empty.
05-Oct-2026 13:09:33 2026-10-05 17:09:34        INFO        PVGenerator::generate         Rotation angle (very nearly) 0 degrees, no rotation required
05-Oct-2026 13:09:33 2026-10-05 17:09:34        INFO        ImageRegion::fromRecord        Selected bounding box :
05-Oct-2026 13:09:33 2026-10-05 17:09:34        INFO        ImageRegion::fromRecord+            [2, 5, 0] to [7, 5, 9]  (00:00:12.000, +00.00.00.000, 1.415e+09Hz to 23:59:52.000, +00.00.00.000, 1.415e+09Hz)
05-Oct-2026 13:09:33 2026-10-05 17:09:34        INFO        ImageCollapser::_doDegenerateAxesCase        All subimage axes to be collapsed are degenerate, using algorithm optimized for that case.
05-Oct-2026 13:09:33 2026-10-05 17:09:34        INFO        SubImageFactory::createImage        Creating image 'test_pv_0' of shape [6, 10]
05-Oct-2026 13:09:33 2026-10-05 17:09:34        INFO        name::        No table opened.
05-Oct-2026 13:09:33 2026-10-05 17:09:34        INFO        showcache::        The Table Cache is empty.
05-Oct-2026 13:09:33 2026-10-05 17:09:34        INFO        PVGenerator::setEndpoints         Setting pixel end points [2, 5], [7, 5]
05-Oct-2026 13:09:33 2026-10-05 17:09:34        INFO        PVGenerator::generate         Rotation angle (very nearly) 0 degrees, no rotation required
05-Oct-2026 13:09:33 2026-10-05 17:09:34        INFO        ImageRegion::fromRecord        Selected bounding box :
05-Oct-2026 13:09:33 2026-10-05 17:09:34        INFO        ImageRegion::fromRecord+            [2, 5, 0] to [7, 5, 9]  (00:00:12.000, +00.00.00.000, 1.415e+09Hz to 23:59:52.000, +00.00.00.000, 1.415e+09Hz)
05-Oct-2026 13:09:33 2026-10-05 17:09:34        INFO        ImageCollapser::_doDegenerateAxesCase        All subimage axes to be collapsed are degenerate, using algorithm optimized for that case.
05-Oct-2026 13:09:34 2026-10-05 17:09:34        INFO        SubImageFactory::createImage        Creating image 'test_pv_1' of shape [6, 10]
05-Oct-2026 13:09:34 2026-10-05 17:09:34        INFO        name::        No table opened.
05-Oct-2026 13:09:34 2026-10-05 17:09:34        INFO        showcache::        The Table Cache is empty.
05-Oct-2026 13:09:34 2026-10-05 17:09:34        INFO        PVGenerator::setEndpoints         Setting pixel end points [2, 5], [7, 5]
05-Oct-2026 13:09:34 2026-10-05 17:09:34        INFO        PVGenerator::generate         Rotation angle (very nearly) 0 degrees, no rotation required
05-Oct-2026 13:09:34 2026-10-05 17:09:34        INFO        ImageRegion::fromRecord        Selected bounding box :
05-Oct-2026 13:09:34 2026-10-05 17:09:34        INFO        ImageRegion::fromRecord+            [2, 5, 0] to [7, 5, 9]  (00:00:12.000, +00.00.00.000, 1.415e+09Hz to 23:59:52.000, +00.00.00.000, 1.415e+09Hz)
05-Oct-2026 13:09:34 2026-10-05 17:09:34        INFO        ImageCollapser::_doDegenerateAxesCase        All subimage axes to be collapsed are degenerate, using algorithm optimized for that case.
05-Oct-2026 13:09:34 2026-10-05 17:09:34        INFO        SubImageFactory::createImage        Creating image 'test_pv_2' of shape [6, 10]
05-Oct-2026 13:09:34 2026-10-05 17:09:34        INFO        name::        No table opened.
05-Oct-2026 13:09:34 2026-10-05 17:09:34        INFO        showcache::        The Table Cache is empty.
05-Oct-2026 13:09:34 2026-10-05 17:09:34        INFO        PVGenerator::setEndpoints         Setting pixel end points [2, 5], [7, 5]
05-Oct-2026 13:09:34 2026-10-05 17:09:34        INFO        PVGenerator::generate         Rotation angle (very nearly) 0 degrees, no rotation required
05-Oct-2026 13:09:34 2026-10-05 17:09:34        INFO        ImageRegion::fromRecord        Selected bounding box :
05-Oct-2026 13:09:34 2026-10-05 17:09:34        INFO        ImageRegion::fromRecord+            [2, 5, 0] to [7, 5, 9]  (00:00:12.000, +00.00.00.000, 1.415e+09Hz to 23:59:52.000, +00.00.00.000, 1.415e+09Hz)
05-Oct-2026 13:09:34 2026-10-05 17:09:34        INFO        ImageCollapser::_doDegenerateAxesCase        All subimage axes to be collapsed are degenerate, using algorithm optimized for that case.
05-Oct-2026 13:09:34 2026-10-05 17:09:34        INFO        SubImageFactory::createImage        Creating image 'test_pv_3' of shape [6, 10]
05-Oct-2026 13:09:34 2026-10-05 17:09:34        INFO        name::        No table opened.
05-Oct-2026 13:09:34 2026-10-05 17:09:34        INFO        showcache::        The Table Cache is empty.
05-Oct-2026 13:09:34 2026-10-05 17:09:34        INFO        PVGenerator::setEndpoints         Setting pixel end points [2, 5], [7, 5]
05-Oct-2026 13:09:34 2026-10-05 17:09:34        INFO        PVGenerator::generate         Rotation angle (very nearly) 0 degrees, no rotation required
05-Oct-2026 13:09:34 2026-10-05 17:09:34        INFO        ImageRegion::fromRecord        Selected bounding box :
05-Oct-2026 13:09:34 2026-10-05 17:09:34        INFO        ImageRegion::fromRecord+            [2, 5, 0] to [7, 5, 9]  (00:00:12.000, +00.00.00.000, 1.415e+09Hz to 23:59:52.000, +00.00.00.000, 1.415e+09Hz)
05-Oct-2026 13:09:34 2026-10-05 17:09:34        INFO        ImageCollapser::_doDegenerateAxesCase        All subimage axes to be collapsed are degenerate, using algorithm optimized for that case.
05-Oct-2026 13:09:34 2026-10-05 17:09:34        INFO        SubImageFactory::createImage        Creating image 'test_pv_4' of shape [6, 10]
05-Oct-2026 13:09:34 2026-10-05 17:09:34        INFO        name::        No table opened.
05-Oct-2026 13:09:34 2026-10-05 17:09:34        INFO        showcache::        The Table Cache is empty.
05-Oct-2026 13:09:34 2026-10-05 17:09:34        INFO        PVGenerator::setEndpoints         Setting pixel end points [2, 5], [7, 5]
05-Oct-2026 13:09:34 2026-10-05 17:09:34        INFO        PVGenerator::generate         Rotation angle (very nearly) 0 degrees, no rotation required
05-Oct-2026 13:09:34 2026-10-05 17:09:34        INFO        ImageRegion::fromRecord        Selected bounding box :
05-Oct-2026 13:09:34 2026-10-05 17:09:34        INFO        ImageRegion::fromRecord+            [2, 5, 0] to [7, 5, 9]  (00:00:12.000, +00.00.00.000, 1.415e+09Hz to 23:59:52.000, +00.00.00.000, 1.415e+09Hz)
05-Oct-2026 13:09:34 2026-10-05 17:09:34        INFO        ImageCollapser::_doDegenerateAxesCase        All subimage axes to be collapsed are degenerate, using algorithm optimized for that case.
05-Oct-2026 13:09:34 2026-10-05 17:09:34        INFO        SubImageFactory::createImage        Creating image 'test_pv_5' of shape [6, 10]
05-Oct-2026 13:09:34 2026-10-05 17:09:34        INFO        name::        No table opened.
05-Oct-2026 13:09:34 2026-10-05 17:09:34        INFO        showcache::        The Table Cache is empty.
05-Oct-2026 13:09:34 2026-10-05 17:09:34        INFO        PVGenerator::setEndpoints         Setting pixel end points [2, 5], [7, 5]
05-Oct-2026 13:09:34 2026-10-05 17:09:34        INFO        PVGenerator::generate         Rotation angle (very nearly) 0 degrees, no rotation required
05-Oct-2026 13:09:34 2026-10-05 17:09:34        INFO        ImageRegion::fromRecord        Selected bounding box :
05-Oct-2026 13:09:34 2026-10-05 17:09:34        INFO        ImageRegion::fromRecord+            [2, 5, 0] to [7, 5, 9]  (00:00:12.000, +00.00.00.000, 1.415e+09Hz to 23:59:52.000, +00.00.00.000, 1.415e+09Hz)
05-Oct-2026 13:09:34 2026-10-05 17:09:34        INFO        ImageCollapser::_doDegenerateAxesCase        All subimage axes to be collapsed are degenerate, using algorithm optimized for that case.
05-Oct-2026 13:09:34 2026-10-05 17:09:34        INFO        SubImageFactory::createImage        Creating image 'test_pv_6' of shape [6, 10]
05-Oct-2026 13:09:34 2026-10-05 17:09:34        INFO        name::        No table opened.
05-Oct-2026 13:09:34 2026-10-05 17:09:34        INFO        showcache::        The Table Cache is empty.
05-Oct-2026 13:09:34 2026-10-05 17:09:34        INFO        PVGenerator::generate         Rotation angle (very nearly) 0 degrees, no rotation required
05-Oct-2026 13:09:34 2026-10-05 17:09:34        INFO        ImageRegion::fromRecord        Selected bounding box :
05-Oct-2026 13:09:34 2026-10-05 17:09:34        INFO        ImageRegion::fromRecord+            [2, 4, 0] to [7, 6, 9]  (00:00:12.000, -00.01.00.000, 1.415e+09Hz to 23:59:52.000, +00.01.00.000, 1.415e+09Hz)
05-Oct-2026 13:09:34 2026-10-05 17:09:34        INFO        SubImageFactory::createImage        Creating image 'test_pv_1_0' of shape [6, 10]
05-Oct-2026 13:09:34 2026-10-05 17:09:34        INFO        PVGenerator::generate         Rotation angle (very nearly) 0 degrees, no rotation required
05-Oct-2026 13:09:34 2026-10-05 17:09:34        INFO        ImageRegion::fromRecord        Selected bounding box :
05-Oct-2026 13:09:34 2026-10-05 17:09:34        INFO        ImageRegion::fromRecord+            [2, 4, 0] to [7, 6, 9]  (00:00:12.000, -00.01.00.000, 1.415e+09Hz to 23:59:52.000, +00.01.00.000, 1.415e+09Hz)
05-Oct-2026 13:09:34 2026-10-05 17:09:34        INFO        SubImageFactory::createImage        Creating image 'test_pv_1_1' of shape [6, 10]
05-Oct-2026 13:09:34 2026-10-05 17:09:34        INFO        PVGenerator::setWidth         Rounding width up to next odd number of pixels (3), or 3arcmin
05-Oct-2026 13:09:34 2026-10-05 17:09:34        INFO        PVGenerator::generate         Rotation angle (very nearly) 0 degrees, no rotation required
05-Oct-2026 13:09:34 2026-10-05 17:09:34        INFO        ImageRegion::fromRecord        Selected bounding box :
05-Oct-2026 13:09:34 2026-10-05 17:09:34        INFO        ImageRegion::fromRecord+            [2, 4, 0] to [7, 6, 9]  (00:00:12.000, -00.01.00.000, 1.415e+09Hz to 23:59:52.000, +00.01.00.000, 1.415e+09Hz)
05-Oct-2026 13:09:34 2026-10-05 17:09:34        INFO        SubImageFactory::createImage        Creating image 'test_pv_1_2' of shape [6, 10]
05-Oct-2026 13:09:34 2026-10-05 17:09:34        INFO        PVGenerator::setWidth         Rounding width up to next odd number of pixels (3), or 3arcmin
05-Oct-2026 13:09:34 2026-10-05 17:09:34        INFO        PVGenerator::generate         Rotation angle (very nearly) 0 degrees, no rotation required
05-Oct-2026 13:09:34 2026-10-05 17:09:34        INFO        ImageRegion::fromRecord        Selected bounding box :
05-Oct-2026 13:09:34 2026-10-05 17:09:34        INFO        ImageRegion::fromRecord+            [2, 4, 0] to [7, 6, 9]  (00:00:12.000, -00.01.00.000, 1.415e+09Hz to 23:59:52.000, +00.01.00.000, 1.415e+09Hz)
05-Oct-2026 13:09:34 2026-10-05 17:09:34        INFO        SubImageFactory::createImage        Creating image 'test_pv_1_3' of shape [6, 10]
05-Oct-2026 13:09:34 2026-10-05 17:09:34        INFO        PVGenerator::setWidth         Rounding width up to next odd number of pixels (3), or 180000marcsec
05-Oct-2026 13:09:34 2026-10-05 17:09:34        INFO        PVGenerator::generate         Rotation angle (very nearly) 0 degrees, no rotation required
05-Oct-2026 13:09:34 2026-10-05 17:09:34        INFO        ImageRegion::fromRecord        Selected bounding box :
05-Oct-2026 13:09:34 2026-10-05 17:09:34        INFO        ImageRegion::fromRecord+            [2, 4, 0] to [7, 6, 9]  (00:00:12.000, -00.01.00.000, 1.415e+09Hz to 23:59:52.000, +00.01.00.000, 1.415e+09Hz)
05-Oct-2026 13:09:34 2026-10-05 17:09:34        INFO        SubImageFactory::createImage        Creating image 'test_pv_1_4' of shape [6, 10]
05-Oct-2026 13:09:34 2026-10-05 17:09:34        INFO        name::        No table opened.
05-Oct-2026 13:09:34 2026-10-05 17:09:34        INFO        showcache::        The Table Cache is empty.
05-Oct-2026 13:09:34 test_tool_image_pv.py::ia_pv_test::test_pv
05-Oct-2026 13:09:34 ia.pv(): Test pv()
05-Oct-2026 13:09:34 PASSED
05-Oct-2026 13:09:34
05-Oct-2026 13:09:34 2026-10-05 17:09:34        INFO        ImageFactory::createImage        Created Temp image  of shape [50, 50, 1000] with float valued pixels.
05-Oct-2026 13:09:34 2026-10-05 17:09:34        INFO        PVGenerator::generate         Rotating image by -45 degrees about direction coordinate pixel (7.5, 7.5) to align specified slice with the x axis
05-Oct-2026 13:09:34 2026-10-05 17:09:34        INFO        ImageRegion::fromRecord        Selected bounding box :
05-Oct-2026 13:09:34 2026-10-05 17:09:34        INFO        ImageRegion::fromRecord+            [0, 0, 0] to [49, 49, 999]  (03:01:57.530, -35.32.49.013, 1.4145e+09Hz to 02:57:58.673, -34.43.38.701, 1.4155e+09Hz)
05-Oct-2026 13:09:34 2026-10-05 17:09:34        INFO        ImageRegion::fromRecord        Rotating DirectionCoordinate holding axes [0, 1]
05-Oct-2026 13:09:34 2026-10-05 17:09:34        INFO        CasacRegionManager::fromBCS        No directional region specified. Using full positional plane.
05-Oct-2026 13:09:34 2026-10-05 17:09:34        INFO        CasacRegionManager::fromBCS        Using all spectral channels.
05-Oct-2026 13:09:34 2026-10-05 17:09:34        INFO        ImageMaskAttacher::makeMask        Created and initialized mask `mask0'
05-Oct-2026 13:09:34 2026-10-05 17:09:34        INFO        ImageMaskAttacher::makeMask        Created mask `mask0'
05-Oct-2026 13:09:34 2026-10-05 17:09:34        INFO        ImageRegion::fromRecord        Selected bounding box :
05-Oct-2026 13:09:34 2026-10-05 17:09:34        INFO        ImageRegion::fromRecord+            [4, 7, 0] to [11, 7, 999]  (03:01:31.077, -35.28.09.040, 1.4145e+09Hz to 03:01:06.781, -35.23.12.033, 1.4155e+09Hz)
05-Oct-2026 13:09:34 2026-10-05 17:09:34        INFO        ImageCollapser::_doDegenerateAxesCase        All subimage axes to be collapsed are degenerate, using algorithm optimized for that case.
05-Oct-2026 13:09:34 2026-10-05 17:09:34        INFO        name::        No table opened.
05-Oct-2026 13:09:34 2026-10-05 17:09:34        INFO        showcache::        The Table Cache is empty.
05-Oct-2026 13:09:34 test_tool_image_pv.py::ia_pv_test::test_refpix_far_outside_image
05-Oct-2026 13:09:34 Test refpix far outside image doesn't lead to malloc error, CAS-5251
05-Oct-2026 13:09:34 PASSED
05-Oct-2026 13:09:34
05-Oct-2026 13:09:34 2026-10-05 17:09:34        INFO        ImageFactory::createImage        Created Paged image 'maskim' of shape [200, 200, 1, 1] with float valued pixels.
05-Oct-2026 13:09:34 2026-10-05 17:09:34        INFO        ImageFactory::createImage        Created Paged image 'kk' of shape [200, 200, 1, 20] with float valued pixels.
05-Oct-2026 13:09:34 2026-10-05 17:09:34        SEVERE        image::pv (file src/tools/image/image_cmpt.cc, line 4856)        Exception Reported: The input image shape ([200, 200, 1, 20]) and mask shape ([200, 200, 1, 1]) are different, and it was specified that the mask should not be extended, so the mask cannot be applied to the (sub)image. Specifying that the mask should be extended may resolve the issue at File: /source/casainstall/include/casacpp/imageanalysis/ImageAnalysis/SubImageFactory.tcc, line: 306
05-Oct-2026 13:09:34 2026-10-05 17:09:34        INFO        PVGenerator::generate         Rotation angle (very nearly) 0 degrees, no rotation required
05-Oct-2026 13:09:34 2026-10-05 17:09:34        INFO        ImageRegion::fromRecord        Selected bounding box :
05-Oct-2026 13:09:34 2026-10-05 17:09:34        INFO        ImageRegion::fromRecord+            [2, 2, 0, 0] to [20, 2, 0, 19]  (00:06:32.213, -01.38.00.797, I, 1.41499e+09Hz to 00:05:20.159, -01.38.00.797, I, 1.41501e+09Hz)
05-Oct-2026 13:09:34 2026-10-05 17:09:34        INFO        ImageCollapser::_doDegenerateAxesCase        All subimage axes to be collapsed are degenerate, using algorithm optimized for that case.
05-Oct-2026 13:09:34 2026-10-05 17:09:34        INFO        CasacRegionManager::fromBCS        No directional region specified. Using full positional plane.
05-Oct-2026 13:09:34 2026-10-05 17:09:34        INFO        CasacRegionManager::fromBCS        Using all spectral channels.
05-Oct-2026 13:09:34 2026-10-05 17:09:34        INFO        CasacRegionManager::fromBCS        Using polarizations ALL
05-Oct-2026 13:09:34 2026-10-05 17:09:34        INFO        ImageMaskAttacher::makeMask        Created mask `mask0'
05-Oct-2026 13:09:34 2026-10-05 17:09:34        INFO        name::        No table opened.
05-Oct-2026 13:09:34 2026-10-05 17:09:34        INFO        showcache::        The Table Cache is empty.
05-Oct-2026 13:09:34 test_tool_image_pv.py::ia_pv_test::test_stretch
05-Oct-2026 13:09:34 ia.pv(): Test stretch parameter
05-Oct-2026 13:09:34 PASSED
05-Oct-2026 13:09:34
05-Oct-2026 13:09:34 - generated xml file: /home/casatest/casa6/casatestutils/nosedir/xml/test_tool_image_pv/nose.xml -
05-Oct-2026 13:09:34 ========================= 7 passed, 1 warning in 1.02s =========================
05-Oct-2026 13:09:34 ============================= test session starts ==============================
05-Oct-2026 13:09:34 platform linux -- Python 3.12.9, pytest-9.1.1, pluggy-1.6.0 -- /home/casatest/venv/bin/python3.12
05-Oct-2026 13:09:34 cachedir: .pytest_cache
05-Oct-2026 13:09:34 rootdir: /home/casatest/casa6/casatestutils/nosedir/test_tool_image_rebin
05-Oct-2026 13:09:34 configfile: pytest.ini
05-Oct-2026 13:09:34 collecting ... collected 8 items
05-Oct-2026 13:09:34
05-Oct-2026 13:09:34
05-Oct-2026 13:09:34 2026-10-05 17:09:35        INFO        ImageFactory::createImage        Created Paged image 'erzvd.im' of shape [30, 30, 1] with float valued pixels.
05-Oct-2026 13:09:34 2026-10-05 17:09:35        INFO        ImageRebinner::setFactors        Not all rebinning factors were specified, filling in those not specified with factors of 1, so will rebin according to factor=[5, 5, 1]
05-Oct-2026 13:09:34 2026-10-05 17:09:35        INFO        name::        No table opened.
05-Oct-2026 13:09:34 2026-10-05 17:09:35        INFO        showcache::        The Table Cache is empty.
05-Oct-2026 13:09:34 test_tool_image_rebin.py::ia_rebin_test::test_box
05-Oct-2026 13:09:34 Test use of box
05-Oct-2026 13:09:34 PASSED
05-Oct-2026 13:09:34
05-Oct-2026 13:09:34 2026-10-05 17:09:35        INFO        ImageFactory::createImage        Created Paged image 'xxyy.im' of shape [20, 20, 20] with float valued pixels.
05-Oct-2026 13:09:34 2026-10-05 17:09:35        INFO        CasacRegionManager::fromBCS        No directional region specified. Using full positional plane.
05-Oct-2026 13:09:34 2026-10-05 17:09:35        INFO        CasacRegionManager::fromBCS        Using all spectral channels.
05-Oct-2026 13:09:34 2026-10-05 17:09:35        INFO        CasacRegionManager::fromBCS        No directional region specified. Using full positional plane.
05-Oct-2026 13:09:34 2026-10-05 17:09:35        INFO        CasacRegionManager::fromBCS        Using all spectral channels.
05-Oct-2026 13:09:34 2026-10-05 17:09:35        INFO        name::        No table opened.
05-Oct-2026 13:09:34 2026-10-05 17:09:35        INFO        showcache::        The Table Cache is empty.
05-Oct-2026 13:09:34 test_tool_image_rebin.py::ia_rebin_test::test_crop
05-Oct-2026 13:09:34 Test crop parameter
05-Oct-2026 13:09:34 PASSED
05-Oct-2026 13:09:34
05-Oct-2026 13:09:34 2026-10-05 17:09:35        INFO        ImageFactory::createImage        Created Paged image 'kjfasd.im' of shape [20, 20, 1] with float valued pixels.
05-Oct-2026 13:09:34 2026-10-05 17:09:35        INFO        CasacRegionManager::fromBCS        No directional region specified. Using full positional plane.
05-Oct-2026 13:09:34 2026-10-05 17:09:35        INFO        CasacRegionManager::fromBCS        Using polarizations ALL
05-Oct-2026 13:09:34 2026-10-05 17:09:35        INFO        ImageRebinner::setFactors        Not all rebinning factors were specified, filling in those not specified with factors of 1, so will rebin according to factor=[5, 5, 1]
05-Oct-2026 13:09:34 2026-10-05 17:09:35        INFO        ImageRegion::fromRecord        Selected bounding box :
05-Oct-2026 13:09:34 2026-10-05 17:09:35        INFO        ImageRegion::fromRecord+            [0, 0] to [3, 3]  (00:00:32.000, -00.08.00.000 to 23:59:32.000, +00.07.00.000)
05-Oct-2026 13:09:34 2026-10-05 17:09:35        INFO        name::        No table opened.
05-Oct-2026 13:09:34 2026-10-05 17:09:35        INFO        showcache::        The Table Cache is empty.
05-Oct-2026 13:09:34 test_tool_image_rebin.py::ia_rebin_test::test_dropdeg
05-Oct-2026 13:09:34 Test dropdeg parameter
05-Oct-2026 13:09:34 PASSED
05-Oct-2026 13:09:34
05-Oct-2026 13:09:34 2026-10-05 17:09:35        INFO        ImageFactory::createImage        Created Paged image 'kbesd.im' of shape [20, 20, 20] with float valued pixels.
05-Oct-2026 13:09:34 2026-10-05 17:09:35        INFO        CasacRegionManager::fromBCS        No directional region specified. Using full positional plane.
05-Oct-2026 13:09:34 2026-10-05 17:09:35        INFO        CasacRegionManager::fromBCS        Using all spectral channels.
05-Oct-2026 13:09:34 2026-10-05 17:09:35        INFO        ImageRegion::fromRecord        Selected bounding box :
05-Oct-2026 13:09:34 2026-10-05 17:09:35        INFO        ImageRegion::fromRecord+            [0, 0, 0] to [19, 19, 0]  (00:00:40.000, -00.10.00.001, 1.415e+09Hz to 23:59:24.000, +00.09.00.001, 1.415e+09Hz)
05-Oct-2026 13:09:34 2026-10-05 17:09:35        INFO        name::        No table opened.
05-Oct-2026 13:09:34 2026-10-05 17:09:35        INFO        showcache::        The Table Cache is empty.
05-Oct-2026 13:09:34 test_tool_image_rebin.py::ia_rebin_test::test_dropdeg2
05-Oct-2026 13:09:34 axes that become degenerate when regridded are dropped if dropdeg=True: CAS-5836
05-Oct-2026 13:09:34 PASSED
05-Oct-2026 13:09:34
05-Oct-2026 13:09:34 2026-10-05 17:09:35        INFO        ImageFactory::createImage        Created Paged image 'st.im' of shape [20, 40] with float valued pixels.
05-Oct-2026 13:09:34 2026-10-05 17:09:35        INFO        CasacRegionManager::fromBCS        No directional region specified. Using full positional plane.
05-Oct-2026 13:09:34 2026-10-05 17:09:35        INFO        name::        No table opened.
05-Oct-2026 13:09:34 2026-10-05 17:09:35        INFO        showcache::        The Table Cache is empty.
05-Oct-2026 13:09:34 test_tool_image_rebin.py::ia_rebin_test::test_general
05-Oct-2026 13:09:34 ia.rebin(): General tests
05-Oct-2026 13:09:34 PASSED
05-Oct-2026 13:09:34
05-Oct-2026 13:09:34 2026-10-05 17:09:35        INFO        ImageFactory::createImage        Created Paged image 'zz.im' of shape [20, 20, 20] with float valued pixels.
05-Oct-2026 13:09:34 2026-10-05 17:09:35        INFO        CasacRegionManager::fromBCS        No directional region specified. Using full positional plane.
05-Oct-2026 13:09:34 2026-10-05 17:09:35        INFO        CasacRegionManager::fromBCS        Using all spectral channels.
05-Oct-2026 13:09:34 2026-10-05 17:09:35        INFO        ::::ImageFactory::createImage        Created Paged image 'zz.im' of shape [20, 20, 20] with float valued pixels.
05-Oct-2026 13:09:34 2026-10-05 17:09:35        INFO        ::::image::fromshape        Ran ia.fromshape
05-Oct-2026 13:09:34 2026-10-05 17:09:35        INFO        ::::image::fromshape        ia.fromshape(outfile="zz.im", shape=[20,20,20], csys={...}, linear=false, overwrite=false, log=true, type="f")
05-Oct-2026 13:09:34 2026-10-05 17:09:35        INFO        ::::image::rebin        Ran ia.rebin
05-Oct-2026 13:09:34 2026-10-05 17:09:35        INFO        ::::image::rebin        ia.rebin(outfile="", bin=[1,1,20], region="", mask="", dropdeg=false, overwrite=false, stretch=false, crop=false)
05-Oct-2026 13:09:34 2026-10-05 17:09:35        INFO        name::        No table opened.
05-Oct-2026 13:09:34 2026-10-05 17:09:35        INFO        showcache::        The Table Cache is empty.
05-Oct-2026 13:09:34 test_tool_image_rebin.py::ia_rebin_test::test_history
05-Oct-2026 13:09:34 Test history writing
05-Oct-2026 13:09:34 PASSED
05-Oct-2026 13:09:34
05-Oct-2026 13:09:34 2026-10-05 17:09:35        INFO        ImageFactory::createImage        Created Paged image 'gd.im' of shape [10, 10, 10] with float valued pixels.
05-Oct-2026 13:09:34 2026-10-05 17:09:35        INFO        image::_casaQuantityFromVar         Will use values specified in major, minor, pa to set beam
05-Oct-2026 13:09:34 2026-10-05 17:09:35        INFO        BeamManipulator::set        This image currently has no beams of any kind. Since channel and/or polarization were specified, a set of per plane beams, each equal to the specified beam, will be created.
05-Oct-2026 13:09:34 2026-10-05 17:09:35        INFO        BeamManipulator::set        Beam parameters:  Major          : 4 arcsec
05-Oct-2026 13:09:34 2026-10-05 17:09:35        INFO        BeamManipulator::set+          Minor          : 2 arcsec
05-Oct-2026 13:09:34 2026-10-05 17:09:35        INFO        BeamManipulator::set+          Position Angle : 0 deg
05-Oct-2026 13:09:34 2026-10-05 17:09:35        INFO        CasacRegionManager::fromBCS        No directional region specified. Using full positional plane.
05-Oct-2026 13:09:34 2026-10-05 17:09:35        INFO        CasacRegionManager::fromBCS        Using all spectral channels.
05-Oct-2026 13:09:34 2026-10-05 17:09:35        INFO        CasacRegionManager::fromBCS        No directional region specified. Using full positional plane.
05-Oct-2026 13:09:34 2026-10-05 17:09:35        INFO        CasacRegionManager::fromBCS        Using all spectral channels.
05-Oct-2026 13:09:34 2026-10-05 17:09:35        SEVERE        image::rebin        Exception Reported: Exception: This image has multiple beams. The spectral axis cannot be rebinned.
05-Oct-2026 13:09:34 2026-10-05 17:09:35        SEVERE        image::rebin+        ... thrown by casacore::RebinImage<T>::RebinImage(const casacore::ImageInterface<T>&, const casacore::IPosition&) [with T = float] at File: /source/casainstall/include/casacore/images/Images/RebinImage.tcc, line: 50
05-Oct-2026 13:09:34 2026-10-05 17:09:35        INFO        name::        No table opened.
05-Oct-2026 13:09:34 2026-10-05 17:09:35        INFO        showcache::        The Table Cache is empty.
05-Oct-2026 13:09:34 test_tool_image_rebin.py::ia_rebin_test::test_multibeam
05-Oct-2026 13:09:34 Test multiple beams
05-Oct-2026 13:09:34 PASSED
05-Oct-2026 13:09:34
05-Oct-2026 13:09:34 2026-10-05 17:09:35        INFO        ImageFactory::createImage        Created Paged image 'maskim' of shape [200, 200, 1, 1] with float valued pixels.
05-Oct-2026 13:09:34 2026-10-05 17:09:35        INFO        ImageFactory::createImage        Created Paged image 'aa.im' of shape [200, 200, 1, 10] with float valued pixels.
05-Oct-2026 13:09:34 2026-10-05 17:09:35        INFO        CasacRegionManager::fromBCS        No directional region specified. Using full positional plane.
05-Oct-2026 13:09:34 2026-10-05 17:09:35        INFO        CasacRegionManager::fromBCS        Using all spectral channels.
05-Oct-2026 13:09:34 2026-10-05 17:09:35        INFO        CasacRegionManager::fromBCS        Using polarizations ALL
05-Oct-2026 13:09:34 2026-10-05 17:09:35        SEVERE        image::rebin        Exception Reported: The input image shape ([200, 200, 1, 10]) and mask shape ([200, 200, 1, 1]) are different, and it was specified that the mask should not be extended, so the mask cannot be applied to the (sub)image. Specifying that the mask should be extended may resolve the issue at File: /source/casainstall/include/casacpp/imageanalysis/ImageAnalysis/SubImageFactory.tcc, line: 306
05-Oct-2026 13:09:34 2026-10-05 17:09:35        INFO        CasacRegionManager::fromBCS        No directional region specified. Using full positional plane.
05-Oct-2026 13:09:34 2026-10-05 17:09:35        INFO        CasacRegionManager::fromBCS        Using all spectral channels.
05-Oct-2026 13:09:34 2026-10-05 17:09:35        INFO        CasacRegionManager::fromBCS        Using polarizations ALL
05-Oct-2026 13:09:34 2026-10-05 17:09:35        INFO        ImageMaskAttacher::makeMask        Created mask `mask0'
05-Oct-2026 13:09:34 2026-10-05 17:09:35        INFO        name::        No table opened.
05-Oct-2026 13:09:34 2026-10-05 17:09:35        INFO        showcache::        The Table Cache is empty.
05-Oct-2026 13:09:34 test_tool_image_rebin.py::ia_rebin_test::test_stretch
05-Oct-2026 13:09:34 ia.rebin(): Test stretch parameter
05-Oct-2026 13:09:34 PASSED
05-Oct-2026 13:09:34
05-Oct-2026 13:09:34 - generated xml file: /home/casatest/casa6/casatestutils/nosedir/xml/test_tool_image_rebin/nose.xml -
05-Oct-2026 13:09:34 ========================= 8 passed, 1 warning in 0.51s =========================
05-Oct-2026 13:09:35 ============================= test session starts ==============================
05-Oct-2026 13:09:35 platform linux -- Python 3.12.9, pytest-9.1.1, pluggy-1.6.0 -- /home/casatest/venv/bin/python3.12
05-Oct-2026 13:09:35 cachedir: .pytest_cache
05-Oct-2026 13:09:35 rootdir: /home/casatest/casa6/casatestutils/nosedir/test_tool_componentlist
05-Oct-2026 13:09:35 configfile: pytest.ini
05-Oct-2026 13:09:35 collecting ... collected 4 items
05-Oct-2026 13:09:35
05-Oct-2026 13:09:35
05-Oct-2026 13:09:35 test_tool_componentlist.py::componentlist_test::test_getfluxerror
05-Oct-2026 13:09:35 Test cl.getfluxerror()
05-Oct-2026 13:09:35 PASSED
05-Oct-2026 13:09:35
05-Oct-2026 13:09:35 2026-10-05 17:09:35        WARN        componentlist::close        componentlist closed
05-Oct-2026 13:09:35 2026-10-05 17:09:35        WARN        componentlist::close        componentlist closed
05-Oct-2026 13:09:35 test_tool_componentlist.py::componentlist_test::test_plp
05-Oct-2026 13:09:35 Test adding/updating plp spectral component
05-Oct-2026 13:09:35 PASSED
05-Oct-2026 13:09:35
05-Oct-2026 13:09:35 2026-10-05 17:09:35        INFO        componentlist::summarize        SUMMARY OF COMPONENT
05-Oct-2026 13:09:35 2026-10-05 17:09:35        INFO        componentlist::summarize+        Shape: Gaussian
05-Oct-2026 13:09:35 2026-10-05 17:09:35        INFO        componentlist::summarize+        Flux density: [(1,0), (0,0), (0,0), (0,0)] Jy +/- [(0,0), (0,0), (0,0), (0,0)]
05-Oct-2026 13:09:35 2026-10-05 17:09:35        INFO        componentlist::summarize+        Spectral model: Constant
05-Oct-2026 13:09:35 2026-10-05 17:09:35        INFO        componentlist::summarize+        Position: Position ---
05-Oct-2026 13:09:35 2026-10-05 17:09:35        INFO        componentlist::summarize+               --- long:   10:30:00.000 (fixed)
05-Oct-2026 13:09:35 2026-10-05 17:09:35        INFO        componentlist::summarize+               --- lat:  - 20.00.00.00 (fixed)
05-Oct-2026 13:09:35 2026-10-05 17:09:35        INFO        componentlist::summarize+        
05-Oct-2026 13:09:35 2026-10-05 17:09:35        INFO        componentlist::summarize+        Size:
05-Oct-2026 13:09:35 2026-10-05 17:09:35        INFO        componentlist::summarize+               --- major axis FWHM:     4.00 arcsec (fixed)
05-Oct-2026 13:09:35 2026-10-05 17:09:35        INFO        componentlist::summarize+               --- minor axis FWHM:     2.00 arcsec (fixed)
05-Oct-2026 13:09:35 2026-10-05 17:09:35        INFO        componentlist::summarize+               --- position angle: 30.0deg (fixed)
05-Oct-2026 13:09:35 2026-10-05 17:09:35        SEVERE        componentlist::summarize        Exception Reported: List has only 1 components, but zero-based component 1 specified. Please specify a component less than 1
05-Oct-2026 13:09:35 test_tool_componentlist.py::componentlist_test::test_summarize
05-Oct-2026 13:09:35 Test the cl.summarize() method
05-Oct-2026 13:09:35 PASSED
05-Oct-2026 13:09:35
05-Oct-2026 13:09:35 2026-10-05 17:09:35        SEVERE        componentlist::putkeyword        Exception Reported: Exception: A table is not attached to this ComponentList.
05-Oct-2026 13:09:35 2026-10-05 17:09:35        SEVERE        componentlist::putkeyword+        ... thrown by void casa::ComponentList::putKeyword(const casacore::String&, const casac::variant&) at File: /source/casa6/casatools/src/code/components/ComponentModels/ComponentList.cc, line: 1238
05-Oct-2026 13:09:35 2026-10-05 17:09:35        SEVERE        componentlist::getkeyword        Exception Reported: Exception: A table is not attached to this ComponentList.
05-Oct-2026 13:09:35 2026-10-05 17:09:35        SEVERE        componentlist::getkeyword+        ... thrown by casac::variant* casa::ComponentList::getKeyword(const casacore::String&) const at File: /source/casa6/casatools/src/code/components/ComponentModels/ComponentList.cc, line: 1248
05-Oct-2026 13:09:35 2026-10-05 17:09:35        SEVERE        componentlist::haskeyword        Exception Reported: Exception: A table is not attached to this ComponentList.
05-Oct-2026 13:09:35 2026-10-05 17:09:35        SEVERE        componentlist::haskeyword+        ... thrown by bool casa::ComponentList::hasKeyword(const casacore::String&) const at File: /source/casa6/casatools/src/code/components/ComponentModels/ComponentList.cc, line: 1233
05-Oct-2026 13:09:35 2026-10-05 17:09:35        SEVERE        componentlist::putkeyword        Exception Reported: Exception: A table is not attached to this ComponentList.
05-Oct-2026 13:09:35 2026-10-05 17:09:35        SEVERE        componentlist::putkeyword+        ... thrown by void casa::ComponentList::putKeyword(const casacore::String&, const casac::variant&) at File: /source/casa6/casatools/src/code/components/ComponentModels/ComponentList.cc, line: 1238
05-Oct-2026 13:09:35 2026-10-05 17:09:35        SEVERE        componentlist::getkeyword        Exception Reported: Exception: A table is not attached to this ComponentList.
05-Oct-2026 13:09:35 2026-10-05 17:09:35        SEVERE        componentlist::getkeyword+        ... thrown by casac::variant* casa::ComponentList::getKeyword(const casacore::String&) const at File: /source/casa6/casatools/src/code/components/ComponentModels/ComponentList.cc, line: 1248
05-Oct-2026 13:09:35 2026-10-05 17:09:35        SEVERE        componentlist::haskeyword        Exception Reported: Exception: A table is not attached to this ComponentList.
05-Oct-2026 13:09:35 2026-10-05 17:09:35        SEVERE        componentlist::haskeyword+        ... thrown by bool casa::ComponentList::hasKeyword(const casacore::String&) const at File: /source/casa6/casatools/src/code/components/ComponentModels/ComponentList.cc, line: 1233
05-Oct-2026 13:09:35 test_tool_componentlist.py::componentlist_test::test_table_keyword_interface
05-Oct-2026 13:09:35 Test putting, getting, querying table keywords
05-Oct-2026 13:09:35 PASSED
05-Oct-2026 13:09:35
05-Oct-2026 13:09:35 - generated xml file: /home/casatest/casa6/casatestutils/nosedir/xml/test_tool_componentlist/nose.xml -
05-Oct-2026 13:09:35 ========================= 4 passed, 1 warning in 0.30s =========================
05-Oct-2026 13:09:35 ============================= test session starts ==============================
05-Oct-2026 13:09:35 platform linux -- Python 3.12.9, pytest-9.1.1, pluggy-1.6.0 -- /home/casatest/venv/bin/python3.12
05-Oct-2026 13:09:35 cachedir: .pytest_cache
05-Oct-2026 13:09:35 rootdir: /home/casatest/casa6/casatestutils/nosedir/test_tool_linearmosaic
05-Oct-2026 13:09:35 configfile: pytest.ini
05-Oct-2026 13:09:35 collecting ... collected 5 items
05-Oct-2026 13:09:35
05-Oct-2026 13:09:35
05-Oct-2026 13:09:36 2026-10-05 17:09:36        WARN        ImageRegrid::regrid        You are regridding an image whose beam is not well sampled by the pixel size.  Total flux can be lost when regridding such images, especially when the new pixel size is larger than the old pixel size. It is recommended to check the total flux of your input and output image, and if necessary rebin the input to have smaller pixels.
05-Oct-2026 13:09:36 2026-10-05 17:09:37        WARN        ImageRegrid::regrid        You are regridding an image whose beam is not well sampled by the pixel size.  Total flux can be lost when regridding such images, especially when the new pixel size is larger than the old pixel size. It is recommended to check the total flux of your input and output image, and if necessary rebin the input to have smaller pixels.
05-Oct-2026 13:09:37 test_tool_linearmosaic.py::test_tool_linearmosaic::test_flat_noise
05-Oct-2026 13:09:37 test_flat_noise (flat noise type with flat noise input)
05-Oct-2026 13:09:37 PASSED
05-Oct-2026 13:09:37
05-Oct-2026 13:09:37 2026-10-05 17:09:37        WARN        ImageRegrid::regrid        You are regridding an image whose beam is not well sampled by the pixel size.  Total flux can be lost when regridding such images, especially when the new pixel size is larger than the old pixel size. It is recommended to check the total flux of your input and output image, and if necessary rebin the input to have smaller pixels.
05-Oct-2026 13:09:37 test_tool_linearmosaic.py::test_tool_linearmosaic::test_flat_noise_existing_image
05-Oct-2026 13:09:37 test_flat_noise_existing image (flat noise type onto an existing image)
05-Oct-2026 13:09:37 PASSED
05-Oct-2026 13:09:37
05-Oct-2026 13:09:38 test_tool_linearmosaic.py::test_tool_linearmosaic::test_flat_noise_flat_sky_input
05-Oct-2026 13:09:38 test_flat_noise_flat_sky_input (flat noise type with flat sky input)
05-Oct-2026 13:09:38 PASSED
05-Oct-2026 13:09:38
05-Oct-2026 13:09:40 test_tool_linearmosaic.py::test_tool_linearmosaic::test_flat_sky
05-Oct-2026 13:09:40 test_flat_sky (flat sky type with flat noise input
05-Oct-2026 13:09:40 PASSED
05-Oct-2026 13:09:40
05-Oct-2026 13:09:41 test_tool_linearmosaic.py::test_tool_linearmosaic::test_flat_sky_flat_sky_input
05-Oct-2026 13:09:41 test_flat_sky_flat_sky_input (flat sky type with flat sky inputs)
05-Oct-2026 13:09:41 PASSED
05-Oct-2026 13:09:41
05-Oct-2026 13:09:41 - generated xml file: /home/casatest/casa6/casatestutils/nosedir/xml/test_tool_linearmosaic/nose.xml -
05-Oct-2026 13:09:41 ========================= 5 passed, 1 warning in 6.06s =========================
05-Oct-2026 13:09:41 ============================= test session starts ==============================
05-Oct-2026 13:09:41 platform linux -- Python 3.12.9, pytest-9.1.1, pluggy-1.6.0 -- /home/casatest/venv/bin/python3.12
05-Oct-2026 13:09:41 cachedir: .pytest_cache
05-Oct-2026 13:09:41 rootdir: /home/casatest/casa6/casatestutils/nosedir/test_tool_table
05-Oct-2026 13:09:41 configfile: pytest.ini
05-Oct-2026 13:09:42 collecting ... table tool tests will use /opt/casa/data/casatestdata/unittest/table/n08c1_swap1.ms
05-Oct-2026 13:09:42 collected 13 items
05-Oct-2026 13:09:42
05-Oct-2026 13:09:42
05-Oct-2026 13:09:42 2026-10-05 17:09:42        INFO        name::        No table opened.
05-Oct-2026 13:09:42 2026-10-05 17:09:42        INFO        name::        No table opened.
05-Oct-2026 13:09:42 test_tool_table.py::TableGetcoliterTest::test_consistency
05-Oct-2026 13:09:42 PASSED
05-Oct-2026 13:09:42
05-Oct-2026 13:09:42 2026-10-05 17:09:42        INFO        name::        No table opened.
05-Oct-2026 13:09:42 2026-10-05 17:09:42        INFO        name::        No table opened.
05-Oct-2026 13:09:42 test_tool_table.py::TableGetcoliterTest::test_element_match
05-Oct-2026 13:09:42 Test element match using direct comparison and StopIteration assertion. 
05-Oct-2026 13:09:42 [4.71188568e+09 4.71188569e+09 4.71188570e+09 4.71188571e+09
05-Oct-2026 13:09:42 4.71188571e+09 4.71188572e+09 4.71188573e+09 4.71188574e+09]
05-Oct-2026 13:09:42 [4.71188568e+09 4.71188569e+09 4.71188570e+09 4.71188571e+09
05-Oct-2026 13:09:42 4.71188571e+09 4.71188572e+09 4.71188573e+09 4.71188574e+09]
05-Oct-2026 13:09:42 PASSED
05-Oct-2026 13:09:42
05-Oct-2026 13:09:42 2026-10-05 17:09:42        INFO        name::        No table opened.
05-Oct-2026 13:09:42 2026-10-05 17:09:42        INFO        name::        No table opened.
05-Oct-2026 13:09:42 test_tool_table.py::TableGetcoliterTest::test_errors
05-Oct-2026 13:09:42 PASSED
05-Oct-2026 13:09:42
05-Oct-2026 13:09:42 2026-10-05 17:09:42        INFO        name::        No table opened.
05-Oct-2026 13:09:42 2026-10-05 17:09:42        INFO        name::        No table opened.
05-Oct-2026 13:09:42 test_tool_table.py::TableGetcoliterTest::test_values
05-Oct-2026 13:09:42 PASSED
05-Oct-2026 13:09:42
05-Oct-2026 13:09:42 2026-10-05 17:09:42        INFO        name::        No table opened.
05-Oct-2026 13:09:42 2026-10-05 17:09:42        INFO        name::        No table opened.
05-Oct-2026 13:09:42 test_tool_table.py::TableRowTest::test_all_rows
05-Oct-2026 13:09:42 PASSED
05-Oct-2026 13:09:42
05-Oct-2026 13:09:42 2026-10-05 17:09:42        INFO        name::        No table opened.
05-Oct-2026 13:09:42 2026-10-05 17:09:42        INFO        name::        No table opened.
05-Oct-2026 13:09:42 test_tool_table.py::TableRowTest::test_columnnames_exclude
05-Oct-2026 13:09:42 PASSED
05-Oct-2026 13:09:42
05-Oct-2026 13:09:42 2026-10-05 17:09:42        INFO        name::        No table opened.
05-Oct-2026 13:09:42 2026-10-05 17:09:42        INFO        name::        No table opened.
05-Oct-2026 13:09:42 test_tool_table.py::TableRowTest::test_columnnames_include
05-Oct-2026 13:09:42 PASSED
05-Oct-2026 13:09:42
05-Oct-2026 13:09:42 2026-10-05 17:09:42        INFO        name::        No table opened.
05-Oct-2026 13:09:42 2026-10-05 17:09:42        INFO        name::        No table opened.
05-Oct-2026 13:09:42 test_tool_table.py::TableRowTest::test_get
05-Oct-2026 13:09:42 Test get function
05-Oct-2026 13:09:42 PASSED
05-Oct-2026 13:09:42
05-Oct-2026 13:09:42 2026-10-05 17:09:42        INFO        name::        No table opened.
05-Oct-2026 13:09:42 2026-10-05 17:09:42        INFO        name::        No table opened.
05-Oct-2026 13:09:42 2026-10-05 17:09:42        INFO        name::        No table opened.
05-Oct-2026 13:09:42 2026-10-05 17:09:42        INFO        name::        No table opened.
05-Oct-2026 13:09:42 test_tool_table.py::TableRowTest::test_put
05-Oct-2026 13:09:42 Test put function
05-Oct-2026 13:09:42 PASSED
05-Oct-2026 13:09:42
05-Oct-2026 13:09:42 2026-10-05 17:09:42        INFO        name::        No table opened.
05-Oct-2026 13:09:42 2026-10-05 17:09:42        INFO        name::        No table opened.
05-Oct-2026 13:09:42 test_tool_table.py::TableRowTest::test_shape
05-Oct-2026 13:09:42 Test for valid data shape
05-Oct-2026 13:09:42 PASSED
05-Oct-2026 13:09:42
05-Oct-2026 13:09:42 2026-10-05 17:09:42        INFO        name::        No table opened.
05-Oct-2026 13:09:42 2026-10-05 17:09:42        INFO        name::        No table opened.
05-Oct-2026 13:09:42 test_tool_table.py::TableRowTest::test_some_rows
05-Oct-2026 13:09:42 PASSED
05-Oct-2026 13:09:42
05-Oct-2026 13:09:42 2026-10-05 17:09:42        INFO        ImageFactory::createImage        Created Paged image 'tmp.im' of shape [3, 4] with float valued pixels.
05-Oct-2026 13:09:42 2026-10-05 17:09:42        SEVERE        getcellslice::bogus        Exception Reported: Table column bogus is unknown
05-Oct-2026 13:09:42 2026-10-05 17:09:42        SEVERE        getcellslice::map        Exception Reported: TableColumn: row number 1 exceeds #rows 1 in table /home/casatest/casa6/casatestutils/nosedir/test_tool_table/tmp.im
05-Oct-2026 13:09:42 2026-10-05 17:09:42        SEVERE        getcellslice::map        Exception Reported: Exception: blc must have length of 2.
05-Oct-2026 13:09:42 2026-10-05 17:09:42        SEVERE        getcellslice::map+        ... thrown by void casac::table::_checkCorner(const std::vector<long int>&, const casacore::String&, const casacore::IPosition&, const std::pair<std::vector<long int>, std::vector<long int> >* const&) at File: src/tools/table/table_cmpt.cc, line: 1386
05-Oct-2026 13:09:42 2026-10-05 17:09:42        SEVERE        getcellslice::map        Exception Reported: Exception: All elements of blc must be greater than or equal to 0.
05-Oct-2026 13:09:42 2026-10-05 17:09:42        SEVERE        getcellslice::map+        ... thrown by void casac::table::_checkCorner(const std::vector<long int>&, const casacore::String&, const casacore::IPosition&, const std::pair<std::vector<long int>, std::vector<long int> >* const&) at File: src/tools/table/table_cmpt.cc, line: 1390
05-Oct-2026 13:09:42 2026-10-05 17:09:42        SEVERE        getcellslice::map        Exception Reported: Exception: Element 1 of blc must be less than 4.
05-Oct-2026 13:09:42 2026-10-05 17:09:42        SEVERE        getcellslice::map+        ... thrown by void casac::table::_checkCorner(const std::vector<long int>&, const casacore::String&, const casacore::IPosition&, const std::pair<std::vector<long int>, std::vector<long int> >* const&) at File: src/tools/table/table_cmpt.cc, line: 1395
05-Oct-2026 13:09:42 2026-10-05 17:09:42        SEVERE        getcellslice::map        Exception Reported: Exception: trc must have length of 2.
05-Oct-2026 13:09:42 2026-10-05 17:09:42        SEVERE        getcellslice::map+        ... thrown by void casac::table::_checkCorner(const std::vector<long int>&, const casacore::String&, const casacore::IPosition&, const std::pair<std::vector<long int>, std::vector<long int> >* const&) at File: src/tools/table/table_cmpt.cc, line: 1386
05-Oct-2026 13:09:42 2026-10-05 17:09:42        SEVERE        getcellslice::map        Exception Reported: Exception: All elements of trc must be greater than or equal to 0.
05-Oct-2026 13:09:42 2026-10-05 17:09:42        SEVERE        getcellslice::map+        ... thrown by void casac::table::_checkCorner(const std::vector<long int>&, const casacore::String&, const casacore::IPosition&, const std::pair<std::vector<long int>, std::vector<long int> >* const&) at File: src/tools/table/table_cmpt.cc, line: 1390
05-Oct-2026 13:09:42 2026-10-05 17:09:42        SEVERE        getcellslice::map        Exception Reported: Exception: Element 0 of trc must be less than 3.
05-Oct-2026 13:09:42 2026-10-05 17:09:42        SEVERE        getcellslice::map+        ... thrown by void casac::table::_checkCorner(const std::vector<long int>&, const casacore::String&, const casacore::IPosition&, const std::pair<std::vector<long int>, std::vector<long int> >* const&) at File: src/tools/table/table_cmpt.cc, line: 1395
05-Oct-2026 13:09:42 2026-10-05 17:09:42        SEVERE        getcellslice::map        Exception Reported: Exception: All elements of trc must be greater than or equal to their corresponding blc elements.
05-Oct-2026 13:09:42 2026-10-05 17:09:42        SEVERE        getcellslice::map+        ... thrown by void casac::table::_checkCorner(const std::vector<long int>&, const casacore::String&, const casacore::IPosition&, const std::pair<std::vector<long int>, std::vector<long int> >* const&) at File: src/tools/table/table_cmpt.cc, line: 1405
05-Oct-2026 13:09:42 2026-10-05 17:09:42        SEVERE        getcellslice::map        Exception Reported: Exception: incr must have length of 2.
05-Oct-2026 13:09:42 2026-10-05 17:09:42        SEVERE        getcellslice::map+        ... thrown by casac::variant* casac::table::getcellslice(const string&, long int, const std::vector<long int>&, const std::vector<long int>&, const std::vector<long int>&) at File: src/tools/table/table_cmpt.cc, line: 1466
05-Oct-2026 13:09:42 2026-10-05 17:09:42        SEVERE        getcellslice::map        Exception Reported: Exception: All elements of incr must be greater than 0.
05-Oct-2026 13:09:42 2026-10-05 17:09:42        SEVERE        getcellslice::map+        ... thrown by casac::variant* casac::table::getcellslice(const string&, long int, const std::vector<long int>&, const std::vector<long int>&, const std::vector<long int>&) at File: src/tools/table/table_cmpt.cc, line: 1471
05-Oct-2026 13:09:42 2026-10-05 17:09:42        INFO        name::        No table opened.
05-Oct-2026 13:09:42 2026-10-05 17:09:42        INFO        name::        No table opened.
05-Oct-2026 13:09:42 test_tool_table.py::table_getcellslice_test::test_exceptions
05-Oct-2026 13:09:42 Test various exception cases
05-Oct-2026 13:09:42 PASSED
05-Oct-2026 13:09:42
05-Oct-2026 13:09:42 2026-10-05 17:09:42        INFO        ImageFactory::createImage        Created Paged image 'tmp.im' of shape [3, 4] with float valued pixels.
05-Oct-2026 13:09:42 2026-10-05 17:09:42        INFO        name::        No table opened.
05-Oct-2026 13:09:42 2026-10-05 17:09:42        INFO        name::        No table opened.
05-Oct-2026 13:09:42 2026-10-05 17:09:42        INFO        name::        No table opened.
05-Oct-2026 13:09:42 test_tool_table.py::table_getcellslice_test::test_getcellslice
05-Oct-2026 13:09:42 tests for valid inputs
05-Oct-2026 13:09:42 PASSED
05-Oct-2026 13:09:42
05-Oct-2026 13:09:42 - generated xml file: /home/casatest/casa6/casatestutils/nosedir/xml/test_tool_table/nose.xml -
05-Oct-2026 13:09:42 ======================== 13 passed, 1 warning in 0.54s =========================
05-Oct-2026 13:09:42 ============================= test session starts ==============================
05-Oct-2026 13:09:42 platform linux -- Python 3.12.9, pytest-9.1.1, pluggy-1.6.0 -- /home/casatest/venv/bin/python3.12
05-Oct-2026 13:09:42 cachedir: .pytest_cache
05-Oct-2026 13:09:42 rootdir: /home/casatest/casa6/casatestutils/nosedir/test_tool_imagepol
05-Oct-2026 13:09:42 configfile: pytest.ini
05-Oct-2026 13:09:42 collecting ... collected 17 items
05-Oct-2026 13:09:42
05-Oct-2026 13:09:42
05-Oct-2026 13:09:42 2026-10-05 17:09:43        INFO        ImageFITSConverter::readBeamsTable        Loading multiple beams from BEAMS table
05-Oct-2026 13:09:42 2026-10-05 17:09:43        INFO        imagepol::complexFractionalLinearPolarization(...)        Creating image 'g' of shape [10, 10, 10, 1]
05-Oct-2026 13:09:42 2026-10-05 17:09:43        INFO        ImageFITSConverter::readBeamsTable        Loading multiple beams from BEAMS table
05-Oct-2026 13:09:42 2026-10-05 17:09:43        INFO        imagepol::complexFractionalLinearPolarization(...)        Creating image 'hh' of shape [10, 10, 10, 1]
05-Oct-2026 13:09:42 2026-10-05 17:09:43        SEVERE        imagepol::complexfraclinpol        Exception Reported: Exception: Input image has multiple beams and the corresponding beams for the stokes planes necessary for this computation are not equal..
05-Oct-2026 13:09:42 2026-10-05 17:09:43        SEVERE        imagepol::complexfraclinpol+        ... thrown by casacore::Bool casa::ImagePolarimetry::_checkBeams(const std::vector<casa::ImagePolarimetry::StokesTypes>&, casacore::Bool, casacore::Bool) const at File: /source/casa6/casatools/src/code/imageanalysis/ImageAnalysis/ImagePolarimetry.cc, line: 1626
05-Oct-2026 13:09:42 test_tool_imagepol.py::po_complexfraclinpol_test::test_multibeam
05-Oct-2026 13:09:42 Test multibeam images for correct behavior
05-Oct-2026 13:09:42 pol_eq_beams.fits
05-Oct-2026 13:09:42 PASSED
05-Oct-2026 13:09:42
05-Oct-2026 13:09:42 2026-10-05 17:09:43        INFO        ImageFITSConverter::readBeamsTable        Loading multiple beams from BEAMS table
05-Oct-2026 13:09:42 2026-10-05 17:09:43        INFO        ImagePolProxy::complexlinpol        Creating image 'g' of shape [10, 10, 10, 1]
05-Oct-2026 13:09:42 2026-10-05 17:09:43        INFO        ImageFITSConverter::readBeamsTable        Loading multiple beams from BEAMS table
05-Oct-2026 13:09:42 2026-10-05 17:09:43        INFO        ImagePolProxy::complexlinpol        Creating image 'hh' of shape [10, 10, 10, 1]
05-Oct-2026 13:09:42 2026-10-05 17:09:43        SEVERE        imagepol::complexlinpol        Exception Reported: Exception: Input image has multiple beams and the corresponding beams for the stokes planes necessary for this computation are not equal..
05-Oct-2026 13:09:42 2026-10-05 17:09:43        SEVERE        imagepol::complexlinpol+        ... thrown by casacore::Bool casa::ImagePolarimetry::_checkBeams(const std::vector<casa::ImagePolarimetry::StokesTypes>&, casacore::Bool, casacore::Bool) const at File: /source/casa6/casatools/src/code/imageanalysis/ImageAnalysis/ImagePolarimetry.cc, line: 1626
05-Oct-2026 13:09:42 2026-10-05 17:09:43        INFO        name::        No table opened.
05-Oct-2026 13:09:42 2026-10-05 17:09:43        INFO        showcache::        The Table Cache is empty.
05-Oct-2026 13:09:42 test_tool_imagepol.py::po_complexlinpol_test::test_multibeam
05-Oct-2026 13:09:42 Test multibeam images for correct behavior
05-Oct-2026 13:09:42 PASSED
05-Oct-2026 13:09:42
05-Oct-2026 13:09:42 2026-10-05 17:09:43        INFO        ImageFITSConverter::readBeamsTable        Loading multiple beams from BEAMS table
05-Oct-2026 13:09:42 2026-10-05 17:09:43        INFO        ImageFITSConverter::readBeamsTable        Loading multiple beams from BEAMS table
05-Oct-2026 13:09:42 2026-10-05 17:09:43        INFO        ImageFITSConverter::readBeamsTable        Loading multiple beams from BEAMS table
05-Oct-2026 13:09:42 2026-10-05 17:09:43        INFO        ImageFITSConverter::readBeamsTable        Loading multiple beams from BEAMS table
05-Oct-2026 13:09:42 2026-10-05 17:09:43        SEVERE        imagepol::depolratio        Exception Reported: Exception: Input image has multiple beams and the corresponding beams for the stokes planes necessary for this computation are not equal..
05-Oct-2026 13:09:42 2026-10-05 17:09:43        SEVERE        imagepol::depolratio+        ... thrown by casacore::Bool casa::ImagePolarimetry::_checkBeams(const std::vector<casa::ImagePolarimetry::StokesTypes>&, casacore::Bool, casacore::Bool) const at File: /source/casa6/casatools/src/code/imageanalysis/ImageAnalysis/ImagePolarimetry.cc, line: 1626
05-Oct-2026 13:09:42 2026-10-05 17:09:43        INFO        ImageFITSConverter::readBeamsTable        Loading multiple beams from BEAMS table
05-Oct-2026 13:09:42 2026-10-05 17:09:43        SEVERE        imagepol::depolratio        Exception Reported: Exception: Input image has multiple beams and the corresponding beams for the stokes planes necessary for this computation are not equal..
05-Oct-2026 13:09:42 2026-10-05 17:09:43        SEVERE        imagepol::depolratio+        ... thrown by casacore::Bool casa::ImagePolarimetry::_checkBeams(const std::vector<casa::ImagePolarimetry::StokesTypes>&, casacore::Bool, casacore::Bool) const at File: /source/casa6/casatools/src/code/imageanalysis/ImageAnalysis/ImagePolarimetry.cc, line: 1626
05-Oct-2026 13:09:42 test_tool_imagepol.py::po_depolratio_test::test_multibeam
05-Oct-2026 13:09:42 Test multibeam images for correct behavior
05-Oct-2026 13:09:42 pol_eq_beams.fits
05-Oct-2026 13:09:42 PASSED
05-Oct-2026 13:09:42
05-Oct-2026 13:09:42 2026-10-05 17:09:43        INFO        ImageFITSConverter::readBeamsTable        Loading multiple beams from BEAMS table
05-Oct-2026 13:09:42 2026-10-05 17:09:43        SEVERE        imagepol::fourierRotationMeasure (file /source/casa6/casatools/src/code/imageanalysis/ImageAnalysis/ImagePolProxy.cc, line 623)        Cannot run fourierRotationMeasure on an image with multiple beams
05-Oct-2026 13:09:42 2026-10-05 17:09:43        SEVERE        imagepol::fourierrotationmeasure        Exception Reported: 2026-10-05 17:09:43        SEVERE        imagepol::fourierRotationMeasure (file /source/casa6/casatools/src/code/imageanalysis/ImageAnalysis/ImagePolProxy.cc, line 623)        Cannot run fourierRotationMeasure on an image with multiple beams
05-Oct-2026 13:09:42 2026-10-05 17:09:43        INFO        ImageFITSConverter::readBeamsTable        Loading multiple beams from BEAMS table
05-Oct-2026 13:09:42 2026-10-05 17:09:43        SEVERE        imagepol::fourierRotationMeasure (file /source/casa6/casatools/src/code/imageanalysis/ImageAnalysis/ImagePolProxy.cc, line 623)        Cannot run fourierRotationMeasure on an image with multiple beams
05-Oct-2026 13:09:42 2026-10-05 17:09:43        SEVERE        imagepol::fourierrotationmeasure        Exception Reported: 2026-10-05 17:09:43        SEVERE        imagepol::fourierRotationMeasure (file /source/casa6/casatools/src/code/imageanalysis/ImageAnalysis/ImagePolProxy.cc, line 623)        Cannot run fourierRotationMeasure on an image with multiple beams
05-Oct-2026 13:09:42 test_tool_imagepol.py::po_fourierrotationmeasure_test::test_multibeam
05-Oct-2026 13:09:42 Test multibeam images for correct behavior
05-Oct-2026 13:09:42 pol_eq_beams.fits
05-Oct-2026 13:09:42 PASSED
05-Oct-2026 13:09:42
05-Oct-2026 13:09:42 2026-10-05 17:09:43        INFO        ImageFITSConverter::readBeamsTable        Loading multiple beams from BEAMS table
05-Oct-2026 13:09:42 2026-10-05 17:09:43        INFO        ImagePolarimetry::sigma         Determined noise from V image to be 1.0119
05-Oct-2026 13:09:42 2026-10-05 17:09:43        INFO        ImagePolarimetry::fracLinPol         Debiasing with sigma  = 1.0119
05-Oct-2026 13:09:42 2026-10-05 17:09:43        INFO        ImageFITSConverter::readBeamsTable        Loading multiple beams from BEAMS table
05-Oct-2026 13:09:42 test_tool_imagepol.py::po_fraclinpol_test::test_multibeam
05-Oct-2026 13:09:42 Test multibeam images for correct behavior
05-Oct-2026 13:09:42 pol_eq_beams.fits
05-Oct-2026 13:09:42 PASSED
05-Oct-2026 13:09:42
05-Oct-2026 13:09:42 2026-10-05 17:09:43        INFO        ImageFITSConverter::readBeamsTable        Loading multiple beams from BEAMS table
05-Oct-2026 13:09:42 2026-10-05 17:09:43        INFO        ImagePolarimetry::sigma         Determined noise from V image to be 1.0119
05-Oct-2026 13:09:42 2026-10-05 17:09:43        INFO        ImagePolarimetry::fracTotPol         Debiasing with sigma = 1.0119
05-Oct-2026 13:09:42 2026-10-05 17:09:43        INFO        ImageFITSConverter::readBeamsTable        Loading multiple beams from BEAMS table
05-Oct-2026 13:09:42 test_tool_imagepol.py::po_fractotpol_test::test_multibeam
05-Oct-2026 13:09:42 Test multibeam images for correct behavior
05-Oct-2026 13:09:42 pol_eq_beams.fits
05-Oct-2026 13:09:42 PASSED
05-Oct-2026 13:09:42
05-Oct-2026 13:09:42 2026-10-05 17:09:43        INFO        ImageFITSConverter::readBeamsTable        Loading multiple beams from BEAMS table
05-Oct-2026 13:09:42 2026-10-05 17:09:43        INFO        ImagePolTask::_sigma         Determined noise from V image to be 1.0119
05-Oct-2026 13:09:42 2026-10-05 17:09:43        INFO        ImagePolTask::_sigma         Debiasing with sigma = 1.0119
05-Oct-2026 13:09:42 2026-10-05 17:09:43        INFO        ImageFITSConverter::readBeamsTable        Loading multiple beams from BEAMS table
05-Oct-2026 13:09:42 test_tool_imagepol.py::po_linpolint_test::test_multibeam
05-Oct-2026 13:09:42 Test multibeam images for correct behavior
05-Oct-2026 13:09:42 pol_eq_beams.fits
05-Oct-2026 13:09:42 PASSED
05-Oct-2026 13:09:42
05-Oct-2026 13:09:42 2026-10-05 17:09:43        INFO        ImageFITSConverter::readBeamsTable        Loading multiple beams from BEAMS table
05-Oct-2026 13:09:42 2026-10-05 17:09:43        WARN        LinearPolarizationAngleCalculator::compute (file /source/casa6/casatools/src/code/imageanalysis/ImageAnalysis/LinearPolarizationAngleCalculator.cc, line 40)        The input image has multiple beams. Because these beams can vary with stokes/polarization, they will not be copied to the output image
05-Oct-2026 13:09:42 2026-10-05 17:09:43        INFO        SubImageFactory::createImage        Creating image 'g' of shape [10, 10, 10, 1]
05-Oct-2026 13:09:42 2026-10-05 17:09:43        INFO        ImageFITSConverter::readBeamsTable        Loading multiple beams from BEAMS table
05-Oct-2026 13:09:42 2026-10-05 17:09:43        SEVERE        imagepol::linpolposang        Exception Reported: Exception: Input image has multiple beams and the corresponding beams for the stokes planes necessary for this computation are not equal..
05-Oct-2026 13:09:42 2026-10-05 17:09:43        SEVERE        imagepol::linpolposang+        ... thrown by casacore::Bool casa::ImagePolTask::_checkBeams(const std::vector<casa::ImagePolTask::StokesTypes>&, casacore::Bool, casacore::Bool) const at File: /source/casa6/casatools/src/code/imageanalysis/ImageAnalysis/ImagePolTask.cc, line: 79
05-Oct-2026 13:09:42 test_tool_imagepol.py::po_linpolposang_test::test_multibeam
05-Oct-2026 13:09:42 Test multibeam images for correct behavior
05-Oct-2026 13:09:42 pol_eq_beams.fits
05-Oct-2026 13:09:42 PASSED
05-Oct-2026 13:09:42
05-Oct-2026 13:09:42 2026-10-05 17:09:43        INFO        ImageFactory::createImage        Created Paged image 'rm_input.im' of shape [20, 20, 4, 20] with float valued pixels.
05-Oct-2026 13:09:42 2026-10-05 17:09:43        INFO        ImagePol::rotationMeasure        Creating image 'rm.im' of shape [20, 20]
05-Oct-2026 13:09:42 2026-10-05 17:09:43        INFO        ImagePol::rotationMeasure        Creating image 'pa0.im' of shape [20, 20, 1]
05-Oct-2026 13:09:42 2026-10-05 17:09:43        INFO        image::statistics         Determining stats for image rm.im
05-Oct-2026 13:09:42 2026-10-05 17:09:43        INFO        CasacRegionManager::fromBCS        No directional region specified. Using full positional plane.
05-Oct-2026 13:09:42 2026-10-05 17:09:43        INFO        ImageRegion::fromRecord        Selected bounding box :
05-Oct-2026 13:09:42 2026-10-05 17:09:43        INFO        ImageRegion::fromRecord+            [0, 0] to [19, 19]  (00:00:40.000, -00.10.00.001 to 23:59:24.000, +00.09.00.001)
05-Oct-2026 13:09:42 2026-10-05 17:09:43        INFO        ImageStatsCalculator::_logStartup        Statistics calculated using Classic algorithm
05-Oct-2026 13:09:42 2026-10-05 17:09:43        INFO        ImageStatsCalculator::_logStartup        Regions ---
05-Oct-2026 13:09:42 2026-10-05 17:09:43        INFO        ImageStatsCalculator::_logStartup                 -- bottom-left corner (pixel) [blc]:  [0, 0]
05-Oct-2026 13:09:42 2026-10-05 17:09:43        INFO        ImageStatsCalculator::_logStartup                 -- top-right corner (pixel) [trc]:    [19, 19]
05-Oct-2026 13:09:42 2026-10-05 17:09:43        INFO        ImageStatsCalculator::_logStartup                 -- bottom-left corner (world) [blcf]: 00:00:40.000, -00.10.00.001
05-Oct-2026 13:09:42 2026-10-05 17:09:43        INFO        ImageStatsCalculator::_logStartup                 -- top-right corner (world) [trcf]:   23:59:24.000, +00.09.00.001
05-Oct-2026 13:09:42 2026-10-05 17:09:43        INFO                Values ---
05-Oct-2026 13:09:42 2026-10-05 17:09:43        INFO                         -- number of points [npts]:                400
05-Oct-2026 13:09:42 2026-10-05 17:09:43        INFO                         -- maximum value [max]:                    9.60001 rad/m/m
05-Oct-2026 13:09:42 2026-10-05 17:09:43        INFO                         -- minimum value [min]:                    9.59997 rad/m/m
05-Oct-2026 13:09:42 2026-10-05 17:09:43        INFO                         -- position of max value (pixel) [maxpos]: [3, 0]
05-Oct-2026 13:09:42 2026-10-05 17:09:43        INFO                         -- position of min value (pixel) [minpos]: [1, 0]
05-Oct-2026 13:09:42 2026-10-05 17:09:43        INFO                         -- position of max value (world) [maxposf]: 00:00:28.000, -00.10.00.001
05-Oct-2026 13:09:42 2026-10-05 17:09:43        INFO                         -- position of min value (world) [minposf]: 00:00:36.000, -00.10.00.001
05-Oct-2026 13:09:42 2026-10-05 17:09:43        INFO                         -- Sum of pixel values [sum]:               3839.99 rad/m/m
05-Oct-2026 13:09:42 2026-10-05 17:09:43        INFO                         -- Sum of squared pixel values [sumsq]:     36863.9 rad/m/m.rad/m/m
05-Oct-2026 13:09:42 2026-10-05 17:09:43        INFO                Statistics ---
05-Oct-2026 13:09:42 2026-10-05 17:09:43        INFO                        -- Mean of the pixel values [mean]:         9.59998 rad/m/m
05-Oct-2026 13:09:42 2026-10-05 17:09:43        INFO                        -- Variance of the pixel values :           9.48741e-11 rad/m/m
05-Oct-2026 13:09:42 2026-10-05 17:09:43        INFO                        -- Standard deviation of the Mean [sigma]:  9.74033e-06 rad/m/m
05-Oct-2026 13:09:42 2026-10-05 17:09:43        INFO                        -- Root mean square [rms]:                  9.59998 rad/m/m
05-Oct-2026 13:09:42 2026-10-05 17:09:43        INFO        ImageStatsCalculator::statistics        Sum column unit = rad/m/m
05-Oct-2026 13:09:42 2026-10-05 17:09:43        INFO        ImageStatsCalculator::statistics+        Mean column unit = rad/m/m
05-Oct-2026 13:09:42 2026-10-05 17:09:43        INFO        ImageStatsCalculator::statistics+        Std_dev column unit = rad/m/m
05-Oct-2026 13:09:42 2026-10-05 17:09:43        INFO        ImageStatsCalculator::statistics+        Minimum column unit = rad/m/m
05-Oct-2026 13:09:42 2026-10-05 17:09:43        INFO        ImageStatsCalculator::statistics+        Maximum column unit = rad/m/m
05-Oct-2026 13:09:42 2026-10-05 17:09:43        INFO        ImageStatsCalculator::statistics        Npts          Sum           Mean          Rms           Std_dev       Minimum       Maximum     
05-Oct-2026 13:09:42 2026-10-05 17:09:43        INFO        ImageStatsCalculator::statistics         4.000000e+02  3.839993e+03  9.599982e+00  9.599982e+00  9.740334e-06  9.599969e+00  9.600007e+00
05-Oct-2026 13:09:42 2026-10-05 17:09:43        INFO                deleted table /home/casatest/casa6/casatestutils/nosedir/test_tool_imagepol/rm.im
05-Oct-2026 13:09:42 2026-10-05 17:09:43        INFO        image::statistics         Determining stats for image pa0.im
05-Oct-2026 13:09:42 2026-10-05 17:09:43        INFO        CasacRegionManager::fromBCS        No directional region specified. Using full positional plane.
05-Oct-2026 13:09:42 2026-10-05 17:09:43        INFO        CasacRegionManager::fromBCS        Using polarizations ALL
05-Oct-2026 13:09:42 2026-10-05 17:09:43        INFO        ImageRegion::fromRecord        Selected bounding box :
05-Oct-2026 13:09:42 2026-10-05 17:09:43        INFO        ImageRegion::fromRecord+            [0, 0, 0] to [19, 19, 0]  (00:00:40.000, -00.10.00.001, Pangle to 23:59:24.000, +00.09.00.001, Pangle)
05-Oct-2026 13:09:42 2026-10-05 17:09:43        INFO        ImageStatsCalculator::_logStartup        Statistics calculated using Classic algorithm
05-Oct-2026 13:09:42 2026-10-05 17:09:43        INFO        ImageStatsCalculator::_logStartup        Regions ---
05-Oct-2026 13:09:42 2026-10-05 17:09:43        INFO        ImageStatsCalculator::_logStartup                 -- bottom-left corner (pixel) [blc]:  [0, 0, 0]
05-Oct-2026 13:09:42 2026-10-05 17:09:43        INFO        ImageStatsCalculator::_logStartup                 -- top-right corner (pixel) [trc]:    [19, 19, 0]
05-Oct-2026 13:09:42 2026-10-05 17:09:43        INFO        ImageStatsCalculator::_logStartup                 -- bottom-left corner (world) [blcf]: 00:00:40.000, -00.10.00.001, Pangle
05-Oct-2026 13:09:42 2026-10-05 17:09:43        INFO        ImageStatsCalculator::_logStartup                 -- top-right corner (world) [trcf]:   23:59:24.000, +00.09.00.001, Pangle
05-Oct-2026 13:09:42 2026-10-05 17:09:43        INFO                Values ---
05-Oct-2026 13:09:42 2026-10-05 17:09:43        INFO                         -- number of points [npts]:                400
05-Oct-2026 13:09:42 2026-10-05 17:09:43        INFO                         -- maximum value [max]:                    22.5001 deg
05-Oct-2026 13:09:42 2026-10-05 17:09:43        INFO                         -- minimum value [min]:                    22.5 deg
05-Oct-2026 13:09:42 2026-10-05 17:09:43        INFO                         -- position of max value (pixel) [maxpos]: [1, 0, 0]
05-Oct-2026 13:09:42 2026-10-05 17:09:43        INFO                         -- position of min value (pixel) [minpos]: [3, 0, 0]
05-Oct-2026 13:09:42 2026-10-05 17:09:43        INFO                         -- position of max value (world) [maxposf]: 00:00:36.000, -00.10.00.001, Pangle
05-Oct-2026 13:09:42 2026-10-05 17:09:43        INFO                         -- position of min value (world) [minposf]: 00:00:28.000, -00.10.00.001, Pangle
05-Oct-2026 13:09:42 2026-10-05 17:09:43        INFO                         -- Sum of pixel values [sum]:               9000.02 deg
05-Oct-2026 13:09:42 2026-10-05 17:09:43        INFO                         -- Sum of squared pixel values [sumsq]:     202501 deg.deg
05-Oct-2026 13:09:42 2026-10-05 17:09:43        INFO                Statistics ---
05-Oct-2026 13:09:42 2026-10-05 17:09:43        INFO                        -- Mean of the pixel values [mean]:         22.5 deg
05-Oct-2026 13:09:42 2026-10-05 17:09:43        INFO                        -- Variance of the pixel values :           6.26899e-10 deg
05-Oct-2026 13:09:42 2026-10-05 17:09:43        INFO                        -- Standard deviation of the Mean [sigma]:  2.5038e-05 deg
05-Oct-2026 13:09:42 2026-10-05 17:09:43        INFO                        -- Root mean square [rms]:                  22.5 deg
05-Oct-2026 13:09:42 2026-10-05 17:09:43        INFO        ImageStatsCalculator::statistics        Sum column unit = deg
05-Oct-2026 13:09:42 2026-10-05 17:09:43        INFO        ImageStatsCalculator::statistics+        Mean column unit = deg
05-Oct-2026 13:09:42 2026-10-05 17:09:43        INFO        ImageStatsCalculator::statistics+        Std_dev column unit = deg
05-Oct-2026 13:09:42 2026-10-05 17:09:43        INFO        ImageStatsCalculator::statistics+        Minimum column unit = deg
05-Oct-2026 13:09:42 2026-10-05 17:09:43        INFO        ImageStatsCalculator::statistics+        Maximum column unit = deg
05-Oct-2026 13:09:42 2026-10-05 17:09:43        INFO        ImageStatsCalculator::statistics        Npts          Sum           Mean          Rms           Std_dev       Minimum       Maximum     
05-Oct-2026 13:09:42 2026-10-05 17:09:43        INFO        ImageStatsCalculator::statistics         4.000000e+02  9.000018e+03  2.250005e+01  2.250005e+01  2.503796e-05  2.249998e+01  2.250008e+01
05-Oct-2026 13:09:42 2026-10-05 17:09:43        INFO                deleted table /home/casatest/casa6/casatestutils/nosedir/test_tool_imagepol/pa0.im
05-Oct-2026 13:09:42 test_tool_imagepol.py::po_rotationmeasure_test::test_algorithm
05-Oct-2026 13:09:42 Test rotation measure computation algorithm
05-Oct-2026 13:09:42 PASSED
05-Oct-2026 13:09:42
05-Oct-2026 13:09:42 2026-10-05 17:09:43        INFO        ImageFITSConverter::readBeamsTable        Loading multiple beams from BEAMS table
05-Oct-2026 13:09:42 2026-10-05 17:09:43        INFO        ImagePol::rotationMeasure        Creating image 'g' of shape [10, 10]
05-Oct-2026 13:09:42 2026-10-05 17:09:43        INFO        ImagePolarimetry::sigma         Determined noise from V image to be 1.0119
05-Oct-2026 13:09:42 2026-10-05 17:09:43        INFO        ImageFITSConverter::readBeamsTable        Loading multiple beams from BEAMS table
05-Oct-2026 13:09:42 2026-10-05 17:09:43        INFO        ImagePol::rotationMeasure        Creating image 'hh' of shape [10, 10]
05-Oct-2026 13:09:42 2026-10-05 17:09:43        SEVERE        imagepol::rotationmeasure        Exception Reported: Exception: Input image has multiple beams and the corresponding beams for the stokes planes necessary for this computation are not equal..
05-Oct-2026 13:09:42 2026-10-05 17:09:43        SEVERE        imagepol::rotationmeasure+        ... thrown by casacore::Bool casa::ImagePolarimetry::_checkBeams(const std::vector<casa::ImagePolarimetry::StokesTypes>&, casacore::Bool, casacore::Bool) const at File: /source/casa6/casatools/src/code/imageanalysis/ImageAnalysis/ImagePolarimetry.cc, line: 1626
05-Oct-2026 13:09:42 test_tool_imagepol.py::po_rotationmeasure_test::test_multibeam
05-Oct-2026 13:09:42 Test multibeam images for correct behavior
05-Oct-2026 13:09:42 PASSED
05-Oct-2026 13:09:42
05-Oct-2026 13:09:42 2026-10-05 17:09:43        INFO        ImageFITSConverter::readBeamsTable        Loading multiple beams from BEAMS table
05-Oct-2026 13:09:42 2026-10-05 17:09:43        INFO        ImagePolarimetry::sigma         Determined noise from V image to be 1.0119
05-Oct-2026 13:09:42 2026-10-05 17:09:43        INFO        ImageFITSConverter::readBeamsTable        Loading multiple beams from BEAMS table
05-Oct-2026 13:09:42 2026-10-05 17:09:43        INFO        ImagePolarimetry::sigma         Determined noise from V image to be 1.0119
05-Oct-2026 13:09:42 test_tool_imagepol.py::po_sigma_test::test_multibeam
05-Oct-2026 13:09:42 Test multibeam images for correct behavior
05-Oct-2026 13:09:42 pol_eq_beams.fits
05-Oct-2026 13:09:42 PASSED
05-Oct-2026 13:09:42
05-Oct-2026 13:09:42 2026-10-05 17:09:43        INFO        ImageFITSConverter::readBeamsTable        Loading multiple beams from BEAMS table
05-Oct-2026 13:09:42 2026-10-05 17:09:43        INFO        ImageFITSConverter::readBeamsTable        Loading multiple beams from BEAMS table
05-Oct-2026 13:09:42 2026-10-05 17:09:43        INFO        ImagePolarimetry::sigmaLinPolInt         Determined noise from Q&U images to be
05-Oct-2026 13:09:42 2026-10-05 17:09:43        INFO        ImagePolarimetry::sigmaLinPolInt         Determined noise from Q&U images to be
05-Oct-2026 13:09:42 2026-10-05 17:09:43        INFO        ImageFITSConverter::readBeamsTable        Loading multiple beams from BEAMS table
05-Oct-2026 13:09:42 2026-10-05 17:09:43        INFO        ImageFITSConverter::readBeamsTable        Loading multiple beams from BEAMS table
05-Oct-2026 13:09:42 2026-10-05 17:09:43        SEVERE        imagepol::sigmadepolratio        Exception Reported: Exception: Beams or beamsets are not equal between the two images, caonnot perform calculation.
05-Oct-2026 13:09:42 2026-10-05 17:09:43        SEVERE        imagepol::sigmadepolratio+        ... thrown by static void casa::ImagePolarimetry::_checkBeams(const casa::ImagePolarimetry&, const casa::ImagePolarimetry&, const casacore::Vector<casa::ImagePolarimetry::StokesTypes>&) at File: /source/casa6/casatools/src/code/imageanalysis/ImageAnalysis/ImagePolarimetry.cc, line: 1686
05-Oct-2026 13:09:42 test_tool_imagepol.py::po_sigmadepolratio_test::test_multibeam
05-Oct-2026 13:09:42 Test multibeam images for correct behavior
05-Oct-2026 13:09:42 PASSED
05-Oct-2026 13:09:42
05-Oct-2026 13:09:42 2026-10-05 17:09:43        INFO        ImageFITSConverter::readBeamsTable        Loading multiple beams from BEAMS table
05-Oct-2026 13:09:42 2026-10-05 17:09:43        INFO        ImagePolarimetry::sigmaLinPolInt         Determined noise from Q&U images to be
05-Oct-2026 13:09:42 2026-10-05 17:09:43        INFO        imagepol::sigmaFracLinPol        Creating image 'g' of shape [10, 10, 10, 1]
05-Oct-2026 13:09:42 2026-10-05 17:09:43        INFO        ImageFITSConverter::readBeamsTable        Loading multiple beams from BEAMS table
05-Oct-2026 13:09:42 2026-10-05 17:09:43        SEVERE        imagepol::sigmafraclinpol        Exception Reported: Exception: Input image has multiple beams and the corresponding beams for the stokes planes necessary for this computation are not equal..
05-Oct-2026 13:09:42 2026-10-05 17:09:43        SEVERE        imagepol::sigmafraclinpol+        ... thrown by casacore::Bool casa::ImagePolarimetry::_checkBeams(const std::vector<casa::ImagePolarimetry::StokesTypes>&, casacore::Bool, casacore::Bool) const at File: /source/casa6/casatools/src/code/imageanalysis/ImageAnalysis/ImagePolarimetry.cc, line: 1626
05-Oct-2026 13:09:42 test_tool_imagepol.py::po_sigmafraclinpol_test::test_multibeam
05-Oct-2026 13:09:42 Test multibeam images for correct behavior
05-Oct-2026 13:09:42 PASSED
05-Oct-2026 13:09:42
05-Oct-2026 13:09:42 2026-10-05 17:09:43        INFO        ImageFITSConverter::readBeamsTable        Loading multiple beams from BEAMS table
05-Oct-2026 13:09:42 2026-10-05 17:09:43        INFO        ImagePolarimetry::sigma         Determined noise from V image to be 1.0119
05-Oct-2026 13:09:42 2026-10-05 17:09:43        INFO        imagepol::sigmaFracTotPol        Creating image 'g' of shape [10, 10, 10, 1]
05-Oct-2026 13:09:42 2026-10-05 17:09:43        INFO        ImageFITSConverter::readBeamsTable        Loading multiple beams from BEAMS table
05-Oct-2026 13:09:42 2026-10-05 17:09:43        WARN        ImagePolarimetry::_setDoLinDoCirc (file /source/casa6/casatools/src/code/imageanalysis/ImageAnalysis/ImagePolarimetry.cc, line 272)        I, Q, and U beams are not the same, cannot do linear portion
05-Oct-2026 13:09:42 2026-10-05 17:09:43        WARN        ImagePolarimetry::_setDoLinDoCirc (file /source/casa6/casatools/src/code/imageanalysis/ImageAnalysis/ImagePolarimetry.cc, line 272)        I and V beams are not the same, cannot do circular portion
05-Oct-2026 13:09:42 2026-10-05 17:09:43        SEVERE        imagepol::sigmafractotpol        Exception Reported: Exception: Can do neither linear nor circular portions.
05-Oct-2026 13:09:42 2026-10-05 17:09:43        SEVERE        imagepol::sigmafractotpol+        ... thrown by void casa::ImagePolarimetry::_setDoLinDoCirc(casacore::Bool&, casacore::Bool&) const at File: /source/casa6/casatools/src/code/imageanalysis/ImageAnalysis/ImagePolarimetry.cc, line: 292
05-Oct-2026 13:09:42 test_tool_imagepol.py::po_sigmafractotpol_test::test_multibeam
05-Oct-2026 13:09:42 Test multibeam images for correct behavior
05-Oct-2026 13:09:42 PASSED
05-Oct-2026 13:09:42
05-Oct-2026 13:09:42 2026-10-05 17:09:43        INFO        ImageFITSConverter::readBeamsTable        Loading multiple beams from BEAMS table
05-Oct-2026 13:09:42 2026-10-05 17:09:43        INFO        ImagePolarimetry::sigmaLinPolInt         Determined noise from Q&U images to be
05-Oct-2026 13:09:42 2026-10-05 17:09:43        INFO        ImageFITSConverter::readBeamsTable        Loading multiple beams from BEAMS table
05-Oct-2026 13:09:42 2026-10-05 17:09:43        SEVERE        imagepol::sigmalinpolint        Exception Reported: Exception: Input image has multiple beams and the corresponding beams for the stokes planes necessary for this computation are not equal..
05-Oct-2026 13:09:42 2026-10-05 17:09:43        SEVERE        imagepol::sigmalinpolint+        ... thrown by casacore::Bool casa::ImagePolarimetry::_checkBeams(const std::vector<casa::ImagePolarimetry::StokesTypes>&, casacore::Bool, casacore::Bool) const at File: /source/casa6/casatools/src/code/imageanalysis/ImageAnalysis/ImagePolarimetry.cc, line: 1626
05-Oct-2026 13:09:42 test_tool_imagepol.py::po_sigmalinpolint_test::test_multibeam
05-Oct-2026 13:09:42 Test multibeam images for correct behavior
05-Oct-2026 13:09:42 PASSED
05-Oct-2026 13:09:42
05-Oct-2026 13:09:42 2026-10-05 17:09:43        INFO        ImageFITSConverter::readBeamsTable        Loading multiple beams from BEAMS table
05-Oct-2026 13:09:43 2026-10-05 17:09:43        INFO        ImagePolarimetry::sigma         Determined noise from V image to be 1.0119
05-Oct-2026 13:09:43 2026-10-05 17:09:43        INFO        imagepol::sigmaLinPolPosAng        Creating image 'g' of shape [10, 10, 10, 1]
05-Oct-2026 13:09:43 2026-10-05 17:09:43        INFO        ImageFITSConverter::readBeamsTable        Loading multiple beams from BEAMS table
05-Oct-2026 13:09:43 2026-10-05 17:09:43        SEVERE        imagepol::sigmalinpolposang        Exception Reported: Exception: Input image has multiple beams and the corresponding beams for the stokes planes necessary for this computation are not equal..
05-Oct-2026 13:09:43 2026-10-05 17:09:43        SEVERE        imagepol::sigmalinpolposang+        ... thrown by casacore::Bool casa::ImagePolarimetry::_checkBeams(const std::vector<casa::ImagePolarimetry::StokesTypes>&, casacore::Bool, casacore::Bool) const at File: /source/casa6/casatools/src/code/imageanalysis/ImageAnalysis/ImagePolarimetry.cc, line: 1626
05-Oct-2026 13:09:43 test_tool_imagepol.py::po_sigmalinpolposang_test::test_multibeam
05-Oct-2026 13:09:43 Test multibeam images for correct behavior
05-Oct-2026 13:09:43 PASSED
05-Oct-2026 13:09:43
05-Oct-2026 13:09:43 2026-10-05 17:09:43        INFO        ImageFITSConverter::readBeamsTable        Loading multiple beams from BEAMS table
05-Oct-2026 13:09:43 2026-10-05 17:09:43        INFO        ImagePolTask::_sigma         Determined noise from V image to be 1.0119
05-Oct-2026 13:09:43 2026-10-05 17:09:43        INFO        ImagePolTask::_sigma         Debiasing with sigma = 1.0119
05-Oct-2026 13:09:43 2026-10-05 17:09:43        INFO        ImageFITSConverter::readBeamsTable        Loading multiple beams from BEAMS table
05-Oct-2026 13:09:43 test_tool_imagepol.py::po_totpolint_test::test_multibeam
05-Oct-2026 13:09:43 Test multibeam images for correct behavior
05-Oct-2026 13:09:43 PASSED
05-Oct-2026 13:09:43
05-Oct-2026 13:09:43 - generated xml file: /home/casatest/casa6/casatestutils/nosedir/xml/test_tool_imagepol/nose.xml -
05-Oct-2026 13:09:43 ======================== 17 passed, 1 warning in 0.56s =========================
05-Oct-2026 13:09:43 ============================= test session starts ==============================
05-Oct-2026 13:09:43 platform linux -- Python 3.12.9, pytest-9.1.1, pluggy-1.6.0 -- /home/casatest/venv/bin/python3.12
05-Oct-2026 13:09:43 cachedir: .pytest_cache
05-Oct-2026 13:09:43 rootdir: /home/casatest/casa6/casatestutils/nosedir/test_tool_calanalysis
05-Oct-2026 13:09:43 configfile: pytest.ini
05-Oct-2026 13:09:43 collecting ... collected 7 items
05-Oct-2026 13:09:43
05-Oct-2026 13:09:43
05-Oct-2026 13:09:43 test_tool_calanalysis.py::calanalysis_tsys1_introspective::test_introspective
05-Oct-2026 13:09:43 Test of introspective member functions
05-Oct-2026 13:09:43 PASSED
05-Oct-2026 13:09:43
05-Oct-2026 13:09:43 2026-10-05 17:09:44        WARN        CalAnalysis::getGroup() (file /source/casa6/casatools/src/code/calanalysis/CalAnalysis/CalAnalysis.cc, line 2718)        No matching rows selected
05-Oct-2026 13:09:43 2026-10-05 17:09:44        WARN        CalAnalysis::stats<T>() (file /source/casainstall/include/casacpp/calanalysis/CalAnalysis/CalAnalysis.h, line 686)        Cannot parse group(s)
05-Oct-2026 13:09:43 2026-10-05 17:09:44        WARN        CalAnalysis::getGroup() (file /source/casa6/casatools/src/code/calanalysis/CalAnalysis/CalAnalysis.cc, line 2718)        No matching rows selected
05-Oct-2026 13:09:43 2026-10-05 17:09:44        WARN        CalAnalysis::stats<T>() (file /source/casainstall/include/casacpp/calanalysis/CalAnalysis/CalAnalysis.h, line 686)        Cannot parse group(s)
05-Oct-2026 13:09:43 test_tool_calanalysis.py::calanalysis_tsys1_get::test_get_empty
05-Oct-2026 13:09:43 Test tool get function with wrong selections 
05-Oct-2026 13:09:43 PASSED
05-Oct-2026 13:09:43
05-Oct-2026 13:09:43 test_tool_calanalysis.py::calanalysis_tsys1_get::test_get_noparams
05-Oct-2026 13:09:43 Test tool get function, no selection, no other params.
05-Oct-2026 13:09:43 Uses stuff in CalAnalysys/CalStats::stats 
05-Oct-2026 13:09:43 PASSED
05-Oct-2026 13:09:43
05-Oct-2026 13:09:43 test_tool_calanalysis.py::calanalysis_tsys1_get::test_get_one_spw
05-Oct-2026 13:09:43 Test tool get function. Uses the main stuff in CalAnalysys/CalStats::stats 
05-Oct-2026 13:09:43 PASSED
05-Oct-2026 13:09:43
05-Oct-2026 13:09:43 test_tool_calanalysis.py::calanalysis_tsys1_fit::test_fit_amp
05-Oct-2026 13:09:43 Test tool fit function (amp). Exercises stuff in CalAnalysys/CalStatsFitter 
05-Oct-2026 13:09:43 PASSED
05-Oct-2026 13:09:43
05-Oct-2026 13:09:43 test_tool_calanalysis.py::calanalysis_tsys1_fit::test_fit_amp_sel
05-Oct-2026 13:09:43 Test tool fit function (amp + selection).
05-Oct-2026 13:09:43 Exercises stuff in CalAnalysys/CalStatsFitter 
05-Oct-2026 13:09:43 PASSED
05-Oct-2026 13:09:43
05-Oct-2026 13:09:43 test_tool_calanalysis.py::calanalysis_tsys1_fit::test_fit_phase
05-Oct-2026 13:09:43 Test tool fit function (phase). Exercises stuff in CalAnalysys/CalStatsFitter 
05-Oct-2026 13:09:43 PASSED
05-Oct-2026 13:09:43
05-Oct-2026 13:09:43 - generated xml file: /home/casatest/casa6/casatestutils/nosedir/xml/test_tool_calanalysis/nose.xml -
05-Oct-2026 13:09:43 ========================= 7 passed, 1 warning in 0.75s =========================
05-Oct-2026 13:09:43
05-Oct-2026 13:09:43
05-Oct-2026 13:09:43 Setting Working Directory: /home/casatest/casa6/casatestutils/nosedir/test_tool_image_pbcor/
05-Oct-2026 13:09:43 Test Directory: /home/casatest/casa6/casatestutils/nosedir/test_tool_image_pbcor
05-Oct-2026 13:09:43
05-Oct-2026 13:09:43 Running Command: pytest --junitxml=/home/casatest/casa6/casatestutils/nosedir/xml/test_tool_image_pbcor/nose.xml -s --disable-pytest-warnings --verbose -ra --tb=short /home/casatest/casa6/casatestutils/nosedir/test_tool_image_pbcor/
05-Oct-2026 13:09:43
05-Oct-2026 13:09:43 Setting Working Directory: /home/casatest/casa6/casatestutils/nosedir/test_tool_ms/
05-Oct-2026 13:09:43 Test Directory: /home/casatest/casa6/casatestutils/nosedir/test_tool_ms
05-Oct-2026 13:09:43
05-Oct-2026 13:09:43 Running Command: pytest --junitxml=/home/casatest/casa6/casatestutils/nosedir/xml/test_tool_ms/nose.xml -s --disable-pytest-warnings --verbose -ra --tb=short /home/casatest/casa6/casatestutils/nosedir/test_tool_ms/
05-Oct-2026 13:09:43
05-Oct-2026 13:09:43 Setting Working Directory: /home/casatest/casa6/casatestutils/nosedir/test_tool_logsink/
05-Oct-2026 13:09:43 Test Directory: /home/casatest/casa6/casatestutils/nosedir/test_tool_logsink
05-Oct-2026 13:09:43
05-Oct-2026 13:09:43 Running Command: pytest --junitxml=/home/casatest/casa6/casatestutils/nosedir/xml/test_tool_logsink/nose.xml -s --disable-pytest-warnings --verbose -ra --tb=short /home/casatest/casa6/casatestutils/nosedir/test_tool_logsink/
05-Oct-2026 13:09:43
05-Oct-2026 13:09:43 Setting Working Directory: /home/casatest/casa6/casatestutils/nosedir/test_tool_coordsys/
05-Oct-2026 13:09:43 Test Directory: /home/casatest/casa6/casatestutils/nosedir/test_tool_coordsys
05-Oct-2026 13:09:43
05-Oct-2026 13:09:43 Running Command: pytest --junitxml=/home/casatest/casa6/casatestutils/nosedir/xml/test_tool_coordsys/nose.xml -s --disable-pytest-warnings --verbose -ra --tb=short /home/casatest/casa6/casatestutils/nosedir/test_tool_coordsys/
05-Oct-2026 13:09:43
05-Oct-2026 13:09:43 Setting Working Directory: /home/casatest/casa6/casatestutils/nosedir/test_tool_ms_createmultims/
05-Oct-2026 13:09:43 Test Directory: /home/casatest/casa6/casatestutils/nosedir/test_tool_ms_createmultims
05-Oct-2026 13:09:43
05-Oct-2026 13:09:43 Running Command: pytest --junitxml=/home/casatest/casa6/casatestutils/nosedir/xml/test_tool_ms_createmultims/nose.xml -s --disable-pytest-warnings --verbose -ra --tb=short /home/casatest/casa6/casatestutils/nosedir/test_tool_ms_createmultims/
05-Oct-2026 13:09:43
05-Oct-2026 13:09:43 Setting Working Directory: /home/casatest/casa6/casatestutils/nosedir/test_tool_msuvbinner/
05-Oct-2026 13:09:43 Test Directory: /home/casatest/casa6/casatestutils/nosedir/test_tool_msuvbinner
05-Oct-2026 13:09:43
05-Oct-2026 13:09:43 Running Command: pytest --junitxml=/home/casatest/casa6/casatestutils/nosedir/xml/test_tool_msuvbinner/nose.xml -s --disable-pytest-warnings --verbose -ra --tb=short /home/casatest/casa6/casatestutils/nosedir/test_tool_msuvbinner/
05-Oct-2026 13:09:43
05-Oct-2026 13:09:43 Setting Working Directory: /home/casatest/casa6/casatestutils/nosedir/test_tool_measures/
05-Oct-2026 13:09:43 Test Directory: /home/casatest/casa6/casatestutils/nosedir/test_tool_measures
05-Oct-2026 13:09:43
05-Oct-2026 13:09:43 Running Command: pytest --junitxml=/home/casatest/casa6/casatestutils/nosedir/xml/test_tool_measures/nose.xml -s --disable-pytest-warnings --verbose -ra --tb=short /home/casatest/casa6/casatestutils/nosedir/test_tool_measures/
05-Oct-2026 13:09:43
05-Oct-2026 13:09:43 Setting Working Directory: /home/casatest/casa6/casatestutils/nosedir/test_tool_quanta/
05-Oct-2026 13:09:43 Test Directory: /home/casatest/casa6/casatestutils/nosedir/test_tool_quanta
05-Oct-2026 13:09:43
05-Oct-2026 13:09:43 Running Command: pytest --junitxml=/home/casatest/casa6/casatestutils/nosedir/xml/test_tool_quanta/nose.xml -s --disable-pytest-warnings --verbose -ra --tb=short /home/casatest/casa6/casatestutils/nosedir/test_tool_quanta/
05-Oct-2026 13:09:43
05-Oct-2026 13:09:43 Setting Working Directory: /home/casatest/casa6/casatestutils/nosedir/test_tool_image_regrid/
05-Oct-2026 13:09:43 Test Directory: /home/casatest/casa6/casatestutils/nosedir/test_tool_image_regrid
05-Oct-2026 13:09:43
05-Oct-2026 13:09:43 Running Command: pytest --junitxml=/home/casatest/casa6/casatestutils/nosedir/xml/test_tool_image_regrid/nose.xml -s --disable-pytest-warnings --verbose -ra --tb=short /home/casatest/casa6/casatestutils/nosedir/test_tool_image_regrid/
05-Oct-2026 13:09:43
05-Oct-2026 13:09:43 Setting Working Directory: /home/casatest/casa6/casatestutils/nosedir/test_tool_msmetadata/
05-Oct-2026 13:09:43 Test Directory: /home/casatest/casa6/casatestutils/nosedir/test_tool_msmetadata
05-Oct-2026 13:09:43
05-Oct-2026 13:09:43 Running Command: pytest --junitxml=/home/casatest/casa6/casatestutils/nosedir/xml/test_tool_msmetadata/nose.xml -s --disable-pytest-warnings --verbose -ra --tb=short /home/casatest/casa6/casatestutils/nosedir/test_tool_msmetadata/
05-Oct-2026 13:09:43
05-Oct-2026 13:09:43 Setting Working Directory: /home/casatest/casa6/casatestutils/nosedir/test_tool_image_subimage/
05-Oct-2026 13:09:43 Test Directory: /home/casatest/casa6/casatestutils/nosedir/test_tool_image_subimage
05-Oct-2026 13:09:43
05-Oct-2026 13:09:43 Running Command: pytest --junitxml=/home/casatest/casa6/casatestutils/nosedir/xml/test_tool_image_subimage/nose.xml -s --disable-pytest-warnings --verbose -ra --tb=short /home/casatest/casa6/casatestutils/nosedir/test_tool_image_subimage/
05-Oct-2026 13:09:43
05-Oct-2026 13:09:43 Setting Working Directory: /home/casatest/casa6/casatestutils/nosedir/test_tool_image_pv/
05-Oct-2026 13:09:43 Test Directory: /home/casatest/casa6/casatestutils/nosedir/test_tool_image_pv
05-Oct-2026 13:09:43
05-Oct-2026 13:09:43 Running Command: pytest --junitxml=/home/casatest/casa6/casatestutils/nosedir/xml/test_tool_image_pv/nose.xml -s --disable-pytest-warnings --verbose -ra --tb=short /home/casatest/casa6/casatestutils/nosedir/test_tool_image_pv/
05-Oct-2026 13:09:43
05-Oct-2026 13:09:43 Setting Working Directory: /home/casatest/casa6/casatestutils/nosedir/test_tool_image_rebin/
05-Oct-2026 13:09:43 Test Directory: /home/casatest/casa6/casatestutils/nosedir/test_tool_image_rebin
05-Oct-2026 13:09:43
05-Oct-2026 13:09:43 Running Command: pytest --junitxml=/home/casatest/casa6/casatestutils/nosedir/xml/test_tool_image_rebin/nose.xml -s --disable-pytest-warnings --verbose -ra --tb=short /home/casatest/casa6/casatestutils/nosedir/test_tool_image_rebin/
05-Oct-2026 13:09:43
05-Oct-2026 13:09:43 Setting Working Directory: /home/casatest/casa6/casatestutils/nosedir/test_tool_componentlist/
05-Oct-2026 13:09:43 Test Directory: /home/casatest/casa6/casatestutils/nosedir/test_tool_componentlist
05-Oct-2026 13:09:43
05-Oct-2026 13:09:43 Running Command: pytest --junitxml=/home/casatest/casa6/casatestutils/nosedir/xml/test_tool_componentlist/nose.xml -s --disable-pytest-warnings --verbose -ra --tb=short /home/casatest/casa6/casatestutils/nosedir/test_tool_componentlist/
05-Oct-2026 13:09:43
05-Oct-2026 13:09:43 Setting Working Directory: /home/casatest/casa6/casatestutils/nosedir/test_tool_linearmosaic/
05-Oct-2026 13:09:43 Test Directory: /home/casatest/casa6/casatestutils/nosedir/test_tool_linearmosaic
05-Oct-2026 13:09:43
05-Oct-2026 13:09:43 Running Command: pytest --junitxml=/home/casatest/casa6/casatestutils/nosedir/xml/test_tool_linearmosaic/nose.xml -s --disable-pytest-warnings --verbose -ra --tb=short /home/casatest/casa6/casatestutils/nosedir/test_tool_linearmosaic/
05-Oct-2026 13:09:43
05-Oct-2026 13:09:43 Setting Working Directory: /home/casatest/casa6/casatestutils/nosedir/test_tool_table/
05-Oct-2026 13:09:43 Test Directory: /home/casatest/casa6/casatestutils/nosedir/test_tool_table
05-Oct-2026 13:09:43
05-Oct-2026 13:09:43 Running Command: pytest --junitxml=/home/casatest/casa6/casatestutils/nosedir/xml/test_tool_table/nose.xml -s --disable-pytest-warnings --verbose -ra --tb=short /home/casatest/casa6/casatestutils/nosedir/test_tool_table/
05-Oct-2026 13:09:43
05-Oct-2026 13:09:43 Setting Working Directory: /home/casatest/casa6/casatestutils/nosedir/test_tool_imagepol/
05-Oct-2026 13:09:43 Test Directory: /home/casatest/casa6/casatestutils/nosedir/test_tool_imagepol
05-Oct-2026 13:09:43
05-Oct-2026 13:09:43 Running Command: pytest --junitxml=/home/casatest/casa6/casatestutils/nosedir/xml/test_tool_imagepol/nose.xml -s --disable-pytest-warnings --verbose -ra --tb=short /home/casatest/casa6/casatestutils/nosedir/test_tool_imagepol/
05-Oct-2026 13:09:43
05-Oct-2026 13:09:43 Setting Working Directory: /home/casatest/casa6/casatestutils/nosedir/test_tool_calanalysis/
05-Oct-2026 13:09:43 Test Directory: /home/casatest/casa6/casatestutils/nosedir/test_tool_calanalysis
05-Oct-2026 13:09:43
05-Oct-2026 13:09:43 Running Command: pytest --junitxml=/home/casatest/casa6/casatestutils/nosedir/xml/test_tool_calanalysis/nose.xml -s --disable-pytest-warnings --verbose -ra --tb=short /home/casatest/casa6/casatestutils/nosedir/test_tool_calanalysis/
05-Oct-2026 13:09:44 total 77816
05-Oct-2026 13:09:44 -rw-r--r-- 1 casaci 15001   161014 Oct  5 16:58 casatestutils-6.7.7.11-py3-none-any.whl
05-Oct-2026 13:09:44 -rw-r--r-- 1 casaci 15001 79350287 Oct  5 16:58 casatools-6.7.7.11-cp312-cp312-manylinux_2_28_x86_64.whl
05-Oct-2026 13:09:44 -rw-r--r-- 1 casaci root      4340 Oct  5 17:09 test_tool_agentflagger.xml
05-Oct-2026 13:09:44 -rw-r--r-- 1 casaci root      1006 Oct  5 17:09 test_tool_calanalysis.xml
05-Oct-2026 13:09:44 -rw-r--r-- 1 casaci root      2656 Oct  5 17:09 test_tool_calibrater.xml
05-Oct-2026 13:09:44 -rw-r--r-- 1 casaci root       687 Oct  5 17:09 test_tool_componentlist.xml
05-Oct-2026 13:09:44 -rw-r--r-- 1 casaci root      7467 Oct  5 17:09 test_tool_coordsys.xml
05-Oct-2026 13:09:44 -rw-r--r-- 1 casaci root     12935 Oct  5 17:09 test_tool_image.xml
05-Oct-2026 13:09:44 -rw-r--r-- 1 casaci root      2220 Oct  5 17:09 test_tool_image_collapse.xml
05-Oct-2026 13:09:44 -rw-r--r-- 1 casaci root      1048 Oct  5 17:09 test_tool_image_deviation.xml
05-Oct-2026 13:09:44 -rw-r--r-- 1 casaci root      2574 Oct  5 17:09 test_tool_image_fitprofile.xml
05-Oct-2026 13:09:44 -rw-r--r-- 1 casaci root      1178 Oct  5 17:09 test_tool_image_pbcor.xml
05-Oct-2026 13:09:44 -rw-r--r-- 1 casaci root       883 Oct  5 17:09 test_tool_image_pv.xml
05-Oct-2026 13:09:44 -rw-r--r-- 1 casaci root      1006 Oct  5 17:09 test_tool_image_rebin.xml
05-Oct-2026 13:09:44 -rw-r--r-- 1 casaci root      1336 Oct  5 17:09 test_tool_image_regrid.xml
05-Oct-2026 13:09:44 -rw-r--r-- 1 casaci root      1639 Oct  5 17:09 test_tool_image_statistics.xml
05-Oct-2026 13:09:44 -rw-r--r-- 1 casaci root       765 Oct  5 17:09 test_tool_image_subimage.xml
05-Oct-2026 13:09:44 -rw-r--r-- 1 casaci root       890 Oct  5 17:09 test_tool_image_transpose.xml
05-Oct-2026 13:09:44 -rw-r--r-- 1 casaci root      1966 Oct  5 17:09 test_tool_imagepol.xml
05-Oct-2026 13:09:44 -rw-r--r-- 1 casaci root       838 Oct  5 17:09 test_tool_linearmosaic.xml
05-Oct-2026 13:09:44 -rw-r--r-- 1 casaci root       669 Oct  5 17:09 test_tool_logsink.xml
05-Oct-2026 13:09:44 -rw-r--r-- 1 casaci root       549 Oct  5 17:09 test_tool_measures.xml
05-Oct-2026 13:09:44 -rw-r--r-- 1 casaci root      5224 Oct  5 17:09 test_tool_ms.xml
05-Oct-2026 13:09:44 -rw-r--r-- 1 casaci root       367 Oct  5 17:09 test_tool_ms_createmultims.xml
05-Oct-2026 13:09:44 -rw-r--r-- 1 casaci root      2096 Oct  5 17:09 test_tool_ms_statwt.xml
05-Oct-2026 13:09:44 -rw-r--r-- 1 casaci root      8633 Oct  5 17:09 test_tool_msmetadata.xml
05-Oct-2026 13:09:44 -rw-r--r-- 1 casaci root       359 Oct  5 17:09 test_tool_msuvbinner.xml
05-Oct-2026 13:09:44 -rw-r--r-- 1 casaci root      1171 Oct  5 17:09 test_tool_quanta.xml
05-Oct-2026 13:09:44 -rw-r--r-- 1 casaci root      3975 Oct  5 17:09 test_tool_regionmanager.xml
05-Oct-2026 13:09:44 -rw-r--r-- 1 casaci root      2071 Oct  5 17:09 test_tool_sdm.xml
05-Oct-2026 13:09:44 -rw-r--r-- 1 casaci root      2190 Oct  5 17:09 test_tool_sdm_toms.xml
05-Oct-2026 13:09:44 -rw-r--r-- 1 casaci root       670 Oct  5 17:09 test_tool_simulator.xml
05-Oct-2026 13:09:44 -rw-r--r-- 1 casaci root      2025 Oct  5 17:09 test_tool_synthesisutils.xml
05-Oct-2026 13:09:44 -rw-r--r-- 1 casaci root      1462 Oct  5 17:09 test_tool_table.xml
05-Oct-2026 13:09:44 -rw-r--r-- 1 casaci root      1717 Oct  5 17:09 test_tool_vpmanager.xml
05-Oct-2026 13:09:44 Finished task 'Test wheel' with result: Success
05-Oct-2026 13:09:44
Substituting variable: ${bamboo.python_version} with 3.12
05-Oct-2026 13:09:44
Substituting variable: ${bamboo.agentId} with 153550849
05-Oct-2026 13:09:44
Substituting variable: ${bamboo.agentId} with 153550849
05-Oct-2026 13:09:44
Substituting variable: ${bamboo.agentId} with 153550849
05-Oct-2026 13:09:44
Substituting variable: ${bamboo.agentId} with 153550849
05-Oct-2026 13:09:44 Starting task 'Tar work directory' of type 'com.atlassian.bamboo.plugins.scripttask:task.builder.script'
05-Oct-2026 13:09:44
Beginning to execute external process for build 'CASA - Release Engineering Master Test 3.12 go.nrao.edu IERS - Test Tools Many Linux 2.28 Rocky 8.10 Py3.12 #5 (CASA-REMT3GI-TTOMLPY38-5)'
... running command line:
/opt/ci_workspace/casa/bamboo/agent1/temp/CASA-REMT3GI-TTOMLPY38-5-ScriptBuildTask-9574090876130963007.sh
... in: /opt/ci_workspace/casa/bamboo/agent1/xml-data/build-dir/CASA-REMT3GI-TTOMLPY38
05-Oct-2026 13:09:44 Package working directory
05-Oct-2026 13:09:44 tar: nosedir: Cannot stat: No such file or directory
05-Oct-2026 13:09:44 tar: Exiting with failure status due to previous errors
05-Oct-2026 13:09:44 total 77820
05-Oct-2026 13:09:44 -rw-r--r-- 1 casaci 15001   161014 Oct  5 16:58 casatestutils-6.7.7.11-py3-none-any.whl
05-Oct-2026 13:09:44 -rw-r--r-- 1 casaci 15001 79350287 Oct  5 16:58 casatools-6.7.7.11-cp312-cp312-manylinux_2_28_x86_64.whl
05-Oct-2026 13:09:44 -rw-r--r-- 1 casaci root      4340 Oct  5 17:09 test_tool_agentflagger.xml
05-Oct-2026 13:09:44 -rw-r--r-- 1 casaci root      1006 Oct  5 17:09 test_tool_calanalysis.xml
05-Oct-2026 13:09:44 -rw-r--r-- 1 casaci root      2656 Oct  5 17:09 test_tool_calibrater.xml
05-Oct-2026 13:09:44 -rw-r--r-- 1 casaci root       687 Oct  5 17:09 test_tool_componentlist.xml
05-Oct-2026 13:09:44 -rw-r--r-- 1 casaci root      7467 Oct  5 17:09 test_tool_coordsys.xml
05-Oct-2026 13:09:44 -rw-r--r-- 1 casaci root     12935 Oct  5 17:09 test_tool_image.xml
05-Oct-2026 13:09:44 -rw-r--r-- 1 casaci root      2220 Oct  5 17:09 test_tool_image_collapse.xml
05-Oct-2026 13:09:44 -rw-r--r-- 1 casaci root      1048 Oct  5 17:09 test_tool_image_deviation.xml
05-Oct-2026 13:09:44 -rw-r--r-- 1 casaci root      2574 Oct  5 17:09 test_tool_image_fitprofile.xml
05-Oct-2026 13:09:44 -rw-r--r-- 1 casaci root      1178 Oct  5 17:09 test_tool_image_pbcor.xml
05-Oct-2026 13:09:44 -rw-r--r-- 1 casaci root       883 Oct  5 17:09 test_tool_image_pv.xml
05-Oct-2026 13:09:44 -rw-r--r-- 1 casaci root      1006 Oct  5 17:09 test_tool_image_rebin.xml
05-Oct-2026 13:09:44 -rw-r--r-- 1 casaci root      1336 Oct  5 17:09 test_tool_image_regrid.xml
05-Oct-2026 13:09:44 -rw-r--r-- 1 casaci root      1639 Oct  5 17:09 test_tool_image_statistics.xml
05-Oct-2026 13:09:44 -rw-r--r-- 1 casaci root       765 Oct  5 17:09 test_tool_image_subimage.xml
05-Oct-2026 13:09:44 -rw-r--r-- 1 casaci root       890 Oct  5 17:09 test_tool_image_transpose.xml
05-Oct-2026 13:09:44 -rw-r--r-- 1 casaci root      1966 Oct  5 17:09 test_tool_imagepol.xml
05-Oct-2026 13:09:44 -rw-r--r-- 1 casaci root       838 Oct  5 17:09 test_tool_linearmosaic.xml
05-Oct-2026 13:09:44 -rw-r--r-- 1 casaci root       669 Oct  5 17:09 test_tool_logsink.xml
05-Oct-2026 13:09:44 -rw-r--r-- 1 casaci root       549 Oct  5 17:09 test_tool_measures.xml
05-Oct-2026 13:09:44 -rw-r--r-- 1 casaci root      5224 Oct  5 17:09 test_tool_ms.xml
05-Oct-2026 13:09:44 -rw-r--r-- 1 casaci root       367 Oct  5 17:09 test_tool_ms_createmultims.xml
05-Oct-2026 13:09:44 -rw-r--r-- 1 casaci root      2096 Oct  5 17:09 test_tool_ms_statwt.xml
05-Oct-2026 13:09:44 -rw-r--r-- 1 casaci root      8633 Oct  5 17:09 test_tool_msmetadata.xml
05-Oct-2026 13:09:44 -rw-r--r-- 1 casaci root       359 Oct  5 17:09 test_tool_msuvbinner.xml
05-Oct-2026 13:09:44 -rw-r--r-- 1 casaci root      1171 Oct  5 17:09 test_tool_quanta.xml
05-Oct-2026 13:09:44 -rw-r--r-- 1 casaci root      3975 Oct  5 17:09 test_tool_regionmanager.xml
05-Oct-2026 13:09:44 -rw-r--r-- 1 casaci root      2071 Oct  5 17:09 test_tool_sdm.xml
05-Oct-2026 13:09:44 -rw-r--r-- 1 casaci root      2190 Oct  5 17:09 test_tool_sdm_toms.xml
05-Oct-2026 13:09:44 -rw-r--r-- 1 casaci root       670 Oct  5 17:09 test_tool_simulator.xml
05-Oct-2026 13:09:44 -rw-r--r-- 1 casaci root      2025 Oct  5 17:09 test_tool_synthesisutils.xml
05-Oct-2026 13:09:44 -rw-r--r-- 1 casaci root      1462 Oct  5 17:09 test_tool_table.xml
05-Oct-2026 13:09:44 -rw-r--r-- 1 casaci root      1717 Oct  5 17:09 test_tool_vpmanager.xml
05-Oct-2026 13:09:44 -rw-r--r-- 1 casaci root        45 Oct  5 17:09 work-manylinux228-3.12.tar.gz
05-Oct-2026 13:09:44 Done packaging working directory
05-Oct-2026 13:09:44 Finished task 'Tar work directory' with result: Success
05-Oct-2026 13:09:44 Starting task 'Parse tests' of type 'com.atlassian.bamboo.plugins.testresultparser:task.testresultparser.junit'
05-Oct-2026 13:09:44 Parsing test results under /opt/ci_workspace/casa/bamboo/agent1/xml-data/build-dir/CASA-REMT3GI-TTOMLPY38...
05-Oct-2026 13:09:44 Failing task since 1 failing test cases were found.
05-Oct-2026 13:09:44 Finished task 'Parse tests' with result: Failed
05-Oct-2026 13:09:44 Running post build plugin 'Docker Container Cleanup'
05-Oct-2026 13:09:44
Beginning to execute external process for build 'CASA - Release Engineering Master Test 3.12 go.nrao.edu IERS - Test Tools Many Linux 2.28 Rocky 8.10 Py3.12 #5 (CASA-REMT3GI-TTOMLPY38-5)'
... running command line:
/usr/bin/docker rm -f wheel-container-test-153550849
... in: /opt/ci_workspace/casa/bamboo/agent1/xml-data/build-dir/CASA-REMT3GI-TTOMLPY38
05-Oct-2026 13:09:46 wheel-container-test-153550849
05-Oct-2026 13:09:46 Running post build plugin 'NCover Results Collector'
05-Oct-2026 13:09:46 Running post build plugin 'Build Results Label Collector'
05-Oct-2026 13:09:46 Running post build plugin 'Clover Results Collector'
05-Oct-2026 13:09:46 Running post build plugin 'npm Cache Cleanup'
05-Oct-2026 13:09:46 Running post build plugin 'Artifact Copier'
05-Oct-2026 13:09:46 Publishing an artifact: Workdir
05-Oct-2026 13:09:46 Finished publishing of artifact Non required job artifact Http Compression On : [Workdir], patterns: [work*.tar.gz] anchored at: [wheeldirectory/] in 38.95 ms
05-Oct-2026 13:09:46 Publishing an artifact: XML Directories
05-Oct-2026 13:09:46 Finished publishing of artifact Non required job artifact Http Compression On : [XML Directories], patterns: [**/*.xml] anchored at: [wheeldirectory/] in 122.3 ms
05-Oct-2026 13:09:46 Finalising the build...
05-Oct-2026 13:09:46 Stopping timer.
05-Oct-2026 13:09:46 Build CASA-REMT3GI-TTOMLPY38-5 completed.
05-Oct-2026 13:09:47 Running on server: post build plugin 'Build Hanging Detection Configuration'
05-Oct-2026 13:09:47 Running on server: post build plugin 'NCover Results Collector'
05-Oct-2026 13:09:47 Running on server: post build plugin 'Build Labeller'
05-Oct-2026 13:09:47 Running on server: post build plugin 'Clover Delta Calculator'
05-Oct-2026 13:09:47 Running on server: post build plugin 'Maven Dependencies Postprocessor'
05-Oct-2026 13:09:47 All post build plugins have finished
05-Oct-2026 13:09:47 Generating build results summary...
05-Oct-2026 13:09:47 Saving build results to disk...
05-Oct-2026 13:09:47 Store variable context...
05-Oct-2026 13:09:47 Finished building CASA-REMT3GI-TTOMLPY38-5.