Test Tools and Tasks using https://go.nrao.edu/iers/

Build: #4 failed Manual run by Akeem Wells

Test results

  • 725 tests in total
  • 2 tests failed
  • 1 failure is new
  • 5 tests were quarantined / skipped
  • 7 minutes taken in total.
New test failures 1
Status Test View job Duration
Collapse Failed test_task_gencal gencal_eoptest.test_eop
Test Tasks Many Linux 2.28 Rocky 8.10 Py3.12 < 1 sec
AssertionError: False is not true
test_task_gencal.py:911: in test_eop
    self.assertTrue(th.compTables(caltab, reference, ['WEIGHT'], [0.001, 1e-14], mode="both"))
E   AssertionError: False is not true
Existing test failures 1
Status Test Failing since View job Duration
AssertionError: 220295510184.34296 != 220295510184.3427
test_tool_synthesisutils.py:478: in test_su_advisechansel_getfreqrange_ephem
    self.assertEqual(res['freqstart']['value'], refdict['freqstart']['value'])
E   AssertionError: 220295510184.34296 != 220295510184.3427
Skipped tests 5
Status Test Failing since View job
Skipped test_tool_sdm SdmFrommsTest.test10
Test Tools Many Linux 2.28 Rocky 8.10 Py3.12
Skipped test_tool_sdm SdmFrommsTest.test12
Test Tools Many Linux 2.28 Rocky 8.10 Py3.12
Skipped test_tool_sdm_toms asdm_import7.test7_lazy3
Test Tools Many Linux 2.28 Rocky 8.10 Py3.12
Skipped test_tool_sdm_toms asdm_import7.test7_skiprows1
Test Tools Many Linux 2.28 Rocky 8.10 Py3.12
Skipped test_tool_simulator sm_settrop_test.test_smsettrop
Test Tools Many Linux 2.28 Rocky 8.10 Py3.12