Build: #293 failed
Job: Test Tasks Many Linux 2.28 CasaShell Rocky 8.10 failed
Test results
- 3,681 tests in total
- 1 test failed
- 143 tests were quarantined / skipped
- 359 minutes taken in total.
Build 293 has the following 1 errors:There were no new test failures since the previous build.
| Status | Test | Failing since | Duration | |
|---|---|---|---|---|
|
test_widefield
test_widefield_mvc_squint_awp2
|
22 mins | |||
AssertionError: False is not true
Traceback (most recent call last):
File "/home/casatest/casa6/casatasks/tests/casashell_tests/test_task_tclean_casashell.py", line 4339, in test_widefield_mvc_squint_awp2
self.assertTrue(self.check_final(report))
AssertionError: False is not true
|
||||