a comprehensive HTML report from Allure test results.

Build: #115 failed

Job: Test Tasks ManyLinux failed

Stages & jobs

  1. Default Stage

  2. Generate Full Report

    Final

Test results

  • 750 tests in total
  • 2 tests failed
  • 5 tests were quarantined / skipped
  • 32 minutes taken in total.

Build 115 has the following 2 errors:There were no new test failures since the previous build.

Existing test failures 2
Status Test Failing since Duration
AssertionError: np.False_ is not true : Flags for antenna 1 are inconsistent
test_task_fringefit.py:569: in test_spw
    self.assertTrue(np.all(flags== np.array([ True,  True,  True, False, False])), msg="Flags for antenna 1 are inconsistent")
E   AssertionError: np.False_ is not true : Flags for antenna 1 are inconsistent
AssertionError: False is not true : Current solutions differs from reference solution. max diff: 181.81819915771484, mean diff: -0.07818151673747335, median diff 0.0, tol: 1e-05.
test_task_pccor.py:286: in test_solutionValues
    self.assertTrue(passed, f'Current solutions differs from reference solution. max diff: {diff_max}, mean diff: '
E   AssertionError: False is not true : Current solutions differs from reference solution. max diff: 181.81819915771484, mean diff: -0.07818151673747335, median diff 0.0, tol: 1e-05.