Build: #153 failed

Job: Test ManyLinux 2.28 Python 3.12 failed

Stages & jobs

  1. Test

Build log

The build generated 93,964 lines of output.   The output is too long and has been truncated to the last 1,000 lines. Download or view full build log.

25-Oct-2026 10:12:50
25-Oct-2026 10:12:50 ../casa-6.8.0-1-pipeline-2026.3.0.38-py3.12.el8/lib/py/lib/python3.12/site-packages/casaplotms/private/plotms_pb2.py:430: 12 warnings
25-Oct-2026 10:12:50   /lustre/cv/sw/casa/casaci/cvpost128/bamboohome/xml-data/build-dir/PIPESPECS-TESTPIPEMAINCASAMASTER-ML228PY312TEST/casa-build-utils/pipeline/workdir/casa-6.8.0-1-pipeline-2026.3.0.38-py3.12.el8/lib/py/lib/python3.12/site-packages/casaplotms/private/plotms_pb2.py:430: DeprecationWarning: Call to deprecated create function FieldDescriptor(). Note: Create unlinked descriptors is going to go away. Please use get/find descriptors from generated code or query the descriptor_pool.
25-Oct-2026 10:12:50     _descriptor.FieldDescriptor(
25-Oct-2026 10:12:50
25-Oct-2026 10:12:50 ../casa-6.8.0-1-pipeline-2026.3.0.38-py3.12.el8/lib/py/lib/python3.12/site-packages/casaplotms/private/plotms_pb2.py:437: 12 warnings
25-Oct-2026 10:12:50   /lustre/cv/sw/casa/casaci/cvpost128/bamboohome/xml-data/build-dir/PIPESPECS-TESTPIPEMAINCASAMASTER-ML228PY312TEST/casa-build-utils/pipeline/workdir/casa-6.8.0-1-pipeline-2026.3.0.38-py3.12.el8/lib/py/lib/python3.12/site-packages/casaplotms/private/plotms_pb2.py:437: DeprecationWarning: Call to deprecated create function FieldDescriptor(). Note: Create unlinked descriptors is going to go away. Please use get/find descriptors from generated code or query the descriptor_pool.
25-Oct-2026 10:12:50     _descriptor.FieldDescriptor(
25-Oct-2026 10:12:50
25-Oct-2026 10:12:50 ../casa-6.8.0-1-pipeline-2026.3.0.38-py3.12.el8/lib/py/lib/python3.12/site-packages/casaplotms/private/plotms_pb2.py:444: 12 warnings
25-Oct-2026 10:12:50   /lustre/cv/sw/casa/casaci/cvpost128/bamboohome/xml-data/build-dir/PIPESPECS-TESTPIPEMAINCASAMASTER-ML228PY312TEST/casa-build-utils/pipeline/workdir/casa-6.8.0-1-pipeline-2026.3.0.38-py3.12.el8/lib/py/lib/python3.12/site-packages/casaplotms/private/plotms_pb2.py:444: DeprecationWarning: Call to deprecated create function FieldDescriptor(). Note: Create unlinked descriptors is going to go away. Please use get/find descriptors from generated code or query the descriptor_pool.
25-Oct-2026 10:12:50     _descriptor.FieldDescriptor(
25-Oct-2026 10:12:50
25-Oct-2026 10:12:50 ../casa-6.8.0-1-pipeline-2026.3.0.38-py3.12.el8/lib/py/lib/python3.12/site-packages/casaplotms/private/plotms_pb2.py:451: 12 warnings
25-Oct-2026 10:12:50   /lustre/cv/sw/casa/casaci/cvpost128/bamboohome/xml-data/build-dir/PIPESPECS-TESTPIPEMAINCASAMASTER-ML228PY312TEST/casa-build-utils/pipeline/workdir/casa-6.8.0-1-pipeline-2026.3.0.38-py3.12.el8/lib/py/lib/python3.12/site-packages/casaplotms/private/plotms_pb2.py:451: DeprecationWarning: Call to deprecated create function FieldDescriptor(). Note: Create unlinked descriptors is going to go away. Please use get/find descriptors from generated code or query the descriptor_pool.
25-Oct-2026 10:12:50     _descriptor.FieldDescriptor(
25-Oct-2026 10:12:50
25-Oct-2026 10:12:50 ../casa-6.8.0-1-pipeline-2026.3.0.38-py3.12.el8/lib/py/lib/python3.12/site-packages/casaplotms/private/plotms_pb2.py:458: 12 warnings
25-Oct-2026 10:12:50   /lustre/cv/sw/casa/casaci/cvpost128/bamboohome/xml-data/build-dir/PIPESPECS-TESTPIPEMAINCASAMASTER-ML228PY312TEST/casa-build-utils/pipeline/workdir/casa-6.8.0-1-pipeline-2026.3.0.38-py3.12.el8/lib/py/lib/python3.12/site-packages/casaplotms/private/plotms_pb2.py:458: DeprecationWarning: Call to deprecated create function FieldDescriptor(). Note: Create unlinked descriptors is going to go away. Please use get/find descriptors from generated code or query the descriptor_pool.
25-Oct-2026 10:12:50     _descriptor.FieldDescriptor(
25-Oct-2026 10:12:50
25-Oct-2026 10:12:50 ../casa-6.8.0-1-pipeline-2026.3.0.38-py3.12.el8/lib/py/lib/python3.12/site-packages/casaplotms/private/plotms_pb2.py:465: 12 warnings
25-Oct-2026 10:12:50   /lustre/cv/sw/casa/casaci/cvpost128/bamboohome/xml-data/build-dir/PIPESPECS-TESTPIPEMAINCASAMASTER-ML228PY312TEST/casa-build-utils/pipeline/workdir/casa-6.8.0-1-pipeline-2026.3.0.38-py3.12.el8/lib/py/lib/python3.12/site-packages/casaplotms/private/plotms_pb2.py:465: DeprecationWarning: Call to deprecated create function FieldDescriptor(). Note: Create unlinked descriptors is going to go away. Please use get/find descriptors from generated code or query the descriptor_pool.
25-Oct-2026 10:12:50     _descriptor.FieldDescriptor(
25-Oct-2026 10:12:50
25-Oct-2026 10:12:50 ../casa-6.8.0-1-pipeline-2026.3.0.38-py3.12.el8/lib/py/lib/python3.12/site-packages/casaplotms/private/plotms_pb2.py:360: 12 warnings
25-Oct-2026 10:12:50   /lustre/cv/sw/casa/casaci/cvpost128/bamboohome/xml-data/build-dir/PIPESPECS-TESTPIPEMAINCASAMASTER-ML228PY312TEST/casa-build-utils/pipeline/workdir/casa-6.8.0-1-pipeline-2026.3.0.38-py3.12.el8/lib/py/lib/python3.12/site-packages/casaplotms/private/plotms_pb2.py:360: DeprecationWarning: Call to deprecated create function Descriptor(). Note: Create unlinked descriptors is going to go away. Please use get/find descriptors from generated code or query the descriptor_pool.
25-Oct-2026 10:12:50     _SETSELECTION = _descriptor.Descriptor(
25-Oct-2026 10:12:50
25-Oct-2026 10:12:50 ../casa-6.8.0-1-pipeline-2026.3.0.38-py3.12.el8/lib/py/lib/python3.12/site-packages/casaplotms/private/plotms_pb2.py:496: 12 warnings
25-Oct-2026 10:12:50   /lustre/cv/sw/casa/casaci/cvpost128/bamboohome/xml-data/build-dir/PIPESPECS-TESTPIPEMAINCASAMASTER-ML228PY312TEST/casa-build-utils/pipeline/workdir/casa-6.8.0-1-pipeline-2026.3.0.38-py3.12.el8/lib/py/lib/python3.12/site-packages/casaplotms/private/plotms_pb2.py:496: DeprecationWarning: Call to deprecated create function FieldDescriptor(). Note: Create unlinked descriptors is going to go away. Please use get/find descriptors from generated code or query the descriptor_pool.
25-Oct-2026 10:12:50     _descriptor.FieldDescriptor(
25-Oct-2026 10:12:50
25-Oct-2026 10:12:50 ../casa-6.8.0-1-pipeline-2026.3.0.38-py3.12.el8/lib/py/lib/python3.12/site-packages/casaplotms/private/plotms_pb2.py:503: 12 warnings
25-Oct-2026 10:12:50   /lustre/cv/sw/casa/casaci/cvpost128/bamboohome/xml-data/build-dir/PIPESPECS-TESTPIPEMAINCASAMASTER-ML228PY312TEST/casa-build-utils/pipeline/workdir/casa-6.8.0-1-pipeline-2026.3.0.38-py3.12.el8/lib/py/lib/python3.12/site-packages/casaplotms/private/plotms_pb2.py:503: DeprecationWarning: Call to deprecated create function FieldDescriptor(). Note: Create unlinked descriptors is going to go away. Please use get/find descriptors from generated code or query the descriptor_pool.
25-Oct-2026 10:12:50     _descriptor.FieldDescriptor(
25-Oct-2026 10:12:50
25-Oct-2026 10:12:50 ../casa-6.8.0-1-pipeline-2026.3.0.38-py3.12.el8/lib/py/lib/python3.12/site-packages/casaplotms/private/plotms_pb2.py:510: 12 warnings
25-Oct-2026 10:12:50   /lustre/cv/sw/casa/casaci/cvpost128/bamboohome/xml-data/build-dir/PIPESPECS-TESTPIPEMAINCASAMASTER-ML228PY312TEST/casa-build-utils/pipeline/workdir/casa-6.8.0-1-pipeline-2026.3.0.38-py3.12.el8/lib/py/lib/python3.12/site-packages/casaplotms/private/plotms_pb2.py:510: DeprecationWarning: Call to deprecated create function FieldDescriptor(). Note: Create unlinked descriptors is going to go away. Please use get/find descriptors from generated code or query the descriptor_pool.
25-Oct-2026 10:12:50     _descriptor.FieldDescriptor(
25-Oct-2026 10:12:50
25-Oct-2026 10:12:50 ../casa-6.8.0-1-pipeline-2026.3.0.38-py3.12.el8/lib/py/lib/python3.12/site-packages/casaplotms/private/plotms_pb2.py:517: 12 warnings
25-Oct-2026 10:12:50   /lustre/cv/sw/casa/casaci/cvpost128/bamboohome/xml-data/build-dir/PIPESPECS-TESTPIPEMAINCASAMASTER-ML228PY312TEST/casa-build-utils/pipeline/workdir/casa-6.8.0-1-pipeline-2026.3.0.38-py3.12.el8/lib/py/lib/python3.12/site-packages/casaplotms/private/plotms_pb2.py:517: DeprecationWarning: Call to deprecated create function FieldDescriptor(). Note: Create unlinked descriptors is going to go away. Please use get/find descriptors from generated code or query the descriptor_pool.
25-Oct-2026 10:12:50     _descriptor.FieldDescriptor(
25-Oct-2026 10:12:50
25-Oct-2026 10:12:50 ../casa-6.8.0-1-pipeline-2026.3.0.38-py3.12.el8/lib/py/lib/python3.12/site-packages/casaplotms/private/plotms_pb2.py:524: 12 warnings
25-Oct-2026 10:12:50   /lustre/cv/sw/casa/casaci/cvpost128/bamboohome/xml-data/build-dir/PIPESPECS-TESTPIPEMAINCASAMASTER-ML228PY312TEST/casa-build-utils/pipeline/workdir/casa-6.8.0-1-pipeline-2026.3.0.38-py3.12.el8/lib/py/lib/python3.12/site-packages/casaplotms/private/plotms_pb2.py:524: DeprecationWarning: Call to deprecated create function FieldDescriptor(). Note: Create unlinked descriptors is going to go away. Please use get/find descriptors from generated code or query the descriptor_pool.
25-Oct-2026 10:12:50     _descriptor.FieldDescriptor(
25-Oct-2026 10:12:50
25-Oct-2026 10:12:50 ../casa-6.8.0-1-pipeline-2026.3.0.38-py3.12.el8/lib/py/lib/python3.12/site-packages/casaplotms/private/plotms_pb2.py:531: 12 warnings
25-Oct-2026 10:12:50   /lustre/cv/sw/casa/casaci/cvpost128/bamboohome/xml-data/build-dir/PIPESPECS-TESTPIPEMAINCASAMASTER-ML228PY312TEST/casa-build-utils/pipeline/workdir/casa-6.8.0-1-pipeline-2026.3.0.38-py3.12.el8/lib/py/lib/python3.12/site-packages/casaplotms/private/plotms_pb2.py:531: DeprecationWarning: Call to deprecated create function FieldDescriptor(). Note: Create unlinked descriptors is going to go away. Please use get/find descriptors from generated code or query the descriptor_pool.
25-Oct-2026 10:12:50     _descriptor.FieldDescriptor(
25-Oct-2026 10:12:50
25-Oct-2026 10:12:50 ../casa-6.8.0-1-pipeline-2026.3.0.38-py3.12.el8/lib/py/lib/python3.12/site-packages/casaplotms/private/plotms_pb2.py:538: 12 warnings
25-Oct-2026 10:12:50   /lustre/cv/sw/casa/casaci/cvpost128/bamboohome/xml-data/build-dir/PIPESPECS-TESTPIPEMAINCASAMASTER-ML228PY312TEST/casa-build-utils/pipeline/workdir/casa-6.8.0-1-pipeline-2026.3.0.38-py3.12.el8/lib/py/lib/python3.12/site-packages/casaplotms/private/plotms_pb2.py:538: DeprecationWarning: Call to deprecated create function FieldDescriptor(). Note: Create unlinked descriptors is going to go away. Please use get/find descriptors from generated code or query the descriptor_pool.
25-Oct-2026 10:12:50     _descriptor.FieldDescriptor(
25-Oct-2026 10:12:50
25-Oct-2026 10:12:50 ../casa-6.8.0-1-pipeline-2026.3.0.38-py3.12.el8/lib/py/lib/python3.12/site-packages/casaplotms/private/plotms_pb2.py:545: 12 warnings
25-Oct-2026 10:12:50   /lustre/cv/sw/casa/casaci/cvpost128/bamboohome/xml-data/build-dir/PIPESPECS-TESTPIPEMAINCASAMASTER-ML228PY312TEST/casa-build-utils/pipeline/workdir/casa-6.8.0-1-pipeline-2026.3.0.38-py3.12.el8/lib/py/lib/python3.12/site-packages/casaplotms/private/plotms_pb2.py:545: DeprecationWarning: Call to deprecated create function FieldDescriptor(). Note: Create unlinked descriptors is going to go away. Please use get/find descriptors from generated code or query the descriptor_pool.
25-Oct-2026 10:12:50     _descriptor.FieldDescriptor(
25-Oct-2026 10:12:50
25-Oct-2026 10:12:50 ../casa-6.8.0-1-pipeline-2026.3.0.38-py3.12.el8/lib/py/lib/python3.12/site-packages/casaplotms/private/plotms_pb2.py:552: 12 warnings
25-Oct-2026 10:12:50   /lustre/cv/sw/casa/casaci/cvpost128/bamboohome/xml-data/build-dir/PIPESPECS-TESTPIPEMAINCASAMASTER-ML228PY312TEST/casa-build-utils/pipeline/workdir/casa-6.8.0-1-pipeline-2026.3.0.38-py3.12.el8/lib/py/lib/python3.12/site-packages/casaplotms/private/plotms_pb2.py:552: DeprecationWarning: Call to deprecated create function FieldDescriptor(). Note: Create unlinked descriptors is going to go away. Please use get/find descriptors from generated code or query the descriptor_pool.
25-Oct-2026 10:12:50     _descriptor.FieldDescriptor(
25-Oct-2026 10:12:50
25-Oct-2026 10:12:50 ../casa-6.8.0-1-pipeline-2026.3.0.38-py3.12.el8/lib/py/lib/python3.12/site-packages/casaplotms/private/plotms_pb2.py:559: 12 warnings
25-Oct-2026 10:12:50   /lustre/cv/sw/casa/casaci/cvpost128/bamboohome/xml-data/build-dir/PIPESPECS-TESTPIPEMAINCASAMASTER-ML228PY312TEST/casa-build-utils/pipeline/workdir/casa-6.8.0-1-pipeline-2026.3.0.38-py3.12.el8/lib/py/lib/python3.12/site-packages/casaplotms/private/plotms_pb2.py:559: DeprecationWarning: Call to deprecated create function FieldDescriptor(). Note: Create unlinked descriptors is going to go away. Please use get/find descriptors from generated code or query the descriptor_pool.
25-Oct-2026 10:12:50     _descriptor.FieldDescriptor(
25-Oct-2026 10:12:50
25-Oct-2026 10:12:50 ../casa-6.8.0-1-pipeline-2026.3.0.38-py3.12.el8/lib/py/lib/python3.12/site-packages/casaplotms/private/plotms_pb2.py:489: 12 warnings
25-Oct-2026 10:12:50   /lustre/cv/sw/casa/casaci/cvpost128/bamboohome/xml-data/build-dir/PIPESPECS-TESTPIPEMAINCASAMASTER-ML228PY312TEST/casa-build-utils/pipeline/workdir/casa-6.8.0-1-pipeline-2026.3.0.38-py3.12.el8/lib/py/lib/python3.12/site-packages/casaplotms/private/plotms_pb2.py:489: DeprecationWarning: Call to deprecated create function Descriptor(). Note: Create unlinked descriptors is going to go away. Please use get/find descriptors from generated code or query the descriptor_pool.
25-Oct-2026 10:12:50     _SETAVERAGING = _descriptor.Descriptor(
25-Oct-2026 10:12:50
25-Oct-2026 10:12:50 ../casa-6.8.0-1-pipeline-2026.3.0.38-py3.12.el8/lib/py/lib/python3.12/site-packages/casaplotms/private/plotms_pb2.py:590: 12 warnings
25-Oct-2026 10:12:50   /lustre/cv/sw/casa/casaci/cvpost128/bamboohome/xml-data/build-dir/PIPESPECS-TESTPIPEMAINCASAMASTER-ML228PY312TEST/casa-build-utils/pipeline/workdir/casa-6.8.0-1-pipeline-2026.3.0.38-py3.12.el8/lib/py/lib/python3.12/site-packages/casaplotms/private/plotms_pb2.py:590: DeprecationWarning: Call to deprecated create function FieldDescriptor(). Note: Create unlinked descriptors is going to go away. Please use get/find descriptors from generated code or query the descriptor_pool.
25-Oct-2026 10:12:50     _descriptor.FieldDescriptor(
25-Oct-2026 10:12:50
25-Oct-2026 10:12:50 ../casa-6.8.0-1-pipeline-2026.3.0.38-py3.12.el8/lib/py/lib/python3.12/site-packages/casaplotms/private/plotms_pb2.py:597: 12 warnings
25-Oct-2026 10:12:50   /lustre/cv/sw/casa/casaci/cvpost128/bamboohome/xml-data/build-dir/PIPESPECS-TESTPIPEMAINCASAMASTER-ML228PY312TEST/casa-build-utils/pipeline/workdir/casa-6.8.0-1-pipeline-2026.3.0.38-py3.12.el8/lib/py/lib/python3.12/site-packages/casaplotms/private/plotms_pb2.py:597: DeprecationWarning: Call to deprecated create function FieldDescriptor(). Note: Create unlinked descriptors is going to go away. Please use get/find descriptors from generated code or query the descriptor_pool.
25-Oct-2026 10:12:50     _descriptor.FieldDescriptor(
25-Oct-2026 10:12:50
25-Oct-2026 10:12:50 ../casa-6.8.0-1-pipeline-2026.3.0.38-py3.12.el8/lib/py/lib/python3.12/site-packages/casaplotms/private/plotms_pb2.py:604: 12 warnings
25-Oct-2026 10:12:50   /lustre/cv/sw/casa/casaci/cvpost128/bamboohome/xml-data/build-dir/PIPESPECS-TESTPIPEMAINCASAMASTER-ML228PY312TEST/casa-build-utils/pipeline/workdir/casa-6.8.0-1-pipeline-2026.3.0.38-py3.12.el8/lib/py/lib/python3.12/site-packages/casaplotms/private/plotms_pb2.py:604: DeprecationWarning: Call to deprecated create function FieldDescriptor(). Note: Create unlinked descriptors is going to go away. Please use get/find descriptors from generated code or query the descriptor_pool.
25-Oct-2026 10:12:50     _descriptor.FieldDescriptor(
25-Oct-2026 10:12:50
25-Oct-2026 10:12:50 ../casa-6.8.0-1-pipeline-2026.3.0.38-py3.12.el8/lib/py/lib/python3.12/site-packages/casaplotms/private/plotms_pb2.py:611: 12 warnings
25-Oct-2026 10:12:50   /lustre/cv/sw/casa/casaci/cvpost128/bamboohome/xml-data/build-dir/PIPESPECS-TESTPIPEMAINCASAMASTER-ML228PY312TEST/casa-build-utils/pipeline/workdir/casa-6.8.0-1-pipeline-2026.3.0.38-py3.12.el8/lib/py/lib/python3.12/site-packages/casaplotms/private/plotms_pb2.py:611: DeprecationWarning: Call to deprecated create function FieldDescriptor(). Note: Create unlinked descriptors is going to go away. Please use get/find descriptors from generated code or query the descriptor_pool.
25-Oct-2026 10:12:50     _descriptor.FieldDescriptor(
25-Oct-2026 10:12:50
25-Oct-2026 10:12:50 ../casa-6.8.0-1-pipeline-2026.3.0.38-py3.12.el8/lib/py/lib/python3.12/site-packages/casaplotms/private/plotms_pb2.py:618: 12 warnings
25-Oct-2026 10:12:50   /lustre/cv/sw/casa/casaci/cvpost128/bamboohome/xml-data/build-dir/PIPESPECS-TESTPIPEMAINCASAMASTER-ML228PY312TEST/casa-build-utils/pipeline/workdir/casa-6.8.0-1-pipeline-2026.3.0.38-py3.12.el8/lib/py/lib/python3.12/site-packages/casaplotms/private/plotms_pb2.py:618: DeprecationWarning: Call to deprecated create function FieldDescriptor(). Note: Create unlinked descriptors is going to go away. Please use get/find descriptors from generated code or query the descriptor_pool.
25-Oct-2026 10:12:50     _descriptor.FieldDescriptor(
25-Oct-2026 10:12:50
25-Oct-2026 10:12:50 ../casa-6.8.0-1-pipeline-2026.3.0.38-py3.12.el8/lib/py/lib/python3.12/site-packages/casaplotms/private/plotms_pb2.py:625: 12 warnings
25-Oct-2026 10:12:50   /lustre/cv/sw/casa/casaci/cvpost128/bamboohome/xml-data/build-dir/PIPESPECS-TESTPIPEMAINCASAMASTER-ML228PY312TEST/casa-build-utils/pipeline/workdir/casa-6.8.0-1-pipeline-2026.3.0.38-py3.12.el8/lib/py/lib/python3.12/site-packages/casaplotms/private/plotms_pb2.py:625: DeprecationWarning: Call to deprecated create function FieldDescriptor(). Note: Create unlinked descriptors is going to go away. Please use get/find descriptors from generated code or query the descriptor_pool.
25-Oct-2026 10:12:50     _descriptor.FieldDescriptor(
25-Oct-2026 10:12:50
25-Oct-2026 10:12:50 ../casa-6.8.0-1-pipeline-2026.3.0.38-py3.12.el8/lib/py/lib/python3.12/site-packages/casaplotms/private/plotms_pb2.py:583: 12 warnings
25-Oct-2026 10:12:50   /lustre/cv/sw/casa/casaci/cvpost128/bamboohome/xml-data/build-dir/PIPESPECS-TESTPIPEMAINCASAMASTER-ML228PY312TEST/casa-build-utils/pipeline/workdir/casa-6.8.0-1-pipeline-2026.3.0.38-py3.12.el8/lib/py/lib/python3.12/site-packages/casaplotms/private/plotms_pb2.py:583: DeprecationWarning: Call to deprecated create function Descriptor(). Note: Create unlinked descriptors is going to go away. Please use get/find descriptors from generated code or query the descriptor_pool.
25-Oct-2026 10:12:50     _SETTRANSFORM = _descriptor.Descriptor(
25-Oct-2026 10:12:50
25-Oct-2026 10:12:50 ../casa-6.8.0-1-pipeline-2026.3.0.38-py3.12.el8/lib/py/lib/python3.12/site-packages/casaplotms/private/plotms_pb2.py:656: 12 warnings
25-Oct-2026 10:12:50   /lustre/cv/sw/casa/casaci/cvpost128/bamboohome/xml-data/build-dir/PIPESPECS-TESTPIPEMAINCASAMASTER-ML228PY312TEST/casa-build-utils/pipeline/workdir/casa-6.8.0-1-pipeline-2026.3.0.38-py3.12.el8/lib/py/lib/python3.12/site-packages/casaplotms/private/plotms_pb2.py:656: DeprecationWarning: Call to deprecated create function FieldDescriptor(). Note: Create unlinked descriptors is going to go away. Please use get/find descriptors from generated code or query the descriptor_pool.
25-Oct-2026 10:12:50     _descriptor.FieldDescriptor(
25-Oct-2026 10:12:50
25-Oct-2026 10:12:50 ../casa-6.8.0-1-pipeline-2026.3.0.38-py3.12.el8/lib/py/lib/python3.12/site-packages/casaplotms/private/plotms_pb2.py:663: 12 warnings
25-Oct-2026 10:12:50   /lustre/cv/sw/casa/casaci/cvpost128/bamboohome/xml-data/build-dir/PIPESPECS-TESTPIPEMAINCASAMASTER-ML228PY312TEST/casa-build-utils/pipeline/workdir/casa-6.8.0-1-pipeline-2026.3.0.38-py3.12.el8/lib/py/lib/python3.12/site-packages/casaplotms/private/plotms_pb2.py:663: DeprecationWarning: Call to deprecated create function FieldDescriptor(). Note: Create unlinked descriptors is going to go away. Please use get/find descriptors from generated code or query the descriptor_pool.
25-Oct-2026 10:12:50     _descriptor.FieldDescriptor(
25-Oct-2026 10:12:50
25-Oct-2026 10:12:50 ../casa-6.8.0-1-pipeline-2026.3.0.38-py3.12.el8/lib/py/lib/python3.12/site-packages/casaplotms/private/plotms_pb2.py:670: 12 warnings
25-Oct-2026 10:12:50   /lustre/cv/sw/casa/casaci/cvpost128/bamboohome/xml-data/build-dir/PIPESPECS-TESTPIPEMAINCASAMASTER-ML228PY312TEST/casa-build-utils/pipeline/workdir/casa-6.8.0-1-pipeline-2026.3.0.38-py3.12.el8/lib/py/lib/python3.12/site-packages/casaplotms/private/plotms_pb2.py:670: DeprecationWarning: Call to deprecated create function FieldDescriptor(). Note: Create unlinked descriptors is going to go away. Please use get/find descriptors from generated code or query the descriptor_pool.
25-Oct-2026 10:12:50     _descriptor.FieldDescriptor(
25-Oct-2026 10:12:50
25-Oct-2026 10:12:50 ../casa-6.8.0-1-pipeline-2026.3.0.38-py3.12.el8/lib/py/lib/python3.12/site-packages/casaplotms/private/plotms_pb2.py:677: 12 warnings
25-Oct-2026 10:12:50   /lustre/cv/sw/casa/casaci/cvpost128/bamboohome/xml-data/build-dir/PIPESPECS-TESTPIPEMAINCASAMASTER-ML228PY312TEST/casa-build-utils/pipeline/workdir/casa-6.8.0-1-pipeline-2026.3.0.38-py3.12.el8/lib/py/lib/python3.12/site-packages/casaplotms/private/plotms_pb2.py:677: DeprecationWarning: Call to deprecated create function FieldDescriptor(). Note: Create unlinked descriptors is going to go away. Please use get/find descriptors from generated code or query the descriptor_pool.
25-Oct-2026 10:12:50     _descriptor.FieldDescriptor(
25-Oct-2026 10:12:50
25-Oct-2026 10:12:50 ../casa-6.8.0-1-pipeline-2026.3.0.38-py3.12.el8/lib/py/lib/python3.12/site-packages/casaplotms/private/plotms_pb2.py:649: 12 warnings
25-Oct-2026 10:12:50   /lustre/cv/sw/casa/casaci/cvpost128/bamboohome/xml-data/build-dir/PIPESPECS-TESTPIPEMAINCASAMASTER-ML228PY312TEST/casa-build-utils/pipeline/workdir/casa-6.8.0-1-pipeline-2026.3.0.38-py3.12.el8/lib/py/lib/python3.12/site-packages/casaplotms/private/plotms_pb2.py:649: DeprecationWarning: Call to deprecated create function Descriptor(). Note: Create unlinked descriptors is going to go away. Please use get/find descriptors from generated code or query the descriptor_pool.
25-Oct-2026 10:12:50     _SETCALIBRATION = _descriptor.Descriptor(
25-Oct-2026 10:12:50
25-Oct-2026 10:12:50 ../casa-6.8.0-1-pipeline-2026.3.0.38-py3.12.el8/lib/py/lib/python3.12/site-packages/casaplotms/private/plotms_pb2.py:708: 12 warnings
25-Oct-2026 10:12:50   /lustre/cv/sw/casa/casaci/cvpost128/bamboohome/xml-data/build-dir/PIPESPECS-TESTPIPEMAINCASAMASTER-ML228PY312TEST/casa-build-utils/pipeline/workdir/casa-6.8.0-1-pipeline-2026.3.0.38-py3.12.el8/lib/py/lib/python3.12/site-packages/casaplotms/private/plotms_pb2.py:708: DeprecationWarning: Call to deprecated create function FieldDescriptor(). Note: Create unlinked descriptors is going to go away. Please use get/find descriptors from generated code or query the descriptor_pool.
25-Oct-2026 10:12:50     _descriptor.FieldDescriptor(
25-Oct-2026 10:12:50
25-Oct-2026 10:12:50 ../casa-6.8.0-1-pipeline-2026.3.0.38-py3.12.el8/lib/py/lib/python3.12/site-packages/casaplotms/private/plotms_pb2.py:715: 12 warnings
25-Oct-2026 10:12:50   /lustre/cv/sw/casa/casaci/cvpost128/bamboohome/xml-data/build-dir/PIPESPECS-TESTPIPEMAINCASAMASTER-ML228PY312TEST/casa-build-utils/pipeline/workdir/casa-6.8.0-1-pipeline-2026.3.0.38-py3.12.el8/lib/py/lib/python3.12/site-packages/casaplotms/private/plotms_pb2.py:715: DeprecationWarning: Call to deprecated create function FieldDescriptor(). Note: Create unlinked descriptors is going to go away. Please use get/find descriptors from generated code or query the descriptor_pool.
25-Oct-2026 10:12:50     _descriptor.FieldDescriptor(
25-Oct-2026 10:12:50
25-Oct-2026 10:12:50 ../casa-6.8.0-1-pipeline-2026.3.0.38-py3.12.el8/lib/py/lib/python3.12/site-packages/casaplotms/private/plotms_pb2.py:722: 12 warnings
25-Oct-2026 10:12:50   /lustre/cv/sw/casa/casaci/cvpost128/bamboohome/xml-data/build-dir/PIPESPECS-TESTPIPEMAINCASAMASTER-ML228PY312TEST/casa-build-utils/pipeline/workdir/casa-6.8.0-1-pipeline-2026.3.0.38-py3.12.el8/lib/py/lib/python3.12/site-packages/casaplotms/private/plotms_pb2.py:722: DeprecationWarning: Call to deprecated create function FieldDescriptor(). Note: Create unlinked descriptors is going to go away. Please use get/find descriptors from generated code or query the descriptor_pool.
25-Oct-2026 10:12:50     _descriptor.FieldDescriptor(
25-Oct-2026 10:12:50
25-Oct-2026 10:12:50 ../casa-6.8.0-1-pipeline-2026.3.0.38-py3.12.el8/lib/py/lib/python3.12/site-packages/casaplotms/private/plotms_pb2.py:729: 12 warnings
25-Oct-2026 10:12:50   /lustre/cv/sw/casa/casaci/cvpost128/bamboohome/xml-data/build-dir/PIPESPECS-TESTPIPEMAINCASAMASTER-ML228PY312TEST/casa-build-utils/pipeline/workdir/casa-6.8.0-1-pipeline-2026.3.0.38-py3.12.el8/lib/py/lib/python3.12/site-packages/casaplotms/private/plotms_pb2.py:729: DeprecationWarning: Call to deprecated create function FieldDescriptor(). Note: Create unlinked descriptors is going to go away. Please use get/find descriptors from generated code or query the descriptor_pool.
25-Oct-2026 10:12:50     _descriptor.FieldDescriptor(
25-Oct-2026 10:12:50
25-Oct-2026 10:12:50 ../casa-6.8.0-1-pipeline-2026.3.0.38-py3.12.el8/lib/py/lib/python3.12/site-packages/casaplotms/private/plotms_pb2.py:736: 12 warnings
25-Oct-2026 10:12:50   /lustre/cv/sw/casa/casaci/cvpost128/bamboohome/xml-data/build-dir/PIPESPECS-TESTPIPEMAINCASAMASTER-ML228PY312TEST/casa-build-utils/pipeline/workdir/casa-6.8.0-1-pipeline-2026.3.0.38-py3.12.el8/lib/py/lib/python3.12/site-packages/casaplotms/private/plotms_pb2.py:736: DeprecationWarning: Call to deprecated create function FieldDescriptor(). Note: Create unlinked descriptors is going to go away. Please use get/find descriptors from generated code or query the descriptor_pool.
25-Oct-2026 10:12:50     _descriptor.FieldDescriptor(
25-Oct-2026 10:12:50
25-Oct-2026 10:12:50 ../casa-6.8.0-1-pipeline-2026.3.0.38-py3.12.el8/lib/py/lib/python3.12/site-packages/casaplotms/private/plotms_pb2.py:743: 12 warnings
25-Oct-2026 10:12:50   /lustre/cv/sw/casa/casaci/cvpost128/bamboohome/xml-data/build-dir/PIPESPECS-TESTPIPEMAINCASAMASTER-ML228PY312TEST/casa-build-utils/pipeline/workdir/casa-6.8.0-1-pipeline-2026.3.0.38-py3.12.el8/lib/py/lib/python3.12/site-packages/casaplotms/private/plotms_pb2.py:743: DeprecationWarning: Call to deprecated create function FieldDescriptor(). Note: Create unlinked descriptors is going to go away. Please use get/find descriptors from generated code or query the descriptor_pool.
25-Oct-2026 10:12:50     _descriptor.FieldDescriptor(
25-Oct-2026 10:12:50
25-Oct-2026 10:12:50 ../casa-6.8.0-1-pipeline-2026.3.0.38-py3.12.el8/lib/py/lib/python3.12/site-packages/casaplotms/private/plotms_pb2.py:750: 12 warnings
25-Oct-2026 10:12:50   /lustre/cv/sw/casa/casaci/cvpost128/bamboohome/xml-data/build-dir/PIPESPECS-TESTPIPEMAINCASAMASTER-ML228PY312TEST/casa-build-utils/pipeline/workdir/casa-6.8.0-1-pipeline-2026.3.0.38-py3.12.el8/lib/py/lib/python3.12/site-packages/casaplotms/private/plotms_pb2.py:750: DeprecationWarning: Call to deprecated create function FieldDescriptor(). Note: Create unlinked descriptors is going to go away. Please use get/find descriptors from generated code or query the descriptor_pool.
25-Oct-2026 10:12:50     _descriptor.FieldDescriptor(
25-Oct-2026 10:12:50
25-Oct-2026 10:12:50 ../casa-6.8.0-1-pipeline-2026.3.0.38-py3.12.el8/lib/py/lib/python3.12/site-packages/casaplotms/private/plotms_pb2.py:757: 12 warnings
25-Oct-2026 10:12:50   /lustre/cv/sw/casa/casaci/cvpost128/bamboohome/xml-data/build-dir/PIPESPECS-TESTPIPEMAINCASAMASTER-ML228PY312TEST/casa-build-utils/pipeline/workdir/casa-6.8.0-1-pipeline-2026.3.0.38-py3.12.el8/lib/py/lib/python3.12/site-packages/casaplotms/private/plotms_pb2.py:757: DeprecationWarning: Call to deprecated create function FieldDescriptor(). Note: Create unlinked descriptors is going to go away. Please use get/find descriptors from generated code or query the descriptor_pool.
25-Oct-2026 10:12:50     _descriptor.FieldDescriptor(
25-Oct-2026 10:12:50
25-Oct-2026 10:12:50 ../casa-6.8.0-1-pipeline-2026.3.0.38-py3.12.el8/lib/py/lib/python3.12/site-packages/casaplotms/private/plotms_pb2.py:764: 12 warnings
25-Oct-2026 10:12:50   /lustre/cv/sw/casa/casaci/cvpost128/bamboohome/xml-data/build-dir/PIPESPECS-TESTPIPEMAINCASAMASTER-ML228PY312TEST/casa-build-utils/pipeline/workdir/casa-6.8.0-1-pipeline-2026.3.0.38-py3.12.el8/lib/py/lib/python3.12/site-packages/casaplotms/private/plotms_pb2.py:764: DeprecationWarning: Call to deprecated create function FieldDescriptor(). Note: Create unlinked descriptors is going to go away. Please use get/find descriptors from generated code or query the descriptor_pool.
25-Oct-2026 10:12:50     _descriptor.FieldDescriptor(
25-Oct-2026 10:12:50
25-Oct-2026 10:12:50 ../casa-6.8.0-1-pipeline-2026.3.0.38-py3.12.el8/lib/py/lib/python3.12/site-packages/casaplotms/private/plotms_pb2.py:771: 12 warnings
25-Oct-2026 10:12:50   /lustre/cv/sw/casa/casaci/cvpost128/bamboohome/xml-data/build-dir/PIPESPECS-TESTPIPEMAINCASAMASTER-ML228PY312TEST/casa-build-utils/pipeline/workdir/casa-6.8.0-1-pipeline-2026.3.0.38-py3.12.el8/lib/py/lib/python3.12/site-packages/casaplotms/private/plotms_pb2.py:771: DeprecationWarning: Call to deprecated create function FieldDescriptor(). Note: Create unlinked descriptors is going to go away. Please use get/find descriptors from generated code or query the descriptor_pool.
25-Oct-2026 10:12:50     _descriptor.FieldDescriptor(
25-Oct-2026 10:12:50
25-Oct-2026 10:12:50 ../casa-6.8.0-1-pipeline-2026.3.0.38-py3.12.el8/lib/py/lib/python3.12/site-packages/casaplotms/private/plotms_pb2.py:701: 12 warnings
25-Oct-2026 10:12:50   /lustre/cv/sw/casa/casaci/cvpost128/bamboohome/xml-data/build-dir/PIPESPECS-TESTPIPEMAINCASAMASTER-ML228PY312TEST/casa-build-utils/pipeline/workdir/casa-6.8.0-1-pipeline-2026.3.0.38-py3.12.el8/lib/py/lib/python3.12/site-packages/casaplotms/private/plotms_pb2.py:701: DeprecationWarning: Call to deprecated create function Descriptor(). Note: Create unlinked descriptors is going to go away. Please use get/find descriptors from generated code or query the descriptor_pool.
25-Oct-2026 10:12:50     _SETFLAGEXTENSION = _descriptor.Descriptor(
25-Oct-2026 10:12:50
25-Oct-2026 10:12:50 ../casa-6.8.0-1-pipeline-2026.3.0.38-py3.12.el8/lib/py/lib/python3.12/site-packages/casaplotms/private/plotms_pb2.py:802: 12 warnings
25-Oct-2026 10:12:50   /lustre/cv/sw/casa/casaci/cvpost128/bamboohome/xml-data/build-dir/PIPESPECS-TESTPIPEMAINCASAMASTER-ML228PY312TEST/casa-build-utils/pipeline/workdir/casa-6.8.0-1-pipeline-2026.3.0.38-py3.12.el8/lib/py/lib/python3.12/site-packages/casaplotms/private/plotms_pb2.py:802: DeprecationWarning: Call to deprecated create function FieldDescriptor(). Note: Create unlinked descriptors is going to go away. Please use get/find descriptors from generated code or query the descriptor_pool.
25-Oct-2026 10:12:50     _descriptor.FieldDescriptor(
25-Oct-2026 10:12:50
25-Oct-2026 10:12:50 ../casa-6.8.0-1-pipeline-2026.3.0.38-py3.12.el8/lib/py/lib/python3.12/site-packages/casaplotms/private/plotms_pb2.py:795: 12 warnings
25-Oct-2026 10:12:50   /lustre/cv/sw/casa/casaci/cvpost128/bamboohome/xml-data/build-dir/PIPESPECS-TESTPIPEMAINCASAMASTER-ML228PY312TEST/casa-build-utils/pipeline/workdir/casa-6.8.0-1-pipeline-2026.3.0.38-py3.12.el8/lib/py/lib/python3.12/site-packages/casaplotms/private/plotms_pb2.py:795: DeprecationWarning: Call to deprecated create function Descriptor(). Note: Create unlinked descriptors is going to go away. Please use get/find descriptors from generated code or query the descriptor_pool.
25-Oct-2026 10:12:50     _EXPORTRANGE = _descriptor.Descriptor(
25-Oct-2026 10:12:50
25-Oct-2026 10:12:50 ../casa-6.8.0-1-pipeline-2026.3.0.38-py3.12.el8/lib/py/lib/python3.12/site-packages/casaplotms/private/plotms_pb2.py:833: 12 warnings
25-Oct-2026 10:12:50   /lustre/cv/sw/casa/casaci/cvpost128/bamboohome/xml-data/build-dir/PIPESPECS-TESTPIPEMAINCASAMASTER-ML228PY312TEST/casa-build-utils/pipeline/workdir/casa-6.8.0-1-pipeline-2026.3.0.38-py3.12.el8/lib/py/lib/python3.12/site-packages/casaplotms/private/plotms_pb2.py:833: DeprecationWarning: Call to deprecated create function FieldDescriptor(). Note: Create unlinked descriptors is going to go away. Please use get/find descriptors from generated code or query the descriptor_pool.
25-Oct-2026 10:12:50     _descriptor.FieldDescriptor(
25-Oct-2026 10:12:50
25-Oct-2026 10:12:50 ../casa-6.8.0-1-pipeline-2026.3.0.38-py3.12.el8/lib/py/lib/python3.12/site-packages/casaplotms/private/plotms_pb2.py:840: 12 warnings
25-Oct-2026 10:12:50   /lustre/cv/sw/casa/casaci/cvpost128/bamboohome/xml-data/build-dir/PIPESPECS-TESTPIPEMAINCASAMASTER-ML228PY312TEST/casa-build-utils/pipeline/workdir/casa-6.8.0-1-pipeline-2026.3.0.38-py3.12.el8/lib/py/lib/python3.12/site-packages/casaplotms/private/plotms_pb2.py:840: DeprecationWarning: Call to deprecated create function FieldDescriptor(). Note: Create unlinked descriptors is going to go away. Please use get/find descriptors from generated code or query the descriptor_pool.
25-Oct-2026 10:12:50     _descriptor.FieldDescriptor(
25-Oct-2026 10:12:50
25-Oct-2026 10:12:50 ../casa-6.8.0-1-pipeline-2026.3.0.38-py3.12.el8/lib/py/lib/python3.12/site-packages/casaplotms/private/plotms_pb2.py:847: 12 warnings
25-Oct-2026 10:12:50   /lustre/cv/sw/casa/casaci/cvpost128/bamboohome/xml-data/build-dir/PIPESPECS-TESTPIPEMAINCASAMASTER-ML228PY312TEST/casa-build-utils/pipeline/workdir/casa-6.8.0-1-pipeline-2026.3.0.38-py3.12.el8/lib/py/lib/python3.12/site-packages/casaplotms/private/plotms_pb2.py:847: DeprecationWarning: Call to deprecated create function FieldDescriptor(). Note: Create unlinked descriptors is going to go away. Please use get/find descriptors from generated code or query the descriptor_pool.
25-Oct-2026 10:12:50     _descriptor.FieldDescriptor(
25-Oct-2026 10:12:50
25-Oct-2026 10:12:50 ../casa-6.8.0-1-pipeline-2026.3.0.38-py3.12.el8/lib/py/lib/python3.12/site-packages/casaplotms/private/plotms_pb2.py:854: 12 warnings
25-Oct-2026 10:12:50   /lustre/cv/sw/casa/casaci/cvpost128/bamboohome/xml-data/build-dir/PIPESPECS-TESTPIPEMAINCASAMASTER-ML228PY312TEST/casa-build-utils/pipeline/workdir/casa-6.8.0-1-pipeline-2026.3.0.38-py3.12.el8/lib/py/lib/python3.12/site-packages/casaplotms/private/plotms_pb2.py:854: DeprecationWarning: Call to deprecated create function FieldDescriptor(). Note: Create unlinked descriptors is going to go away. Please use get/find descriptors from generated code or query the descriptor_pool.
25-Oct-2026 10:12:50     _descriptor.FieldDescriptor(
25-Oct-2026 10:12:50
25-Oct-2026 10:12:50 ../casa-6.8.0-1-pipeline-2026.3.0.38-py3.12.el8/lib/py/lib/python3.12/site-packages/casaplotms/private/plotms_pb2.py:861: 12 warnings
25-Oct-2026 10:12:50   /lustre/cv/sw/casa/casaci/cvpost128/bamboohome/xml-data/build-dir/PIPESPECS-TESTPIPEMAINCASAMASTER-ML228PY312TEST/casa-build-utils/pipeline/workdir/casa-6.8.0-1-pipeline-2026.3.0.38-py3.12.el8/lib/py/lib/python3.12/site-packages/casaplotms/private/plotms_pb2.py:861: DeprecationWarning: Call to deprecated create function FieldDescriptor(). Note: Create unlinked descriptors is going to go away. Please use get/find descriptors from generated code or query the descriptor_pool.
25-Oct-2026 10:12:50     _descriptor.FieldDescriptor(
25-Oct-2026 10:12:50
25-Oct-2026 10:12:50 ../casa-6.8.0-1-pipeline-2026.3.0.38-py3.12.el8/lib/py/lib/python3.12/site-packages/casaplotms/private/plotms_pb2.py:868: 12 warnings
25-Oct-2026 10:12:50   /lustre/cv/sw/casa/casaci/cvpost128/bamboohome/xml-data/build-dir/PIPESPECS-TESTPIPEMAINCASAMASTER-ML228PY312TEST/casa-build-utils/pipeline/workdir/casa-6.8.0-1-pipeline-2026.3.0.38-py3.12.el8/lib/py/lib/python3.12/site-packages/casaplotms/private/plotms_pb2.py:868: DeprecationWarning: Call to deprecated create function FieldDescriptor(). Note: Create unlinked descriptors is going to go away. Please use get/find descriptors from generated code or query the descriptor_pool.
25-Oct-2026 10:12:50     _descriptor.FieldDescriptor(
25-Oct-2026 10:12:50
25-Oct-2026 10:12:50 ../casa-6.8.0-1-pipeline-2026.3.0.38-py3.12.el8/lib/py/lib/python3.12/site-packages/casaplotms/private/plotms_pb2.py:875: 12 warnings
25-Oct-2026 10:12:50   /lustre/cv/sw/casa/casaci/cvpost128/bamboohome/xml-data/build-dir/PIPESPECS-TESTPIPEMAINCASAMASTER-ML228PY312TEST/casa-build-utils/pipeline/workdir/casa-6.8.0-1-pipeline-2026.3.0.38-py3.12.el8/lib/py/lib/python3.12/site-packages/casaplotms/private/plotms_pb2.py:875: DeprecationWarning: Call to deprecated create function FieldDescriptor(). Note: Create unlinked descriptors is going to go away. Please use get/find descriptors from generated code or query the descriptor_pool.
25-Oct-2026 10:12:50     _descriptor.FieldDescriptor(
25-Oct-2026 10:12:50
25-Oct-2026 10:12:50 ../casa-6.8.0-1-pipeline-2026.3.0.38-py3.12.el8/lib/py/lib/python3.12/site-packages/casaplotms/private/plotms_pb2.py:882: 12 warnings
25-Oct-2026 10:12:50   /lustre/cv/sw/casa/casaci/cvpost128/bamboohome/xml-data/build-dir/PIPESPECS-TESTPIPEMAINCASAMASTER-ML228PY312TEST/casa-build-utils/pipeline/workdir/casa-6.8.0-1-pipeline-2026.3.0.38-py3.12.el8/lib/py/lib/python3.12/site-packages/casaplotms/private/plotms_pb2.py:882: DeprecationWarning: Call to deprecated create function FieldDescriptor(). Note: Create unlinked descriptors is going to go away. Please use get/find descriptors from generated code or query the descriptor_pool.
25-Oct-2026 10:12:50     _descriptor.FieldDescriptor(
25-Oct-2026 10:12:50
25-Oct-2026 10:12:50 ../casa-6.8.0-1-pipeline-2026.3.0.38-py3.12.el8/lib/py/lib/python3.12/site-packages/casaplotms/private/plotms_pb2.py:889: 12 warnings
25-Oct-2026 10:12:50   /lustre/cv/sw/casa/casaci/cvpost128/bamboohome/xml-data/build-dir/PIPESPECS-TESTPIPEMAINCASAMASTER-ML228PY312TEST/casa-build-utils/pipeline/workdir/casa-6.8.0-1-pipeline-2026.3.0.38-py3.12.el8/lib/py/lib/python3.12/site-packages/casaplotms/private/plotms_pb2.py:889: DeprecationWarning: Call to deprecated create function FieldDescriptor(). Note: Create unlinked descriptors is going to go away. Please use get/find descriptors from generated code or query the descriptor_pool.
25-Oct-2026 10:12:50     _descriptor.FieldDescriptor(
25-Oct-2026 10:12:50
25-Oct-2026 10:12:50 ../casa-6.8.0-1-pipeline-2026.3.0.38-py3.12.el8/lib/py/lib/python3.12/site-packages/casaplotms/private/plotms_pb2.py:826: 12 warnings
25-Oct-2026 10:12:50   /lustre/cv/sw/casa/casaci/cvpost128/bamboohome/xml-data/build-dir/PIPESPECS-TESTPIPEMAINCASAMASTER-ML228PY312TEST/casa-build-utils/pipeline/workdir/casa-6.8.0-1-pipeline-2026.3.0.38-py3.12.el8/lib/py/lib/python3.12/site-packages/casaplotms/private/plotms_pb2.py:826: DeprecationWarning: Call to deprecated create function Descriptor(). Note: Create unlinked descriptors is going to go away. Please use get/find descriptors from generated code or query the descriptor_pool.
25-Oct-2026 10:12:50     _SETITERATE = _descriptor.Descriptor(
25-Oct-2026 10:12:50
25-Oct-2026 10:12:50 ../casa-6.8.0-1-pipeline-2026.3.0.38-py3.12.el8/lib/py/lib/python3.12/site-packages/casaplotms/private/plotms_pb2.py:920: 12 warnings
25-Oct-2026 10:12:50   /lustre/cv/sw/casa/casaci/cvpost128/bamboohome/xml-data/build-dir/PIPESPECS-TESTPIPEMAINCASAMASTER-ML228PY312TEST/casa-build-utils/pipeline/workdir/casa-6.8.0-1-pipeline-2026.3.0.38-py3.12.el8/lib/py/lib/python3.12/site-packages/casaplotms/private/plotms_pb2.py:920: DeprecationWarning: Call to deprecated create function FieldDescriptor(). Note: Create unlinked descriptors is going to go away. Please use get/find descriptors from generated code or query the descriptor_pool.
25-Oct-2026 10:12:50     _descriptor.FieldDescriptor(
25-Oct-2026 10:12:50
25-Oct-2026 10:12:50 ../casa-6.8.0-1-pipeline-2026.3.0.38-py3.12.el8/lib/py/lib/python3.12/site-packages/casaplotms/private/plotms_pb2.py:927: 12 warnings
25-Oct-2026 10:12:50   /lustre/cv/sw/casa/casaci/cvpost128/bamboohome/xml-data/build-dir/PIPESPECS-TESTPIPEMAINCASAMASTER-ML228PY312TEST/casa-build-utils/pipeline/workdir/casa-6.8.0-1-pipeline-2026.3.0.38-py3.12.el8/lib/py/lib/python3.12/site-packages/casaplotms/private/plotms_pb2.py:927: DeprecationWarning: Call to deprecated create function FieldDescriptor(). Note: Create unlinked descriptors is going to go away. Please use get/find descriptors from generated code or query the descriptor_pool.
25-Oct-2026 10:12:50     _descriptor.FieldDescriptor(
25-Oct-2026 10:12:50
25-Oct-2026 10:12:50 ../casa-6.8.0-1-pipeline-2026.3.0.38-py3.12.el8/lib/py/lib/python3.12/site-packages/casaplotms/private/plotms_pb2.py:934: 12 warnings
25-Oct-2026 10:12:50   /lustre/cv/sw/casa/casaci/cvpost128/bamboohome/xml-data/build-dir/PIPESPECS-TESTPIPEMAINCASAMASTER-ML228PY312TEST/casa-build-utils/pipeline/workdir/casa-6.8.0-1-pipeline-2026.3.0.38-py3.12.el8/lib/py/lib/python3.12/site-packages/casaplotms/private/plotms_pb2.py:934: DeprecationWarning: Call to deprecated create function FieldDescriptor(). Note: Create unlinked descriptors is going to go away. Please use get/find descriptors from generated code or query the descriptor_pool.
25-Oct-2026 10:12:50     _descriptor.FieldDescriptor(
25-Oct-2026 10:12:50
25-Oct-2026 10:12:50 ../casa-6.8.0-1-pipeline-2026.3.0.38-py3.12.el8/lib/py/lib/python3.12/site-packages/casaplotms/private/plotms_pb2.py:913: 12 warnings
25-Oct-2026 10:12:50   /lustre/cv/sw/casa/casaci/cvpost128/bamboohome/xml-data/build-dir/PIPESPECS-TESTPIPEMAINCASAMASTER-ML228PY312TEST/casa-build-utils/pipeline/workdir/casa-6.8.0-1-pipeline-2026.3.0.38-py3.12.el8/lib/py/lib/python3.12/site-packages/casaplotms/private/plotms_pb2.py:913: DeprecationWarning: Call to deprecated create function Descriptor(). Note: Create unlinked descriptors is going to go away. Please use get/find descriptors from generated code or query the descriptor_pool.
25-Oct-2026 10:12:50     _SETSTRING = _descriptor.Descriptor(
25-Oct-2026 10:12:50
25-Oct-2026 10:12:50 ../casa-6.8.0-1-pipeline-2026.3.0.38-py3.12.el8/lib/py/lib/python3.12/site-packages/casaplotms/private/plotms_pb2.py:965: 12 warnings
25-Oct-2026 10:12:50   /lustre/cv/sw/casa/casaci/cvpost128/bamboohome/xml-data/build-dir/PIPESPECS-TESTPIPEMAINCASAMASTER-ML228PY312TEST/casa-build-utils/pipeline/workdir/casa-6.8.0-1-pipeline-2026.3.0.38-py3.12.el8/lib/py/lib/python3.12/site-packages/casaplotms/private/plotms_pb2.py:965: DeprecationWarning: Call to deprecated create function FieldDescriptor(). Note: Create unlinked descriptors is going to go away. Please use get/find descriptors from generated code or query the descriptor_pool.
25-Oct-2026 10:12:50     _descriptor.FieldDescriptor(
25-Oct-2026 10:12:50
25-Oct-2026 10:12:50 ../casa-6.8.0-1-pipeline-2026.3.0.38-py3.12.el8/lib/py/lib/python3.12/site-packages/casaplotms/private/plotms_pb2.py:972: 12 warnings
25-Oct-2026 10:12:50   /lustre/cv/sw/casa/casaci/cvpost128/bamboohome/xml-data/build-dir/PIPESPECS-TESTPIPEMAINCASAMASTER-ML228PY312TEST/casa-build-utils/pipeline/workdir/casa-6.8.0-1-pipeline-2026.3.0.38-py3.12.el8/lib/py/lib/python3.12/site-packages/casaplotms/private/plotms_pb2.py:972: DeprecationWarning: Call to deprecated create function FieldDescriptor(). Note: Create unlinked descriptors is going to go away. Please use get/find descriptors from generated code or query the descriptor_pool.
25-Oct-2026 10:12:50     _descriptor.FieldDescriptor(
25-Oct-2026 10:12:50
25-Oct-2026 10:12:50 ../casa-6.8.0-1-pipeline-2026.3.0.38-py3.12.el8/lib/py/lib/python3.12/site-packages/casaplotms/private/plotms_pb2.py:979: 12 warnings
25-Oct-2026 10:12:50   /lustre/cv/sw/casa/casaci/cvpost128/bamboohome/xml-data/build-dir/PIPESPECS-TESTPIPEMAINCASAMASTER-ML228PY312TEST/casa-build-utils/pipeline/workdir/casa-6.8.0-1-pipeline-2026.3.0.38-py3.12.el8/lib/py/lib/python3.12/site-packages/casaplotms/private/plotms_pb2.py:979: DeprecationWarning: Call to deprecated create function FieldDescriptor(). Note: Create unlinked descriptors is going to go away. Please use get/find descriptors from generated code or query the descriptor_pool.
25-Oct-2026 10:12:50     _descriptor.FieldDescriptor(
25-Oct-2026 10:12:50
25-Oct-2026 10:12:50 tests/regression/fast/vla_fast_test.py::test_13A_537__calibration__PPR__regression
25-Oct-2026 10:12:50 tests/regression/fast/vla_fast_test.py::test_13A_537__restore__PPR__regression
25-Oct-2026 10:12:50   /lustre/cv/sw/casa/casaci/cvpost128/bamboohome/xml-data/build-dir/PIPESPECS-TESTPIPEMAINCASAMASTER-ML228PY312TEST/casa-build-utils/pipeline/workdir/casa-6.8.0-1-pipeline-2026.3.0.38-py3.12.el8/lib/py/lib/python3.12/multiprocessing/popen_fork.py:66: DeprecationWarning: This process (pid=3424997) is multi-threaded, use of fork() may lead to deadlocks in the child.
25-Oct-2026 10:12:50     self.pid = os.fork()
25-Oct-2026 10:12:50
25-Oct-2026 10:12:50 tests/regression/fast/alma_sd_fast_test.py::test_uid___A002_X85c183_X36f_SPW15_23__PPR__regression
25-Oct-2026 10:12:50 tests/regression/fast/nobeyama_sd_fast_test.py::test_mg2_20170525142607_180419__procedure_hsdn_calimage__regression
25-Oct-2026 10:12:50   /lustre/cv/sw/casa/casaci/cvpost128/bamboohome/xml-data/build-dir/PIPESPECS-TESTPIPEMAINCASAMASTER-ML228PY312TEST/casa-build-utils/pipeline/workdir/casa-6.8.0-1-pipeline-2026.3.0.38-py3.12.el8/lib/py/lib/python3.12/multiprocessing/popen_fork.py:66: DeprecationWarning: This process (pid=3424993) is multi-threaded, use of fork() may lead to deadlocks in the child.
25-Oct-2026 10:12:50     self.pid = os.fork()
25-Oct-2026 10:12:50
25-Oct-2026 10:12:50 tests/regression/fast/alma_if_fast_test.py::test_uid___A002_Xc46ab2_X15ae_repSPW_spw16_17_small__PPR__regression
25-Oct-2026 10:12:50   /lustre/cv/sw/casa/casaci/cvpost128/bamboohome/xml-data/build-dir/PIPESPECS-TESTPIPEMAINCASAMASTER-ML228PY312TEST/casa-build-utils/pipeline/workdir/casa-6.8.0-1-pipeline-2026.3.0.38-py3.12.el8/lib/py/lib/python3.12/multiprocessing/popen_fork.py:66: DeprecationWarning: This process (pid=3425030) is multi-threaded, use of fork() may lead to deadlocks in the child.
25-Oct-2026 10:12:50     self.pid = os.fork()
25-Oct-2026 10:12:50
25-Oct-2026 10:12:50 tests/regression/fast/nobeyama_sd_fast_test.py::test_mg2_20170525142607_180419__PPR__regression
25-Oct-2026 10:12:50 tests/regression/fast/vla_fast_test.py::test_13A_537__procedure_hifv__regression
25-Oct-2026 10:12:50   /lustre/cv/sw/casa/casaci/cvpost128/bamboohome/xml-data/build-dir/PIPESPECS-TESTPIPEMAINCASAMASTER-ML228PY312TEST/casa-build-utils/pipeline/workdir/casa-6.8.0-1-pipeline-2026.3.0.38-py3.12.el8/lib/py/lib/python3.12/multiprocessing/popen_fork.py:66: DeprecationWarning: This process (pid=3424981) is multi-threaded, use of fork() may lead to deadlocks in the child.
25-Oct-2026 10:12:50     self.pid = os.fork()
25-Oct-2026 10:12:50
25-Oct-2026 10:12:50 tests/regression/fast/alma_if_fast_test.py::test_uid___A002_Xc46ab2_X15ae__selfcal_restore_procedure_hifa_image__regression
25-Oct-2026 10:12:50   /lustre/cv/sw/casa/casaci/cvpost128/bamboohome/xml-data/build-dir/PIPESPECS-TESTPIPEMAINCASAMASTER-ML228PY312TEST/casa-build-utils/pipeline/workdir/casa-6.8.0-1-pipeline-2026.3.0.38-py3.12.el8/lib/py/lib/python3.12/multiprocessing/popen_fork.py:66: DeprecationWarning: This process (pid=3424973) is multi-threaded, use of fork() may lead to deadlocks in the child.
25-Oct-2026 10:12:50     self.pid = os.fork()
25-Oct-2026 10:12:50
25-Oct-2026 10:12:50 tests/regression/fast/alma_if_fast_test.py::test_uid___A002_Xef72bb_X9d29__renorm_restore_procedure_hifa_image__regression
25-Oct-2026 10:12:50   /lustre/cv/sw/casa/casaci/cvpost128/bamboohome/xml-data/build-dir/PIPESPECS-TESTPIPEMAINCASAMASTER-ML228PY312TEST/casa-build-utils/pipeline/workdir/casa-6.8.0-1-pipeline-2026.3.0.38-py3.12.el8/lib/py/lib/python3.12/multiprocessing/popen_fork.py:66: DeprecationWarning: This process (pid=3425006) is multi-threaded, use of fork() may lead to deadlocks in the child.
25-Oct-2026 10:12:50     self.pid = os.fork()
25-Oct-2026 10:12:50
25-Oct-2026 10:12:50 tests/regression/fast/alma_if_fast_test.py::test_E2E6_1_00010_S__uid___A002_Xd0a588_X2239__procedure_hifa_image__regression
25-Oct-2026 10:12:50 tests/regression/fast/alma_if_fast_test.py::test_csv_3899_eb2_small__procedure_hifa_calimage__regression
25-Oct-2026 10:12:50   /lustre/cv/sw/casa/casaci/cvpost128/bamboohome/xml-data/build-dir/PIPESPECS-TESTPIPEMAINCASAMASTER-ML228PY312TEST/casa-build-utils/pipeline/workdir/casa-6.8.0-1-pipeline-2026.3.0.38-py3.12.el8/lib/py/lib/python3.12/multiprocessing/popen_fork.py:66: DeprecationWarning: This process (pid=3424969) is multi-threaded, use of fork() may lead to deadlocks in the child.
25-Oct-2026 10:12:50     self.pid = os.fork()
25-Oct-2026 10:12:50
25-Oct-2026 10:12:50 tests/regression/fast/alma_if_fast_test.py::test_uid___A002_Xc845c0_X7366__cycle5_restore_procedure_hifa_image__regression
25-Oct-2026 10:12:50   /lustre/cv/sw/casa/casaci/cvpost128/bamboohome/xml-data/build-dir/PIPESPECS-TESTPIPEMAINCASAMASTER-ML228PY312TEST/casa-build-utils/pipeline/workdir/casa-6.8.0-1-pipeline-2026.3.0.38-py3.12.el8/lib/py/lib/python3.12/multiprocessing/popen_fork.py:66: DeprecationWarning: This process (pid=3424989) is multi-threaded, use of fork() may lead to deadlocks in the child.
25-Oct-2026 10:12:50     self.pid = os.fork()
25-Oct-2026 10:12:50
25-Oct-2026 10:12:50 tests/regression/fast/alma_if_fast_test.py::test_uid___A002_Xee1eb6_Xc58d__procedure_hifa_calsurvey__regression
25-Oct-2026 10:12:50 tests/regression/fast/alma_sd_fast_test.py::test_uid___A002_X85c183_X36f__procedure_hsd_calimage__regression
25-Oct-2026 10:12:50   /lustre/cv/sw/casa/casaci/cvpost128/bamboohome/xml-data/build-dir/PIPESPECS-TESTPIPEMAINCASAMASTER-ML228PY312TEST/casa-build-utils/pipeline/workdir/casa-6.8.0-1-pipeline-2026.3.0.38-py3.12.el8/lib/py/lib/python3.12/multiprocessing/popen_fork.py:66: DeprecationWarning: This process (pid=3424985) is multi-threaded, use of fork() may lead to deadlocks in the child.
25-Oct-2026 10:12:50     self.pid = os.fork()
25-Oct-2026 10:12:50
25-Oct-2026 10:12:50 tests/regression/fast/vla_fast_test.py::test_13A_537__restore__cont_cube_selfcal__regression
25-Oct-2026 10:12:50 tests/regression/fast/vlass_fast_test.py::test_TSKY0001__vlass_quicklook_regression
25-Oct-2026 10:12:50   /lustre/cv/sw/casa/casaci/cvpost128/bamboohome/xml-data/build-dir/PIPESPECS-TESTPIPEMAINCASAMASTER-ML228PY312TEST/casa-build-utils/pipeline/workdir/casa-6.8.0-1-pipeline-2026.3.0.38-py3.12.el8/lib/py/lib/python3.12/multiprocessing/popen_fork.py:66: DeprecationWarning: This process (pid=3424977) is multi-threaded, use of fork() may lead to deadlocks in the child.
25-Oct-2026 10:12:50     self.pid = os.fork()
25-Oct-2026 10:12:50
25-Oct-2026 10:12:50 tests/regression/fast/alma_if_fast_test.py::test_2022_1_00207_S__uid___A001_X2d20_X373d__PPR__regression
25-Oct-2026 10:12:50   /lustre/cv/sw/casa/casaci/cvpost128/bamboohome/xml-data/build-dir/PIPESPECS-TESTPIPEMAINCASAMASTER-ML228PY312TEST/casa-build-utils/pipeline/workdir/casa-6.8.0-1-pipeline-2026.3.0.38-py3.12.el8/lib/py/lib/python3.12/multiprocessing/popen_fork.py:66: DeprecationWarning: This process (pid=3425001) is multi-threaded, use of fork() may lead to deadlocks in the child.
25-Oct-2026 10:12:50     self.pid = os.fork()
25-Oct-2026 10:12:50
25-Oct-2026 10:12:50 tests/regression/fast/alma_if_fast_test.py::test_2023_1_00228_S__uid___A002_X1199f9e_X7c24__procedure_hifa_calimage_diffgain__regression
25-Oct-2026 10:12:50   /lustre/cv/sw/casa/casaci/cvpost128/bamboohome/xml-data/build-dir/PIPESPECS-TESTPIPEMAINCASAMASTER-ML228PY312TEST/casa-build-utils/pipeline/workdir/casa-6.8.0-1-pipeline-2026.3.0.38-py3.12.el8/lib/py/lib/python3.12/multiprocessing/popen_fork.py:66: DeprecationWarning: This process (pid=3425010) is multi-threaded, use of fork() may lead to deadlocks in the child.
25-Oct-2026 10:12:50     self.pid = os.fork()
25-Oct-2026 10:12:50
25-Oct-2026 10:12:50 -- Docs: https://docs.pytest.org/en/stable/how-to/capture-warnings.html
25-Oct-2026 10:12:50 - generated xml file: /lustre/cv/sw/casa/casaci/cvpost128/bamboohome/xml-data/build-dir/PIPESPECS-TESTPIPEMAINCASAMASTER-ML228PY312TEST/casa-build-utils/pipeline/workdir/pipeline_regression_test_result.xml -
25-Oct-2026 10:12:50 =========================== short test summary info ============================
25-Oct-2026 10:12:50 FAILED tests/regression/fast/vla_fast_test.py::test_13A_537__calibration__PPR__regression - def test_13A_537__calibration__PPR__regression():
25-Oct-2026 10:12:50         """Run VLA calibration regression with a PPR file.
25-Oct-2026 10:12:50    
25-Oct-2026 10:12:50         PPR name:                   PPR_13A-537.xml
25-Oct-2026 10:12:50         Dataset:                    13A-537/13A-537.sb24066356.eb24324502.56514.05971091435
25-Oct-2026 10:12:50         """
25-Oct-2026 10:12:50         ref_directory = 'pl-regressiontest/13A-537'
25-Oct-2026 10:12:50    
25-Oct-2026 10:12:50         pt = PipelineTester(
25-Oct-2026 10:12:50             visname=['13A-537.sb24066356.eb24324502.56514.05971091435'],
25-Oct-2026 10:12:50             ppr=f'{ref_directory}/PPR_13A-537.xml',
25-Oct-2026 10:12:50             input_dir=ref_directory,
25-Oct-2026 10:12:50             output_dir='13A_537__calibration__PPR__regression',
25-Oct-2026 10:12:50             expectedoutput_dir=ref_directory,
25-Oct-2026 10:12:50             )
25-Oct-2026 10:12:50    
25-Oct-2026 10:12:50 >       pt.run(telescope='vla', omp_num_threads=1)
25-Oct-2026 10:12:50
25-Oct-2026 10:12:50 tests/regression/fast/vla_fast_test.py:44:
25-Oct-2026 10:12:50 _ _ _ _ _ _ _ _ _ _ _ _ _ _ _ _ _ _ _ _ _ _ _ _ _ _ _ _ _ _ _ _ _ _ _ _ _ _ _ _
25-Oct-2026 10:12:50 tests/testing_utils.py:356: in run
25-Oct-2026 10:12:50     self.__do_sanity_checks(context)
25-Oct-2026 10:12:50 _ _ _ _ _ _ _ _ _ _ _ _ _ _ _ _ _ _ _ _ _ _ _ _ _ _ _ _ _ _ _ _ _ _ _ _ _ _ _ _
25-Oct-2026 10:12:50
25-Oct-2026 10:12:50 self = <tests.testing_utils.PipelineTester object at 0x7f866f7c5d90>
25-Oct-2026 10:12:50 context = <Context(name='pipeline-20261025T003524')>
25-Oct-2026 10:12:50
25-Oct-2026 10:12:50     def __do_sanity_checks(self, context: Context):
25-Oct-2026 10:12:50         """
25-Oct-2026 10:12:50         Do the following sanity-checks on the pipeline run
25-Oct-2026 10:12:50    
25-Oct-2026 10:12:50         1. rawdata, working, products directories are present
25-Oct-2026 10:12:50         2. Non-existence of errorexit-*.txt in working directory
25-Oct-2026 10:12:50         3. *pipeline_manifest.xml is present under the products directory (regression mode only)
25-Oct-2026 10:12:50         4. No weblog rendering failures
25-Oct-2026 10:12:50    
25-Oct-2026 10:12:50         Args:
25-Oct-2026 10:12:50             context: Pipeline context object from the current run.
25-Oct-2026 10:12:50         """
25-Oct-2026 10:12:50    
25-Oct-2026 10:12:50         # 1. rawdata, working, products directories are present
25-Oct-2026 10:12:50         # The rawdata directory is only present for PPR runs
25-Oct-2026 10:12:50         missing_directories = regression.missing_directories(context, include_rawdata=self.ppr)
25-Oct-2026 10:12:50         if len(missing_directories) > 0:
25-Oct-2026 10:12:50             msg = f"The following directories are missing from the pipeline run: {', '.join(missing_directories)}"
25-Oct-2026 10:12:50             LOG.warning(msg)
25-Oct-2026 10:12:50             pytest.fail(msg)
25-Oct-2026 10:12:50    
25-Oct-2026 10:12:50         # 2. Non-existence of errorexit-*.txt in working directory
25-Oct-2026 10:12:50         if regression.errorexit_present(context):
25-Oct-2026 10:12:50             msg = "errorexit-*.txt is present in working directory"
25-Oct-2026 10:12:50             LOG.warning(msg)
25-Oct-2026 10:12:50             pytest.fail(msg)
25-Oct-2026 10:12:50    
25-Oct-2026 10:12:50         # 3. *pipeline_manifest.xml is present under the products directory; regression mode only
25-Oct-2026 10:12:50         if self.mode == 'regression':
25-Oct-2026 10:12:50             if not regression.manifest_present(context):
25-Oct-2026 10:12:50                 msg = "pipeline_manifest.xml is not present under the products directory"
25-Oct-2026 10:12:50                 LOG.warning(msg)
25-Oct-2026 10:12:50 >               pytest.fail(msg)
25-Oct-2026 10:12:50 E               Failed: pipeline_manifest.xml is not present under the products directory
25-Oct-2026 10:12:50
25-Oct-2026 10:12:50 tests/testing_utils.py:498: Failed
25-Oct-2026 10:12:50 FAILED tests/regression/fast/alma_if_fast_test.py::test_E2E6_1_00010_S__uid___A002_Xd0a588_X2239__procedure_hifa_image__regression - @pytest.mark.twelve
25-Oct-2026 10:12:50     def test_E2E6_1_00010_S__uid___A002_Xd0a588_X2239__procedure_hifa_image__regression():
25-Oct-2026 10:12:50         """Run ALMA cal+image regression on a 12m moderate-size test dataset in ASDM.
25-Oct-2026 10:12:50    
25-Oct-2026 10:12:50         Recipe name:                procedure_hifa_calimage
25-Oct-2026 10:12:50         Dataset:                    E2E6.1.00010.S: uid___A002_Xd0a588_X2239
25-Oct-2026 10:12:50         """
25-Oct-2026 10:12:50         ref_directory = 'pl-regressiontest/E2E6.1.00010.S'
25-Oct-2026 10:12:50    
25-Oct-2026 10:12:50         pt = PipelineTester(
25-Oct-2026 10:12:50             visname=['uid___A002_Xd0a588_X2239'],
25-Oct-2026 10:12:50             recipe='procedure_hifa_calimage.xml',
25-Oct-2026 10:12:50             input_dir=ref_directory,
25-Oct-2026 10:12:50             expectedoutput_dir=ref_directory,
25-Oct-2026 10:12:50         )
25-Oct-2026 10:12:50    
25-Oct-2026 10:12:50 >       pt.run()
25-Oct-2026 10:12:50
25-Oct-2026 10:12:50 tests/regression/fast/alma_if_fast_test.py:162:
25-Oct-2026 10:12:50 _ _ _ _ _ _ _ _ _ _ _ _ _ _ _ _ _ _ _ _ _ _ _ _ _ _ _ _ _ _ _ _ _ _ _ _ _ _ _ _
25-Oct-2026 10:12:50 tests/testing_utils.py:381: in run
25-Oct-2026 10:12:50     self.__compare_results(new_file, default_relative_tolerance)
25-Oct-2026 10:12:50 _ _ _ _ _ _ _ _ _ _ _ _ _ _ _ _ _ _ _ _ _ _ _ _ _ _ _ _ _ _ _ _ _ _ _ _ _ _ _ _
25-Oct-2026 10:12:50
25-Oct-2026 10:12:50 self = <tests.testing_utils.PipelineTester object at 0x7f043defc4d0>
25-Oct-2026 10:12:50 new_file = 'uid___A002_Xd0a588_X2239.NEW.results.txt'
25-Oct-2026 10:12:50 relative_tolerance = 1e-07
25-Oct-2026 10:12:50
25-Oct-2026 10:12:50     def __compare_results(self, new_file: str, relative_tolerance: float) -> None:
25-Oct-2026 10:12:50         """
25-Oct-2026 10:12:50         Compare results between new one loaded from file and old one.
25-Oct-2026 10:12:50    
25-Oct-2026 10:12:50         Args:
25-Oct-2026 10:12:50             new_file : file path of new results
25-Oct-2026 10:12:50             relative_tolerance : relative tolerance of output value
25-Oct-2026 10:12:50         """
25-Oct-2026 10:12:50         with open(self.expectedoutput_file) as expected_fd, open(new_file) as new_fd:
25-Oct-2026 10:12:50             expected_results = expected_fd.readlines()
25-Oct-2026 10:12:50             new_results = new_fd.readlines()
25-Oct-2026 10:12:50             errors = []
25-Oct-2026 10:12:50             worst_diff = (0, 0)
25-Oct-2026 10:12:50             worst_percent_diff = (0, 0)
25-Oct-2026 10:12:50             for old, new in zip(expected_results, new_results):
25-Oct-2026 10:12:50                 try:
25-Oct-2026 10:12:50                     oldkey, oldval, tol = self.__sanitize_results_string(old)
25-Oct-2026 10:12:50                     newkey, newval, _ = self.__sanitize_results_string(new)
25-Oct-2026 10:12:50                 except ValueError as e:
25-Oct-2026 10:12:50                     errorstr = "The results: {0} could not be parsed. Error: {1}".format(new, str(e))
25-Oct-2026 10:12:50                     errors.append(errorstr)
25-Oct-2026 10:12:50                     continue
25-Oct-2026 10:12:50    
25-Oct-2026 10:12:50                 assert oldkey == newkey, f"Expected key {oldkey} does not match new key {newkey}."
25-Oct-2026 10:12:50                 tolerance = tol if tol else relative_tolerance
25-Oct-2026 10:12:50                 if newval is not None:
25-Oct-2026 10:12:50                     LOG.info('Comparing %s to %s with a rel. tolerance of %s', oldval, newval, tolerance)
25-Oct-2026 10:12:50                     if oldval != pytest.approx(newval, rel=tolerance):
25-Oct-2026 10:12:50                         diff = oldval-newval
25-Oct-2026 10:12:50                         percent_diff = (oldval-newval)/oldval * 100 if oldval != 0 else 100
25-Oct-2026 10:12:50                         if abs(diff) > abs(worst_diff[0]):
25-Oct-2026 10:12:50                             worst_diff = diff, oldkey
25-Oct-2026 10:12:50                         if abs(percent_diff) > abs(worst_percent_diff[0]):
25-Oct-2026 10:12:50                             worst_percent_diff = percent_diff, oldkey
25-Oct-2026 10:12:50                         errorstr = f"{oldkey}\n\tvalues differ by > a relative difference of {tolerance}\n\texpected: {oldval}\n\tnew:      {newval}\n\tdiff: {diff}\n\tpercent_diff: {percent_diff}%"
25-Oct-2026 10:12:50                         errors.append(errorstr)
25-Oct-2026 10:12:50                 elif oldval is not None:
25-Oct-2026 10:12:50                     # If only the new value is None, fail
25-Oct-2026 10:12:50                     errorstr = f"{oldkey}\n\tvalue is None\n\texpected: {oldval}\n\tnew:      {newval}"
25-Oct-2026 10:12:50                     errors.append(errorstr)
25-Oct-2026 10:12:50                 else:
25-Oct-2026 10:12:50                     # If old and new values are both None, this is expected, so pass
25-Oct-2026 10:12:50                     LOG.info('Comparing %s and %s... both values are None.', oldval, newval)
25-Oct-2026 10:12:50    
25-Oct-2026 10:12:50             [LOG.warning(x) for x in errors]
25-Oct-2026 10:12:50             n_errors = len(errors)
25-Oct-2026 10:12:50             if n_errors > 0:
25-Oct-2026 10:12:50                 summary_str = f"Worst absolute diff, {worst_diff[1]}: {worst_diff[0]}\nWorst percentage diff, {worst_percent_diff[1]}: {worst_percent_diff[0]}%"
25-Oct-2026 10:12:50                 errors.append(summary_str)
25-Oct-2026 10:12:50 >               pytest.fail("Failed to match {0} result value{1} within tolerance{1} :\n{2}".format(
25-Oct-2026 10:12:50                     n_errors, '' if n_errors == 1 else 's', '\n'.join(errors)), pytrace=True)
25-Oct-2026 10:12:50 E               Failed: Failed to match 6 result values within tolerances :
25-Oct-2026 10:12:50 E               s17.hifa_gfluxscale.uid___A002_Xd0a588_X2239.field_0.spw_14.qa.metric.score_gfluxscale_amp_time_variation
25-Oct-2026 10:12:50 E                       values differ by > a relative difference of 1e-07
25-Oct-2026 10:12:50 E                       expected: 1.9390070410307714
25-Oct-2026 10:12:50 E                       new:      1.9390077167919766
25-Oct-2026 10:12:50 E                       diff: -6.757612052155082e-07
25-Oct-2026 10:12:50 E                       percent_diff: -3.4850889703643116e-05%
25-Oct-2026 10:12:50 E               s17.hifa_gfluxscale.uid___A002_Xd0a588_X2239.field_1.spw_14.I
25-Oct-2026 10:12:50 E                       values differ by > a relative difference of 1e-07
25-Oct-2026 10:12:50 E                       expected: 0.5017564867171079
25-Oct-2026 10:12:50 E                       new:      0.5017594399826114
25-Oct-2026 10:12:50 E                       diff: -2.9532655034802957e-06
25-Oct-2026 10:12:50 E                       percent_diff: -0.0005885854157667038%
25-Oct-2026 10:12:50 E               s17.hifa_gfluxscale.uid___A002_Xd0a588_X2239.field_2.spw_14.I
25-Oct-2026 10:12:50 E                       values differ by > a relative difference of 1e-07
25-Oct-2026 10:12:50 E                       expected: 0.16244485548598875
25-Oct-2026 10:12:50 E                       new:      0.1624421145945484
25-Oct-2026 10:12:50 E                       diff: 2.740891440339288e-06
25-Oct-2026 10:12:50 E                       percent_diff: 0.0016872750030398449%
25-Oct-2026 10:12:50 E               s17.hifa_gfluxscale.uid___A002_Xd0a588_X2239.qa.metric.score_derived_fluxes_snr
25-Oct-2026 10:12:50 E                       values differ by > a relative difference of 1e-07
25-Oct-2026 10:12:50 E                       expected: 184.08359129153104
25-Oct-2026 10:12:50 E                       new:      184.08400077411397
25-Oct-2026 10:12:50 E                       diff: -0.0004094825829383808
25-Oct-2026 10:12:50 E                       percent_diff: -0.00022244382569106227%
25-Oct-2026 10:12:50 E               s21.hif_applycal.uid___A002_Xd0a588_X2239.spw_14.qa.metric.gt90deg_offset_phase_vs_freqintercept
25-Oct-2026 10:12:50 E                       values differ by > a relative difference of 1e-07
25-Oct-2026 10:12:50 E                       expected: -95.10462209180606
25-Oct-2026 10:12:50 E                       new:      -95.10436168021985
25-Oct-2026 10:12:50 E                       diff: -0.00026041158621126215
25-Oct-2026 10:12:50 E                       percent_diff: 0.00027381590976712205%
25-Oct-2026 10:12:50 E               s21.hif_applycal.uid___A002_Xd0a588_X2239.spw_14.qa.metric.phase_vs_freqintercept
25-Oct-2026 10:12:50 E                       values differ by > a relative difference of 1e-07
25-Oct-2026 10:12:50 E                       expected: -60.75311758869651
25-Oct-2026 10:12:50 E                       new:      -60.753007921244205
25-Oct-2026 10:12:50 E                       diff: -0.00010966745230689412
25-Oct-2026 10:12:50 E                       percent_diff: 0.00018051329159657548%
25-Oct-2026 10:12:50 E               Worst absolute diff, s17.hifa_gfluxscale.uid___A002_Xd0a588_X2239.qa.metric.score_derived_fluxes_snr: -0.0004094825829383808
25-Oct-2026 10:12:50 E               Worst percentage diff, s17.hifa_gfluxscale.uid___A002_Xd0a588_X2239.field_2.spw_14.I: 0.0016872750030398449%
25-Oct-2026 10:12:50
25-Oct-2026 10:12:50 tests/testing_utils.py:440: Failed
25-Oct-2026 10:12:50 FAILED tests/regression/fast/alma_if_fast_test.py::test_uid___A002_Xee1eb6_Xc58d__procedure_hifa_calsurvey__regression - @pytest.mark.twelve
25-Oct-2026 10:12:50     def test_uid___A002_Xee1eb6_Xc58d__procedure_hifa_calsurvey__regression():
25-Oct-2026 10:12:50         """Run ALMA cal+survey regression on a calibration survey test dataset.
25-Oct-2026 10:12:50    
25-Oct-2026 10:12:50         Recipe name:                procedure_hifa_calsurvey
25-Oct-2026 10:12:50         Dataset:                    uid___A002_Xee1eb6_Xc58d
25-Oct-2026 10:12:50         """
25-Oct-2026 10:12:50         ref_directory = 'pl-regressiontest/uid___A002_Xee1eb6_Xc58d_calsurvey'
25-Oct-2026 10:12:50    
25-Oct-2026 10:12:50         pt = PipelineTester(
25-Oct-2026 10:12:50             visname=['uid___A002_Xee1eb6_Xc58d'],
25-Oct-2026 10:12:50             recipe='procedure_hifa_calsurvey.xml',
25-Oct-2026 10:12:50             input_dir=ref_directory,
25-Oct-2026 10:12:50             expectedoutput_dir=ref_directory,
25-Oct-2026 10:12:50         )
25-Oct-2026 10:12:50    
25-Oct-2026 10:12:50 >       pt.run()
25-Oct-2026 10:12:50
25-Oct-2026 10:12:50 tests/regression/fast/alma_if_fast_test.py:200:
25-Oct-2026 10:12:50 _ _ _ _ _ _ _ _ _ _ _ _ _ _ _ _ _ _ _ _ _ _ _ _ _ _ _ _ _ _ _ _ _ _ _ _ _ _ _ _
25-Oct-2026 10:12:50 tests/testing_utils.py:381: in run
25-Oct-2026 10:12:50     self.__compare_results(new_file, default_relative_tolerance)
25-Oct-2026 10:12:50 _ _ _ _ _ _ _ _ _ _ _ _ _ _ _ _ _ _ _ _ _ _ _ _ _ _ _ _ _ _ _ _ _ _ _ _ _ _ _ _
25-Oct-2026 10:12:50
25-Oct-2026 10:12:50 self = <tests.testing_utils.PipelineTester object at 0x7fefbd25a000>
25-Oct-2026 10:12:50 new_file = 'uid___A002_Xee1eb6_Xc58d.NEW.results.txt'
25-Oct-2026 10:12:50 relative_tolerance = 1e-07
25-Oct-2026 10:12:50
25-Oct-2026 10:12:50     def __compare_results(self, new_file: str, relative_tolerance: float) -> None:
25-Oct-2026 10:12:50         """
25-Oct-2026 10:12:50         Compare results between new one loaded from file and old one.
25-Oct-2026 10:12:50    
25-Oct-2026 10:12:50         Args:
25-Oct-2026 10:12:50             new_file : file path of new results
25-Oct-2026 10:12:50             relative_tolerance : relative tolerance of output value
25-Oct-2026 10:12:50         """
25-Oct-2026 10:12:50         with open(self.expectedoutput_file) as expected_fd, open(new_file) as new_fd:
25-Oct-2026 10:12:50             expected_results = expected_fd.readlines()
25-Oct-2026 10:12:50             new_results = new_fd.readlines()
25-Oct-2026 10:12:50             errors = []
25-Oct-2026 10:12:50             worst_diff = (0, 0)
25-Oct-2026 10:12:50             worst_percent_diff = (0, 0)
25-Oct-2026 10:12:50             for old, new in zip(expected_results, new_results):
25-Oct-2026 10:12:50                 try:
25-Oct-2026 10:12:50                     oldkey, oldval, tol = self.__sanitize_results_string(old)
25-Oct-2026 10:12:50                     newkey, newval, _ = self.__sanitize_results_string(new)
25-Oct-2026 10:12:50                 except ValueError as e:
25-Oct-2026 10:12:50                     errorstr = "The results: {0} could not be parsed. Error: {1}".format(new, str(e))
25-Oct-2026 10:12:50                     errors.append(errorstr)
25-Oct-2026 10:12:50                     continue
25-Oct-2026 10:12:50    
25-Oct-2026 10:12:50                 assert oldkey == newkey, f"Expected key {oldkey} does not match new key {newkey}."
25-Oct-2026 10:12:50                 tolerance = tol if tol else relative_tolerance
25-Oct-2026 10:12:50                 if newval is not None:
25-Oct-2026 10:12:50                     LOG.info('Comparing %s to %s with a rel. tolerance of %s', oldval, newval, tolerance)
25-Oct-2026 10:12:50                     if oldval != pytest.approx(newval, rel=tolerance):
25-Oct-2026 10:12:50                         diff = oldval-newval
25-Oct-2026 10:12:50                         percent_diff = (oldval-newval)/oldval * 100 if oldval != 0 else 100
25-Oct-2026 10:12:50                         if abs(diff) > abs(worst_diff[0]):
25-Oct-2026 10:12:50                             worst_diff = diff, oldkey
25-Oct-2026 10:12:50                         if abs(percent_diff) > abs(worst_percent_diff[0]):
25-Oct-2026 10:12:50                             worst_percent_diff = percent_diff, oldkey
25-Oct-2026 10:12:50                         errorstr = f"{oldkey}\n\tvalues differ by > a relative difference of {tolerance}\n\texpected: {oldval}\n\tnew:      {newval}\n\tdiff: {diff}\n\tpercent_diff: {percent_diff}%"
25-Oct-2026 10:12:50                         errors.append(errorstr)
25-Oct-2026 10:12:50                 elif oldval is not None:
25-Oct-2026 10:12:50                     # If only the new value is None, fail
25-Oct-2026 10:12:50                     errorstr = f"{oldkey}\n\tvalue is None\n\texpected: {oldval}\n\tnew:      {newval}"
25-Oct-2026 10:12:50                     errors.append(errorstr)
25-Oct-2026 10:12:50                 else:
25-Oct-2026 10:12:50                     # If old and new values are both None, this is expected, so pass
25-Oct-2026 10:12:50                     LOG.info('Comparing %s and %s... both values are None.', oldval, newval)
25-Oct-2026 10:12:50    
25-Oct-2026 10:12:50             [LOG.warning(x) for x in errors]
25-Oct-2026 10:12:50             n_errors = len(errors)
25-Oct-2026 10:12:50             if n_errors > 0:
25-Oct-2026 10:12:50                 summary_str = f"Worst absolute diff, {worst_diff[1]}: {worst_diff[0]}\nWorst percentage diff, {worst_percent_diff[1]}: {worst_percent_diff[0]}%"
25-Oct-2026 10:12:50                 errors.append(summary_str)
25-Oct-2026 10:12:50 >               pytest.fail("Failed to match {0} result value{1} within tolerance{1} :\n{2}".format(
25-Oct-2026 10:12:50                     n_errors, '' if n_errors == 1 else 's', '\n'.join(errors)), pytrace=True)
25-Oct-2026 10:12:50 E               Failed: Failed to match 24 result values within tolerances :
25-Oct-2026 10:12:50 E               s16.hifa_gfluxscale.uid___A002_Xee1eb6_Xc58d.field_0.spw_16.I
25-Oct-2026 10:12:50 E                       values differ by > a relative difference of 1e-07
25-Oct-2026 10:12:50 E                       expected: 6.43684975993458
25-Oct-2026 10:12:50 E                       new:      6.436848875389339
25-Oct-2026 10:12:50 E                       diff: 8.845452406092136e-07
25-Oct-2026 10:12:50 E                       percent_diff: 1.3741896635757482e-05%
25-Oct-2026 10:12:50 E               s16.hifa_gfluxscale.uid___A002_Xee1eb6_Xc58d.field_0.spw_16.qa.metric.score_gfluxscale_k_spw
25-Oct-2026 10:12:50 E                       values differ by > a relative difference of 1e-07
25-Oct-2026 10:12:50 E                       expected: 0.9953313961364421
25-Oct-2026 10:12:50 E                       new:      0.9953312593590304
25-Oct-2026 10:12:50 E                       diff: 1.3677741161899348e-07
25-Oct-2026 10:12:50 E                       percent_diff: 1.374189663361566e-05%
25-Oct-2026 10:12:50 E               s16.hifa_gfluxscale.uid___A002_Xee1eb6_Xc58d.field_11.spw_16.I
25-Oct-2026 10:12:50 E                       values differ by > a relative difference of 1e-07
25-Oct-2026 10:12:50 E                       expected: 1.3163406759943754
25-Oct-2026 10:12:50 E                       new:      1.3163409971063522
25-Oct-2026 10:12:50 E                       diff: -3.211119767865256e-07
25-Oct-2026 10:12:50 E                       percent_diff: -2.439429113165972e-05%
25-Oct-2026 10:12:50 E               s16.hifa_gfluxscale.uid___A002_Xee1eb6_Xc58d.field_11.spw_16.qa.metric.score_gfluxscale_k_spw
25-Oct-2026 10:12:50 E                       values differ by > a relative difference of 1e-07
25-Oct-2026 10:12:50 E                       expected: 0.9990967728871843
25-Oct-2026 10:12:50 E                       new:      0.9990970166097599
25-Oct-2026 10:12:50 E                       diff: -2.43722575565819e-07
25-Oct-2026 10:12:50 E                       percent_diff: -2.4394291141739037e-05%
25-Oct-2026 10:12:50 E               s16.hifa_gfluxscale.uid___A002_Xee1eb6_Xc58d.field_12.spw_16.I
25-Oct-2026 10:12:50 E                       values differ by > a relative difference of 1e-07
25-Oct-2026 10:12:50 E                       expected: 2.0904035735200677
25-Oct-2026 10:12:50 E                       new:      2.090402854949724
25-Oct-2026 10:12:50 E                       diff: 7.185703436718427e-07
25-Oct-2026 10:12:50 E                       percent_diff: 3.4374718488537085e-05%
25-Oct-2026 10:12:50 E               s16.hifa_gfluxscale.uid___A002_Xee1eb6_Xc58d.field_12.spw_16.qa.metric.score_gfluxscale_k_spw
25-Oct-2026 10:12:50 E                       values differ by > a relative difference of 1e-07
25-Oct-2026 10:12:50 E                       expected: 0.9980266603871862
25-Oct-2026 10:12:50 E                       new:      0.9980263173183314
25-Oct-2026 10:12:50 E                       diff: 3.4306885488000205e-07
25-Oct-2026 10:12:50 E                       percent_diff: 3.437471848165939e-05%
25-Oct-2026 10:12:50 E               s16.hifa_gfluxscale.uid___A002_Xee1eb6_Xc58d.field_13.spw_16.I
25-Oct-2026 10:12:50 E                       values differ by > a relative difference of 1e-07
25-Oct-2026 10:12:50 E                       expected: 3.8784434661073814
25-Oct-2026 10:12:50 E                       new:      3.878444610019205
25-Oct-2026 10:12:50 E                       diff: -1.1439118234868317e-06
25-Oct-2026 10:12:50 E                       percent_diff: -2.9494095594873386e-05%
25-Oct-2026 10:12:50 E               s16.hifa_gfluxscale.uid___A002_Xee1eb6_Xc58d.field_13.spw_16.qa.metric.score_gfluxscale_k_spw
25-Oct-2026 10:12:50 E                       values differ by > a relative difference of 1e-07
25-Oct-2026 10:12:50 E                       expected: 0.9938201645088008
25-Oct-2026 10:12:50 E                       new:      0.9938204576270702
25-Oct-2026 10:12:50 E                       diff: -2.931182693233225e-07
25-Oct-2026 10:12:50 E                       percent_diff: -2.9494095591046623e-05%
25-Oct-2026 10:12:50 E               s16.hifa_gfluxscale.uid___A002_Xee1eb6_Xc58d.field_16.spw_16.I
25-Oct-2026 10:12:50 E                       values differ by > a relative difference of 1e-07
25-Oct-2026 10:12:50 E                       expected: 1.2906203396900693
25-Oct-2026 10:12:50 E                       new:      1.2906201504155397
25-Oct-2026 10:12:50 E                       diff: 1.8927452960504354e-07
25-Oct-2026 10:12:50 E                       percent_diff: 1.4665391810770324e-05%
25-Oct-2026 10:12:50 E               s16.hifa_gfluxscale.uid___A002_Xee1eb6_Xc58d.field_16.spw_16.qa.metric.score_gfluxscale_k_spw
25-Oct-2026 10:12:50 E                       values differ by > a relative difference of 1e-07
25-Oct-2026 10:12:50 E                       expected: 0.98873804093041
25-Oct-2026 10:12:50 E                       new:      0.9887378959281024
25-Oct-2026 10:12:50 E                       diff: 1.450023076055018e-07
25-Oct-2026 10:12:50 E                       percent_diff: 1.4665391802772507e-05%
25-Oct-2026 10:12:50 E               s16.hifa_gfluxscale.uid___A002_Xee1eb6_Xc58d.field_17.spw_16.I
25-Oct-2026 10:12:50 E                       values differ by > a relative difference of 1e-07
25-Oct-2026 10:12:50 E                       expected: 3.1207121225170846
25-Oct-2026 10:12:50 E                       new:      3.1207129025083584
25-Oct-2026 10:12:50 E                       diff: -7.799912737915804e-07
25-Oct-2026 10:12:50 E                       percent_diff: -2.4994015569832822e-05%
25-Oct-2026 10:12:50 E               s16.hifa_gfluxscale.uid___A002_Xee1eb6_Xc58d.field_17.spw_16.qa.metric.score_gfluxscale_k_spw
25-Oct-2026 10:12:50 E                       values differ by > a relative difference of 1e-07
25-Oct-2026 10:12:50 E                       expected: 1.0086589464965487
25-Oct-2026 10:12:50 E                       new:      1.008659198600923
25-Oct-2026 10:12:50 E                       diff: -2.521043742653717e-07
25-Oct-2026 10:12:50 E                       percent_diff: -2.4994015582871183e-05%
25-Oct-2026 10:12:50 E               s16.hifa_gfluxscale.uid___A002_Xee1eb6_Xc58d.field_18.spw_16.I
25-Oct-2026 10:12:50 E                       values differ by > a relative difference of 1e-07
25-Oct-2026 10:12:50 E                       expected: 0.7527119295410829
25-Oct-2026 10:12:50 E                       new:      0.7527121046559739
25-Oct-2026 10:12:50 E                       diff: -1.7511489103227973e-07
25-Oct-2026 10:12:50 E                       percent_diff: -2.3264529783531483e-05%
25-Oct-2026 10:12:50 E               s16.hifa_gfluxscale.uid___A002_Xee1eb6_Xc58d.field_18.spw_16.qa.metric.score_gfluxscale_k_spw
25-Oct-2026 10:12:50 E                       values differ by > a relative difference of 1e-07
25-Oct-2026 10:12:50 E                       expected: 0.9828239359200758
25-Oct-2026 10:12:50 E                       new:      0.9828241645694431
25-Oct-2026 10:12:50 E                       diff: -2.2864936732869268e-07
25-Oct-2026 10:12:50 E                       percent_diff: -2.3264529787284978e-05%
25-Oct-2026 10:12:50 E               s16.hifa_gfluxscale.uid___A002_Xee1eb6_Xc58d.field_2.spw_16.I
25-Oct-2026 10:12:50 E                       values differ by > a relative difference of 1e-07
25-Oct-2026 10:12:50 E                       expected: 1.618410391590432
25-Oct-2026 10:12:50 E                       new:      1.61841002510508
25-Oct-2026 10:12:50 E                       diff: 3.664853520657374e-07
25-Oct-2026 10:12:50 E                       percent_diff: 2.264477254780771e-05%
25-Oct-2026 10:12:50 E               s16.hifa_gfluxscale.uid___A002_Xee1eb6_Xc58d.field_2.spw_16.qa.metric.score_gfluxscale_k_spw
25-Oct-2026 10:12:50 E                       values differ by > a relative difference of 1e-07
25-Oct-2026 10:12:50 E                       expected: 0.9892074575478698
25-Oct-2026 10:12:50 E                       new:      0.989207233544091
25-Oct-2026 10:12:50 E                       diff: 2.240037787482052e-07
25-Oct-2026 10:12:50 E                       percent_diff: 2.2644772543818514e-05%
25-Oct-2026 10:12:50 E               s16.hifa_gfluxscale.uid___A002_Xee1eb6_Xc58d.field_3.spw_16.I
25-Oct-2026 10:12:50 E                       values differ by > a relative difference of 1e-07
25-Oct-2026 10:12:50 E                       expected: 1.021946498634394
25-Oct-2026 10:12:50 E                       new:      1.0219468079803513
25-Oct-2026 10:12:50 E                       diff: -3.0934595729448233e-07
25-Oct-2026 10:12:50 E                       percent_diff: -3.0270269305472935e-05%
25-Oct-2026 10:12:50 E               s16.hifa_gfluxscale.uid___A002_Xee1eb6_Xc58d.field_3.spw_16.qa.metric.score_gfluxscale_k_spw
25-Oct-2026 10:12:50 E                       values differ by > a relative difference of 1e-07
25-Oct-2026 10:12:50 E                       expected: 0.9884073036939544
25-Oct-2026 10:12:50 E                       new:      0.988407602887507
25-Oct-2026 10:12:50 E                       diff: -2.9919355259977465e-07
25-Oct-2026 10:12:50 E                       percent_diff: -3.0270269299063728e-05%
25-Oct-2026 10:12:50 E               s16.hifa_gfluxscale.uid___A002_Xee1eb6_Xc58d.field_4.spw_16.I
25-Oct-2026 10:12:50 E                       values differ by > a relative difference of 1e-07
25-Oct-2026 10:12:50 E                       expected: 1.9982802740350474
25-Oct-2026 10:12:50 E                       new:      1.998279869420348
25-Oct-2026 10:12:50 E                       diff: 4.046146993008648e-07
25-Oct-2026 10:12:50 E                       percent_diff: 2.0248145595904948e-05%
25-Oct-2026 10:12:50 E               s16.hifa_gfluxscale.uid___A002_Xee1eb6_Xc58d.field_4.spw_16.qa.metric.score_gfluxscale_k_spw
25-Oct-2026 10:12:50 E                       values differ by > a relative difference of 1e-07
25-Oct-2026 10:12:50 E                       expected: 0.9913095430688047
25-Oct-2026 10:12:50 E                       new:      0.9913093423470051
25-Oct-2026 10:12:50 E                       diff: 2.0072179962582481e-07
25-Oct-2026 10:12:50 E                       percent_diff: 2.0248145599854588e-05%
25-Oct-2026 10:12:50 E               s16.hifa_gfluxscale.uid___A002_Xee1eb6_Xc58d.field_8.spw_16.I
25-Oct-2026 10:12:50 E                       values differ by > a relative difference of 1e-07
25-Oct-2026 10:12:50 E                       expected: 1.2841153440085296
25-Oct-2026 10:12:50 E                       new:      1.2841155200899643
25-Oct-2026 10:12:50 E                       diff: -1.7608143476621763e-07
25-Oct-2026 10:12:50 E                       percent_diff: -1.3712275582390987e-05%
25-Oct-2026 10:12:50 E               s16.hifa_gfluxscale.uid___A002_Xee1eb6_Xc58d.field_8.spw_16.qa.metric.score_gfluxscale_k_spw
25-Oct-2026 10:12:50 E                       values differ by > a relative difference of 1e-07
25-Oct-2026 10:12:50 E                       expected: 0.9993316695720197
25-Oct-2026 10:12:50 E                       new:      0.9993318066031321
25-Oct-2026 10:12:50 E                       diff: -1.3703111245710886e-07
25-Oct-2026 10:12:50 E                       percent_diff: -1.3712275576715656e-05%
25-Oct-2026 10:12:50 E               s16.hifa_gfluxscale.uid___A002_Xee1eb6_Xc58d.field_9.spw_16.I
25-Oct-2026 10:12:50 E                       values differ by > a relative difference of 1e-07
25-Oct-2026 10:12:50 E                       expected: 1.9139242142944206
25-Oct-2026 10:12:50 E                       new:      1.9139240026602145
25-Oct-2026 10:12:50 E                       diff: 2.1163420615977202e-07
25-Oct-2026 10:12:50 E                       percent_diff: 1.1057606386875262e-05%
25-Oct-2026 10:12:50 E               s16.hifa_gfluxscale.uid___A002_Xee1eb6_Xc58d.field_9.spw_16.qa.metric.score_gfluxscale_k_spw
25-Oct-2026 10:12:50 E                       values differ by > a relative difference of 1e-07
25-Oct-2026 10:12:50 E                       expected: 0.9913370742983115
25-Oct-2026 10:12:50 E                       new:      0.9913369646801599
25-Oct-2026 10:12:50 E                       diff: 1.0961815166687927e-07
25-Oct-2026 10:12:50 E                       percent_diff: 1.1057606389276748e-05%
25-Oct-2026 10:12:50 E               Worst absolute diff, s16.hifa_gfluxscale.uid___A002_Xee1eb6_Xc58d.field_13.spw_16.I: -1.1439118234868317e-06
25-Oct-2026 10:12:50 E               Worst percentage diff, s16.hifa_gfluxscale.uid___A002_Xee1eb6_Xc58d.field_12.spw_16.I: 3.4374718488537085e-05%
25-Oct-2026 10:12:50
25-Oct-2026 10:12:50 tests/testing_utils.py:440: Failed
25-Oct-2026 10:12:50 FAILED tests/regression/fast/alma_if_fast_test.py::test_csv_3899_eb2_small__procedure_hifa_calimage__regression - @pytest.mark.twelve
25-Oct-2026 10:12:50     def test_csv_3899_eb2_small__procedure_hifa_calimage__regression():
25-Oct-2026 10:12:50         """PIPE-2245: Run small ALMA cal+image regression to cover various heuristics
25-Oct-2026 10:12:50    
25-Oct-2026 10:12:50         Recipe name:                procedure_hifa_calimage
25-Oct-2026 10:12:50         Dataset:                    CSV-3899-EB2-small
25-Oct-2026 10:12:50         """
25-Oct-2026 10:12:50         ref_directory = 'pl-regressiontest/CSV-3899-EB2-small'
25-Oct-2026 10:12:50    
25-Oct-2026 10:12:50         pt = PipelineTester(
25-Oct-2026 10:12:50             visname=['uid___A002_X1181695_X1c6a4_8ant.ms'],
25-Oct-2026 10:12:50             recipe='procedure_hifa_calimage.xml',
25-Oct-2026 10:12:50             input_dir=ref_directory,
25-Oct-2026 10:12:50             expectedoutput_dir=ref_directory,
25-Oct-2026 10:12:50         )
25-Oct-2026 10:12:50    
25-Oct-2026 10:12:50 >       pt.run(omp_num_threads=1)
25-Oct-2026 10:12:50
25-Oct-2026 10:12:50 tests/regression/fast/alma_if_fast_test.py:181:
25-Oct-2026 10:12:50 _ _ _ _ _ _ _ _ _ _ _ _ _ _ _ _ _ _ _ _ _ _ _ _ _ _ _ _ _ _ _ _ _ _ _ _ _ _ _ _
25-Oct-2026 10:12:50 tests/testing_utils.py:381: in run
25-Oct-2026 10:12:50     self.__compare_results(new_file, default_relative_tolerance)
25-Oct-2026 10:12:50 _ _ _ _ _ _ _ _ _ _ _ _ _ _ _ _ _ _ _ _ _ _ _ _ _ _ _ _ _ _ _ _ _ _ _ _ _ _ _ _
25-Oct-2026 10:12:50
25-Oct-2026 10:12:50 self = <tests.testing_utils.PipelineTester object at 0x7f043df24f20>
25-Oct-2026 10:12:50 new_file = 'uid___A002_X1181695_X1c6a4_8ant.ms.NEW.results.txt'
25-Oct-2026 10:12:50 relative_tolerance = 1e-07
25-Oct-2026 10:12:50
25-Oct-2026 10:12:50     def __compare_results(self, new_file: str, relative_tolerance: float) -> None:
25-Oct-2026 10:12:50         """
25-Oct-2026 10:12:50         Compare results between new one loaded from file and old one.
25-Oct-2026 10:12:50    
25-Oct-2026 10:12:50         Args:
25-Oct-2026 10:12:50             new_file : file path of new results
25-Oct-2026 10:12:50             relative_tolerance : relative tolerance of output value
25-Oct-2026 10:12:50         """
25-Oct-2026 10:12:50         with open(self.expectedoutput_file) as expected_fd, open(new_file) as new_fd:
25-Oct-2026 10:12:50             expected_results = expected_fd.readlines()
25-Oct-2026 10:12:50             new_results = new_fd.readlines()
25-Oct-2026 10:12:50             errors = []
25-Oct-2026 10:12:50             worst_diff = (0, 0)
25-Oct-2026 10:12:50             worst_percent_diff = (0, 0)
25-Oct-2026 10:12:50             for old, new in zip(expected_results, new_results):
25-Oct-2026 10:12:50                 try:
25-Oct-2026 10:12:50                     oldkey, oldval, tol = self.__sanitize_results_string(old)
25-Oct-2026 10:12:50                     newkey, newval, _ = self.__sanitize_results_string(new)
25-Oct-2026 10:12:50                 except ValueError as e:
25-Oct-2026 10:12:50                     errorstr = "The results: {0} could not be parsed. Error: {1}".format(new, str(e))
25-Oct-2026 10:12:50                     errors.append(errorstr)
25-Oct-2026 10:12:50                     continue
25-Oct-2026 10:12:50    
25-Oct-2026 10:12:50                 assert oldkey == newkey, f"Expected key {oldkey} does not match new key {newkey}."
25-Oct-2026 10:12:50                 tolerance = tol if tol else relative_tolerance
25-Oct-2026 10:12:50                 if newval is not None:
25-Oct-2026 10:12:50                     LOG.info('Comparing %s to %s with a rel. tolerance of %s', oldval, newval, tolerance)
25-Oct-2026 10:12:50                     if oldval != pytest.approx(newval, rel=tolerance):
25-Oct-2026 10:12:50                         diff = oldval-newval
25-Oct-2026 10:12:50                         percent_diff = (oldval-newval)/oldval * 100 if oldval != 0 else 100
25-Oct-2026 10:12:50                         if abs(diff) > abs(worst_diff[0]):
25-Oct-2026 10:12:50                             worst_diff = diff, oldkey
25-Oct-2026 10:12:50                         if abs(percent_diff) > abs(worst_percent_diff[0]):
25-Oct-2026 10:12:50                             worst_percent_diff = percent_diff, oldkey
25-Oct-2026 10:12:50                         errorstr = f"{oldkey}\n\tvalues differ by > a relative difference of {tolerance}\n\texpected: {oldval}\n\tnew:      {newval}\n\tdiff: {diff}\n\tpercent_diff: {percent_diff}%"
25-Oct-2026 10:12:50                         errors.append(errorstr)
25-Oct-2026 10:12:50                 elif oldval is not None:
25-Oct-2026 10:12:50                     # If only the new value is None, fail
25-Oct-2026 10:12:50                     errorstr = f"{oldkey}\n\tvalue is None\n\texpected: {oldval}\n\tnew:      {newval}"
25-Oct-2026 10:12:50                     errors.append(errorstr)
25-Oct-2026 10:12:50                 else:
25-Oct-2026 10:12:50                     # If old and new values are both None, this is expected, so pass
25-Oct-2026 10:12:50                     LOG.info('Comparing %s and %s... both values are None.', oldval, newval)
25-Oct-2026 10:12:50    
25-Oct-2026 10:12:50             [LOG.warning(x) for x in errors]
25-Oct-2026 10:12:50             n_errors = len(errors)
25-Oct-2026 10:12:50             if n_errors > 0:
25-Oct-2026 10:12:50                 summary_str = f"Worst absolute diff, {worst_diff[1]}: {worst_diff[0]}\nWorst percentage diff, {worst_percent_diff[1]}: {worst_percent_diff[0]}%"
25-Oct-2026 10:12:50                 errors.append(summary_str)
25-Oct-2026 10:12:50 >               pytest.fail("Failed to match {0} result value{1} within tolerance{1} :\n{2}".format(
25-Oct-2026 10:12:50                     n_errors, '' if n_errors == 1 else 's', '\n'.join(errors)), pytrace=True)
25-Oct-2026 10:12:50 E               Failed: Failed to match 2 result values within tolerances :
25-Oct-2026 10:12:50 E               s16.hifa_gfluxscaleflag.uid___A002_X1181695_X1c6a4_8ant.qa.metric.CorrectedampflagQAHandler
25-Oct-2026 10:12:50 E                       values differ by > a relative difference of 1e-07
25-Oct-2026 10:12:50 E                       expected: 0.0053688072299937365
25-Oct-2026 10:12:50 E                       new:      0.0
25-Oct-2026 10:12:50 E                       diff: 0.0053688072299937365
25-Oct-2026 10:12:50 E                       percent_diff: 100.0%
25-Oct-2026 10:12:50 E               s16.hifa_gfluxscaleflag.uid___A002_X1181695_X1c6a4_8ant.qa.score.CorrectedampflagQAHandler
25-Oct-2026 10:12:50 E                       values differ by > a relative difference of 1e-07
25-Oct-2026 10:12:50 E                       expected: 0.9946311927700062
25-Oct-2026 10:12:50 E                       new:      1.0
25-Oct-2026 10:12:50 E                       diff: -0.005368807229993777
25-Oct-2026 10:12:50 E                       percent_diff: -0.539778690736802%
25-Oct-2026 10:12:50 E               Worst absolute diff, s16.hifa_gfluxscaleflag.uid___A002_X1181695_X1c6a4_8ant.qa.score.CorrectedampflagQAHandler: -0.005368807229993777
25-Oct-2026 10:12:50 E               Worst percentage diff, s16.hifa_gfluxscaleflag.uid___A002_X1181695_X1c6a4_8ant.qa.metric.CorrectedampflagQAHandler: 100.0%
25-Oct-2026 10:12:50
25-Oct-2026 10:12:50 tests/testing_utils.py:440: Failed
25-Oct-2026 10:12:50 FAILED tests/regression/fast/alma_if_fast_test.py::test_2023_1_00228_S__uid___A002_X1199f9e_X7c24__procedure_hifa_calimage_diffgain__regression - @pytest.mark.seven
25-Oct-2026 10:12:50     @pytest.mark.mpi
25-Oct-2026 10:12:50     def test_2023_1_00228_S__uid___A002_X1199f9e_X7c24__procedure_hifa_calimage_diffgain__regression():
25-Oct-2026 10:12:50         """Run ALMA cal+image regression on a 7m B2B dataset with differential gain calibration.
25-Oct-2026 10:12:50    
25-Oct-2026 10:12:50         Recipe name:                procedure_hifa_calimage_diffgain
25-Oct-2026 10:12:50         Dataset:                    2023.1.00228.S: uid___A002_X1199f9e_X7c24
25-Oct-2026 10:12:50         """
25-Oct-2026 10:12:50         ref_directory = 'pl-regressiontest/2023.1.00228.S'
25-Oct-2026 10:12:50    
25-Oct-2026 10:12:50         pt = PipelineTester(
25-Oct-2026 10:12:50             visname=['uid___A002_X1199f9e_X7c24'],
25-Oct-2026 10:12:50             recipe='procedure_hifa_calimage_diffgain.xml',
25-Oct-2026 10:12:50             input_dir=ref_directory,
25-Oct-2026 10:12:50             expectedoutput_dir=ref_directory,
25-Oct-2026 10:12:50         )
25-Oct-2026 10:12:50    
25-Oct-2026 10:12:50 >       pt.run()
25-Oct-2026 10:12:50
25-Oct-2026 10:12:50 tests/regression/fast/alma_if_fast_test.py:142:
25-Oct-2026 10:12:50 _ _ _ _ _ _ _ _ _ _ _ _ _ _ _ _ _ _ _ _ _ _ _ _ _ _ _ _ _ _ _ _ _ _ _ _ _ _ _ _
25-Oct-2026 10:12:50 tests/testing_utils.py:381: in run
25-Oct-2026 10:12:50     self.__compare_results(new_file, default_relative_tolerance)
25-Oct-2026 10:12:50 _ _ _ _ _ _ _ _ _ _ _ _ _ _ _ _ _ _ _ _ _ _ _ _ _ _ _ _ _ _ _ _ _ _ _ _ _ _ _ _
25-Oct-2026 10:12:50
25-Oct-2026 10:12:50 self = <tests.testing_utils.PipelineTester object at 0x7f9d520f6690>
25-Oct-2026 10:12:50 new_file = 'uid___A002_X1199f9e_X7c24.NEW.results.txt'
25-Oct-2026 10:12:50 relative_tolerance = 1e-07
25-Oct-2026 10:12:50
25-Oct-2026 10:12:50     def __compare_results(self, new_file: str, relative_tolerance: float) -> None:
25-Oct-2026 10:12:50         """
25-Oct-2026 10:12:50         Compare results between new one loaded from file and old one.
25-Oct-2026 10:12:50    
25-Oct-2026 10:12:50         Args:
25-Oct-2026 10:12:50             new_file : file path of new results
25-Oct-2026 10:12:50             relative_tolerance : relative tolerance of output value
25-Oct-2026 10:12:50         """
25-Oct-2026 10:12:50         with open(self.expectedoutput_file) as expected_fd, open(new_file) as new_fd:
25-Oct-2026 10:12:50             expected_results = expected_fd.readlines()
25-Oct-2026 10:12:50             new_results = new_fd.readlines()
25-Oct-2026 10:12:50             errors = []
25-Oct-2026 10:12:50             worst_diff = (0, 0)
25-Oct-2026 10:12:50             worst_percent_diff = (0, 0)
25-Oct-2026 10:12:50             for old, new in zip(expected_results, new_results):
25-Oct-2026 10:12:50                 try:
25-Oct-2026 10:12:50                     oldkey, oldval, tol = self.__sanitize_results_string(old)
25-Oct-2026 10:12:50                     newkey, newval, _ = self.__sanitize_results_string(new)
25-Oct-2026 10:12:50                 except ValueError as e:
25-Oct-2026 10:12:50                     errorstr = "The results: {0} could not be parsed. Error: {1}".format(new, str(e))
25-Oct-2026 10:12:50                     errors.append(errorstr)
25-Oct-2026 10:12:50                     continue
25-Oct-2026 10:12:50    
25-Oct-2026 10:12:50                 assert oldkey == newkey, f"Expected key {oldkey} does not match new key {newkey}."
25-Oct-2026 10:12:50                 tolerance = tol if tol else relative_tolerance
25-Oct-2026 10:12:50                 if newval is not None:
25-Oct-2026 10:12:50                     LOG.info('Comparing %s to %s with a rel. tolerance of %s', oldval, newval, tolerance)
25-Oct-2026 10:12:50                     if oldval != pytest.approx(newval, rel=tolerance):
25-Oct-2026 10:12:50                         diff = oldval-newval
25-Oct-2026 10:12:50                         percent_diff = (oldval-newval)/oldval * 100 if oldval != 0 else 100
25-Oct-2026 10:12:50                         if abs(diff) > abs(worst_diff[0]):
25-Oct-2026 10:12:50                             worst_diff = diff, oldkey
25-Oct-2026 10:12:50                         if abs(percent_diff) > abs(worst_percent_diff[0]):
25-Oct-2026 10:12:50                             worst_percent_diff = percent_diff, oldkey
25-Oct-2026 10:12:50                         errorstr = f"{oldkey}\n\tvalues differ by > a relative difference of {tolerance}\n\texpected: {oldval}\n\tnew:      {newval}\n\tdiff: {diff}\n\tpercent_diff: {percent_diff}%"
25-Oct-2026 10:12:50                         errors.append(errorstr)
25-Oct-2026 10:12:50                 elif oldval is not None:
25-Oct-2026 10:12:50                     # If only the new value is None, fail
25-Oct-2026 10:12:50                     errorstr = f"{oldkey}\n\tvalue is None\n\texpected: {oldval}\n\tnew:      {newval}"
25-Oct-2026 10:12:50                     errors.append(errorstr)
25-Oct-2026 10:12:50                 else:
25-Oct-2026 10:12:50                     # If old and new values are both None, this is expected, so pass
25-Oct-2026 10:12:50                     LOG.info('Comparing %s and %s... both values are None.', oldval, newval)
25-Oct-2026 10:12:50    
25-Oct-2026 10:12:50             [LOG.warning(x) for x in errors]
25-Oct-2026 10:12:53             n_errors = len(errors)
25-Oct-2026 10:12:53             if n_errors > 0:
25-Oct-2026 10:12:53                 summary_str = f"Worst absolute diff, {worst_diff[1]}: {worst_diff[0]}\nWorst percentage diff, {worst_percent_diff[1]}: {worst_percent_diff[0]}%"
25-Oct-2026 10:12:53                 errors.append(summary_str)
25-Oct-2026 10:12:53 >               pytest.fail("Failed to match {0} result value{1} within tolerance{1} :\n{2}".format(
25-Oct-2026 10:12:53                     n_errors, '' if n_errors == 1 else 's', '\n'.join(errors)), pytrace=True)
25-Oct-2026 10:12:53 E               Failed: Failed to match 13 result values within tolerances :
25-Oct-2026 10:12:53 E               s16.hifa_gfluxscale.uid___A002_X1199f9e_X7c24.field_1.spw_29.I
25-Oct-2026 10:12:53 E                       values differ by > a relative difference of 1e-07
25-Oct-2026 10:12:53 E                       expected: 0.8378082712078273
25-Oct-2026 10:12:53 E                       new:      0.8378077335399046
25-Oct-2026 10:12:53 E                       diff: 5.376679227397929e-07
25-Oct-2026 10:12:53 E                       percent_diff: 6.417553290141947e-05%
25-Oct-2026 10:12:53 E               s16.hifa_gfluxscale.uid___A002_X1199f9e_X7c24.field_1.spw_29.qa.metric.score_gfluxscale_k_spw
25-Oct-2026 10:12:53 E                       values differ by > a relative difference of 1e-07
25-Oct-2026 10:12:53 E                       expected: 0.8081204912780358
25-Oct-2026 10:12:53 E                       new:      0.808119972662404
25-Oct-2026 10:12:53 E                       diff: 5.186156317726898e-07
25-Oct-2026 10:12:53 E                       percent_diff: 6.417553290258777e-05%
25-Oct-2026 10:12:53 E               s16.hifa_gfluxscale.uid___A002_X1199f9e_X7c24.field_1.spw_33.I
25-Oct-2026 10:12:53 E                       values differ by > a relative difference of 1e-07
25-Oct-2026 10:12:53 E                       expected: 0.8460116243974625
25-Oct-2026 10:12:53 E                       new:      0.8460103046383503
25-Oct-2026 10:12:53 E                       diff: 1.319759112217156e-06
25-Oct-2026 10:12:53 E                       percent_diff: 0.00015599775158610862%
25-Oct-2026 10:12:53 E               s16.hifa_gfluxscale.uid___A002_X1199f9e_X7c24.field_1.spw_33.qa.metric.score_gfluxscale_k_spw
25-Oct-2026 10:12:53 E                       values differ by > a relative difference of 1e-07
25-Oct-2026 10:12:53 E                       expected: 0.8173528334400738
25-Oct-2026 10:12:53 E                       new:      0.8173515583880312
25-Oct-2026 10:12:53 E                       diff: 1.2750520426152434e-06
25-Oct-2026 10:12:53 E                       percent_diff: 0.0001559977515767341%
25-Oct-2026 10:12:53 E               s16.hifa_gfluxscale.uid___A002_X1199f9e_X7c24.field_1.spw_41.I
25-Oct-2026 10:12:53 E                       values differ by > a relative difference of 1e-07
25-Oct-2026 10:12:53 E                       expected: 0.7885692224368216
25-Oct-2026 10:12:53 E                       new:      0.7885703778722577
25-Oct-2026 10:12:53 E                       diff: -1.1554354361065222e-06
25-Oct-2026 10:12:53 E                       percent_diff: -0.00014652301956903893%
25-Oct-2026 10:12:53 E               s16.hifa_gfluxscale.uid___A002_X1199f9e_X7c24.field_1.spw_41.qa.metric.score_gfluxscale_k_spw
25-Oct-2026 10:12:53 E                       values differ by > a relative difference of 1e-07
25-Oct-2026 10:12:53 E                       expected: 0.7642712175824183
25-Oct-2026 10:12:53 E                       new:      0.764272337415684
25-Oct-2026 10:12:53 E                       diff: -1.119833265672554e-06
25-Oct-2026 10:12:53 E                       percent_diff: -0.00014652301956560233%
25-Oct-2026 10:12:53 E               s16.hifa_gfluxscale.uid___A002_X1199f9e_X7c24.field_4.spw_29.I
25-Oct-2026 10:12:53 E                       values differ by > a relative difference of 1e-07
25-Oct-2026 10:12:53 E                       expected: 0.12352226017389038
25-Oct-2026 10:12:53 E                       new:      0.12352412354044164
25-Oct-2026 10:12:53 E                       diff: -1.86336655125241e-06
25-Oct-2026 10:12:53 E                       percent_diff: -0.0015085269235109741%
25-Oct-2026 10:12:53 E               s16.hifa_gfluxscale.uid___A002_X1199f9e_X7c24.field_4.spw_29.qa.metric.score_gfluxscale_k_spw
25-Oct-2026 10:12:53 E                       values differ by > a relative difference of 1e-07
25-Oct-2026 10:12:53 E                       expected: 0.5679953042438604
25-Oct-2026 10:12:53 E                       new:      0.5680038726059492
25-Oct-2026 10:12:53 E                       diff: -8.568362088845483e-06
25-Oct-2026 10:12:53 E                       percent_diff: -0.0015085269235195619%
25-Oct-2026 10:12:53 E               s16.hifa_gfluxscale.uid___A002_X1199f9e_X7c24.field_4.spw_33.I
25-Oct-2026 10:12:53 E                       values differ by > a relative difference of 1e-07
25-Oct-2026 10:12:53 E                       expected: 0.21527453621962267
25-Oct-2026 10:12:53 E                       new:      0.2152731154481138
25-Oct-2026 10:12:53 E                       diff: 1.4207715088587758e-06
25-Oct-2026 10:12:53 E                       percent_diff: 0.0006599812192415119%
25-Oct-2026 10:12:53 E               s16.hifa_gfluxscale.uid___A002_X1199f9e_X7c24.field_4.spw_33.qa.metric.score_gfluxscale_k_spw
25-Oct-2026 10:12:53 E                       values differ by > a relative difference of 1e-07
25-Oct-2026 10:12:53 E                       expected: 0.9918525112637544
25-Oct-2026 10:12:53 E                       new:      0.9918459652234575
25-Oct-2026 10:12:53 E                       diff: 6.5460402969286235e-06
25-Oct-2026 10:12:53 E                       percent_diff: 0.0006599812192427765%
25-Oct-2026 10:12:53 E               s16.hifa_gfluxscale.uid___A002_X1199f9e_X7c24.field_4.spw_41.I
25-Oct-2026 10:12:53 E                       values differ by > a relative difference of 1e-07
25-Oct-2026 10:12:53 E                       expected: 0.20283735907845116
25-Oct-2026 10:12:53 E                       new:      0.20284323676879906
25-Oct-2026 10:12:53 E                       diff: -5.877690347905196e-06
25-Oct-2026 10:12:53 E                       percent_diff: -0.0028977355920079243%
25-Oct-2026 10:12:53 E               s16.hifa_gfluxscale.uid___A002_X1199f9e_X7c24.field_4.spw_41.qa.metric.score_gfluxscale_k_spw
25-Oct-2026 10:12:53 E                       values differ by > a relative difference of 1e-07
25-Oct-2026 10:12:53 E                       expected: 0.9381597108479458
25-Oct-2026 10:12:53 E                       new:      0.9381868962357969
25-Oct-2026 10:12:53 E                       diff: -2.718538785106972e-05
25-Oct-2026 10:12:53 E                       percent_diff: -0.0028977355920026125%
25-Oct-2026 10:12:53 E               s16.hifa_gfluxscale.uid___A002_X1199f9e_X7c24.qa.score.score_derived_fluxes_snr
25-Oct-2026 10:12:53 E                       values differ by > a relative difference of 1e-07
25-Oct-2026 10:12:53 E                       expected: 0.8782559648560236
25-Oct-2026 10:12:53 E                       new:      0.8782558045461518
25-Oct-2026 10:12:53 E                       diff: 1.6030987182169554e-07
25-Oct-2026 10:12:53 E                       percent_diff: 1.825320615362696e-05%
25-Oct-2026 10:12:53 E               Worst absolute diff, s16.hifa_gfluxscale.uid___A002_X1199f9e_X7c24.field_4.spw_41.qa.metric.score_gfluxscale_k_spw: -2.718538785106972e-05
25-Oct-2026 10:12:53 E               Worst percentage diff, s16.hifa_gfluxscale.uid___A002_X1199f9e_X7c24.field_4.spw_41.I: -0.0028977355920079243%
25-Oct-2026 10:12:53
25-Oct-2026 10:12:53 tests/testing_utils.py:440: Failed
25-Oct-2026 10:12:53 ========== 5 failed, 13 passed, 1254 warnings in 34653.72s (9:37:33) ===========
25-Oct-2026 10:12:53 2026-10-25 10:12:52        INFO        pipeline.infrastructure.mpihelpers::SynthesisUtilMethods::getResource         synthesis.imager.memprofile.enable is enabled, initializing output file for imager profiling information (memory and run time): casa.synthesis.imager.memprofile.3424927.cvpost128.20261025_101251.txt
25-Oct-2026 10:12:53 stderr: /usr/bin/xvfb-run: line 186: kill: (3424917) - No such process
25-Oct-2026 10:12:53 1
25-Oct-2026 10:12:53 Finished task 'Test' with result: Success
25-Oct-2026 10:12:53 Starting task 'JUnit Parser' of type 'com.atlassian.bamboo.plugins.testresultparser:task.testresultparser.junit'
25-Oct-2026 10:12:53 Parsing test results under /lustre/cv/sw/casa/casaci/cvpost128/bamboohome/xml-data/build-dir/PIPESPECS-TESTPIPEMAINCASAMASTER-ML228PY312TEST...
25-Oct-2026 10:14:00 Failing task since 5 failing test cases were found.
25-Oct-2026 10:14:00 Finished task 'JUnit Parser' with result: Failed
25-Oct-2026 10:14:00 Running post build plugin 'Docker Container Cleanup'
25-Oct-2026 10:14:00 Running post build plugin 'NCover Results Collector'
25-Oct-2026 10:14:00 Running post build plugin 'Build Results Label Collector'
25-Oct-2026 10:14:00 Running post build plugin 'Clover Results Collector'
25-Oct-2026 10:14:00 Running post build plugin 'npm Cache Cleanup'
25-Oct-2026 10:14:00 Running post build plugin 'Artifact Copier'
25-Oct-2026 10:14:00 Publishing an artifact: Unit Test Result xml
25-Oct-2026 10:14:00 Finished publishing of artifact Required shared artifact Http Compression On : [Unit Test Result xml], patterns: [pipeline_regression_test_result.xml] anchored at: [casa-build-utils/pipeline/workdir/] in 78.35 ms
25-Oct-2026 10:14:00 Publishing an artifact: Regression Test Result
25-Oct-2026 10:14:00 Finished publishing of artifact Required shared artifact Http Compression On : [Regression Test Result], patterns: [pipeline_unit_test_result.xml] anchored at: [casa-build-utils/pipeline/workdir/] in 27.74 ms
25-Oct-2026 10:14:00 Finalising the build...
25-Oct-2026 10:14:00 Stopping timer.
25-Oct-2026 10:14:00 Build PIPESPECS-TESTPIPEMAINCASAMASTER-ML228PY312TEST-153 completed.
25-Oct-2026 06:14:00 Running on server: post build plugin 'Build Hanging Detection Configuration'
25-Oct-2026 06:14:00 Running on server: post build plugin 'NCover Results Collector'
25-Oct-2026 06:14:00 Running on server: post build plugin 'Build Labeller'
25-Oct-2026 06:14:00 Running on server: post build plugin 'Clover Delta Calculator'
25-Oct-2026 06:14:00 Running on server: post build plugin 'Maven Dependencies Postprocessor'
25-Oct-2026 06:14:00 All post build plugins have finished
25-Oct-2026 06:14:00 Generating build results summary...
25-Oct-2026 06:14:01 Saving build results to disk...
25-Oct-2026 06:14:01 Store variable context...
25-Oct-2026 06:14:01 Finished building PIPESPECS-TESTPIPEMAINCASAMASTER-ML228PY312TEST-153.