Build: #148 did not complete
Job: Test ManyLinux 2.28 Python 3.12 did not complete
Build log
The build generated 46,170 lines of output. The output is too long and has been truncated to the last 1,000 lines. Download or view full build log.
| 21-Oct-2026 10:55:07 | infrastructure/utils/conversion_test.py::test__parse_antenna[inp7-expected7] PASSED [ 64%] |
| 21-Oct-2026 10:55:07 | infrastructure/utils/conversion_test.py::test__parse_antenna[inp8-expected8] PASSED [ 64%] |
| 21-Oct-2026 10:55:07 | infrastructure/utils/conversion_test.py::test__parse_antenna[inp9-expected9] PASSED [ 64%] |
| 21-Oct-2026 10:55:07 | infrastructure/utils/conversion_test.py::test__parse_antenna[inp10-expected10] PASSED [ 65%] |
| 21-Oct-2026 10:55:07 | infrastructure/utils/conversion_test.py::test__parse_antenna[inp11-expected11] PASSED [ 65%] |
| 21-Oct-2026 10:55:07 | infrastructure/utils/conversion_test.py::test__parse_antenna[inp12-expected12] PASSED [ 65%] |
| 21-Oct-2026 10:55:07 | infrastructure/utils/conversion_test.py::test__parse_antenna[inp13-expected13] PASSED [ 65%] |
| 21-Oct-2026 10:55:07 | infrastructure/utils/conversion_test.py::test__parse_antenna[inp14-expected14] PASSED [ 65%] |
| 21-Oct-2026 10:55:07 | infrastructure/utils/conversion_test.py::test__parse_antenna[inp15-expected15] PASSED [ 65%] |
| 21-Oct-2026 10:55:07 | infrastructure/utils/conversion_test.py::test__parse_antenna[inp16-expected16] PASSED [ 65%] |
| 21-Oct-2026 10:55:07 | infrastructure/utils/conversion_test.py::test__parse_field[inp0-TypeError] PASSED [ 65%] |
| 21-Oct-2026 10:55:07 | infrastructure/utils/conversion_test.py::test__parse_field[inp1-expected1] PASSED [ 65%] |
| 21-Oct-2026 10:55:07 | infrastructure/utils/conversion_test.py::test__parse_field[inp2-expected2] PASSED [ 66%] |
| 21-Oct-2026 10:55:07 | infrastructure/utils/conversion_test.py::test__parse_field[inp3-expected3] PASSED [ 66%] |
| 21-Oct-2026 10:55:07 | infrastructure/utils/conversion_test.py::test__parse_field[inp4-expected4] PASSED [ 66%] |
| 21-Oct-2026 10:55:07 | infrastructure/utils/conversion_test.py::test__parse_field[inp5-expected5] PASSED [ 66%] |
| 21-Oct-2026 10:55:07 | infrastructure/utils/conversion_test.py::test__parse_field[inp6-expected6] PASSED [ 66%] |
| 21-Oct-2026 10:55:07 | infrastructure/utils/conversion_test.py::test__parse_field[inp7-expected7] PASSED [ 66%] |
| 21-Oct-2026 10:55:07 | infrastructure/utils/conversion_test.py::test__parse_field[inp8-expected8] PASSED [ 66%] |
| 21-Oct-2026 10:55:07 | infrastructure/utils/conversion_test.py::test__parse_field[inp9-expected9] PASSED [ 66%] |
| 21-Oct-2026 10:55:07 | infrastructure/utils/conversion_test.py::test__parse_field[inp10-expected10] PASSED [ 66%] |
| 21-Oct-2026 10:55:07 | infrastructure/utils/conversion_test.py::test__parse_field[inp11-expected11] PASSED [ 67%] |
| 21-Oct-2026 10:55:07 | infrastructure/utils/conversion_test.py::test__parse_field[inp12-expected12] PASSED [ 67%] |
| 21-Oct-2026 10:55:07 | infrastructure/utils/conversion_test.py::test__parse_field[inp13-expected13] PASSED [ 67%] |
| 21-Oct-2026 10:55:07 | infrastructure/utils/conversion_test.py::test__parse_field[inp14-expected14] PASSED [ 67%] |
| 21-Oct-2026 10:55:07 | infrastructure/utils/conversion_test.py::test__parse_field[inp15-expected15] PASSED [ 67%] |
| 21-Oct-2026 10:55:07 | infrastructure/utils/conversion_test.py::test__parse_field[inp16-expected16] PASSED [ 67%] |
| 21-Oct-2026 10:55:07 | infrastructure/utils/conversion_test.py::test__parse_spw[inp0-None] PASSED [ 67%] |
| 21-Oct-2026 10:55:07 | infrastructure/utils/conversion_test.py::test__parse_spw[inp1-expected1] PASSED [ 67%] |
| 21-Oct-2026 10:55:07 | infrastructure/utils/conversion_test.py::test__parse_spw[inp2-expected2] PASSED [ 68%] |
| 21-Oct-2026 10:55:07 | infrastructure/utils/conversion_test.py::test__parse_spw[inp3-expected3] PASSED [ 68%] |
| 21-Oct-2026 10:55:07 | infrastructure/utils/conversion_test.py::test__parse_spw[inp4-expected4] PASSED [ 68%] |
| 21-Oct-2026 10:55:07 | infrastructure/utils/conversion_test.py::test__parse_spw[inp5-expected5] PASSED [ 68%] |
| 21-Oct-2026 10:55:07 | infrastructure/utils/conversion_test.py::test__parse_spw[inp6-Exception] PASSED [ 68%] |
| 21-Oct-2026 10:55:07 | infrastructure/utils/conversion_test.py::test__parse_spw[inp7-expected7] PASSED [ 68%] |
| 21-Oct-2026 10:55:07 | infrastructure/utils/conversion_test.py::test__parse_spw[inp8-expected8] PASSED [ 68%] |
| 21-Oct-2026 10:55:07 | infrastructure/utils/conversion_test.py::test__parse_spw[inp9-expected9] PASSED [ 68%] |
| 21-Oct-2026 10:55:07 | infrastructure/utils/conversion_test.py::test__parse_spw[inp10-expected10] PASSED [ 68%] |
| 21-Oct-2026 10:55:07 | infrastructure/utils/conversion_test.py::test__parse_spw[inp11-expected11] PASSED [ 69%] |
| 21-Oct-2026 10:55:07 | infrastructure/utils/conversion_test.py::test_convert_paths[task(vis='/lustre/data/my_file.ms',field='NGC7771,"NGC7752/3",J2355+4950,,"5795"')-task(vis='my_file.ms',field='NGC7771,"NGC7752/3",J2355+4950,,"5795"')] PASSED [ 69%] |
| 21-Oct-2026 10:55:07 | infrastructure/utils/conversion_test.py::test_convert_paths[task(vis="..//working/output.ms")-task(vis="output.ms")] PASSED [ 69%] |
| 21-Oct-2026 10:55:07 | infrastructure/utils/conversion_test.py::test_convert_paths[task(vis='/full/path/to/my_file.ms', gaintable=['../some/caltable1.tbl', 'caltable2.tbl'])-task(vis='my_file.ms', gaintable=['caltable1.tbl', 'caltable2.tbl'])] PASSED [ 69%] |
| 21-Oct-2026 10:55:07 | infrastructure/utils/conversion_test.py::test_convert_paths[\n# This is a comment and should be preserved.\ntask(\n vis = '/path/to/data.ms', # Another comment\n output = "output_dir/final.ms",\n param = 'some_text'\n)\n# A final comment.\n-\n# This is a comment and should be preserved.\ntask(\n vis = 'data.ms', # Another comment\n output = "final.ms",\n param = 'some_text'\n)\n# A final comment.\n] PASSED [ 69%] |
| 21-Oct-2026 10:55:07 | infrastructure/utils/conversion_test.py::test_convert_paths[task(param='my_value with "nested" quotes')-task(param='my_value with "nested" quotes')] PASSED [ 69%] |
| 21-Oct-2026 10:55:07 | infrastructure/utils/conversion_test.py::test_phasecenter_to_skycoord[J2000 302.999666667deg -0.71deg-302.999666667--0.71] PASSED [ 69%] |
| 21-Oct-2026 10:55:26 | infrastructure/utils/conversion_test.py::test_phasecenter_to_skycoord[J2000 20:11:59.992 -000.42.36.0000-302.9999666333333--0.71] PASSED [ 69%] |
| 21-Oct-2026 10:55:26 | infrastructure/utils/conversion_test.py::test_phasecenter_to_skycoord[J2000 20h11m59.992s -0.71deg-302.9999666333333--0.71] PASSED [ 69%] |
| 21-Oct-2026 10:55:26 | infrastructure/utils/conversion_test.py::test_phasecenter_to_skycoord[J2000 18179.998arcmin -42.6arcmin-302.9999666333333--0.71] PASSED [ 70%] |
| 21-Oct-2026 10:55:26 | infrastructure/utils/conversion_test.py::test_phasecenter_to_skycoord[J2000 5.288347rad -0.012394rad-302.9999666333333--0.71] PASSED [ 70%] |
| 21-Oct-2026 10:55:26 | infrastructure/utils/conversion_test.py::test_phasecenter_to_skycoord[20:11:59.992 -000.42.36.0000-302.9999666333333--0.71] PASSED [ 70%] |
| 21-Oct-2026 10:55:26 | infrastructure/utils/flagversion_tools_test.py::test_transfer_flagversion_identity PASSED [ 70%] |
| 21-Oct-2026 10:55:26 | infrastructure/utils/flagversion_tools_test.py::test_transfer_flagversion_mstransform PASSED [ 70%] |
| 21-Oct-2026 10:55:26 | infrastructure/utils/flagversion_tools_test.py::test_transfer_flagversion_reorder PASSED [ 70%] |
| 21-Oct-2026 10:55:26 | infrastructure/utils/imaging_test.py::test__get_cube_freq_axis[/lustre/cv/sw/casa/casaci/pipeline-testdata/pl-unittest/helms30_sci.spw16.cube-freq_axis0] PASSED [ 70%] |
| 21-Oct-2026 10:55:26 | infrastructure/utils/imaging_test.py::test_chan_selection_to_frequencies[/lustre/cv/sw/casa/casaci/pipeline-testdata/pl-unittest/helms30_sci.spw16.cube-10~20-GHz-frequency_ranges0] PASSED [ 70%] |
| 21-Oct-2026 10:55:26 | infrastructure/utils/imaging_test.py::test_chan_selection_to_frequencies[/lustre/cv/sw/casa/casaci/pipeline-testdata/pl-unittest/helms30_sci.spw16.cube-40~50;60~80-GHz-frequency_ranges1] PASSED [ 71%] |
| 21-Oct-2026 10:55:26 | infrastructure/utils/imaging_test.py::test_freq_selection_to_channels[/lustre/cv/sw/casa/casaci/pipeline-testdata/pl-unittest/helms30_sci.spw16.cube-214.5~214.9GHz-channel_ranges0] PASSED [ 71%] |
| 21-Oct-2026 10:55:26 | infrastructure/utils/imaging_test.py::test_freq_selection_to_channels[/lustre/cv/sw/casa/casaci/pipeline-testdata/pl-unittest/helms30_sci.spw16.cube-214.5~214.9GHz;215123.4~215567.8MHz-channel_ranges1] PASSED [ 71%] |
| 21-Oct-2026 10:55:26 | infrastructure/utils/imaging_test.py::test_spw_intersect[spw_range0-line_regions0-expected0] PASSED [ 71%] |
| 21-Oct-2026 10:55:26 | infrastructure/utils/imaging_test.py::test_spw_intersect[spw_range1-line_regions1-expected1] PASSED [ 71%] |
| 21-Oct-2026 10:55:26 | infrastructure/utils/imaging_test.py::test_spw_intersect[spw_range2-line_regions2-expected2] PASSED [ 71%] |
| 21-Oct-2026 10:55:26 | infrastructure/utils/imaging_test.py::test_spw_intersect[spw_range3-line_regions3-expected3] PASSED [ 71%] |
| 21-Oct-2026 10:55:26 | infrastructure/utils/imaging_test.py::test_spw_intersect[spw_range4-line_regions4-expected4] PASSED [ 71%] |
| 21-Oct-2026 10:55:26 | infrastructure/utils/imaging_test.py::test_spw_intersect[spw_range5-line_regions5-expected5] PASSED [ 71%] |
| 21-Oct-2026 10:55:26 | infrastructure/utils/imaging_test.py::test_update_sens_dict[dct0-udct0-rdct0] PASSED [ 72%] |
| 21-Oct-2026 10:55:26 | infrastructure/utils/imaging_test.py::test_update_beams_dict[dct0-udct0-rdct0] PASSED [ 72%] |
| 21-Oct-2026 10:55:26 | infrastructure/utils/imaging_test.py::test_set_nested_dict[dct0-keys0-1-rdct0] PASSED [ 72%] |
| 21-Oct-2026 10:55:26 | infrastructure/utils/imaging_test.py::test_intersect_ranges[ranges0-intersect_range0] PASSED [ 72%] |
| 21-Oct-2026 10:55:26 | infrastructure/utils/imaging_test.py::test_intersect_ranges[ranges1-intersect_range1] PASSED [ 72%] |
| 21-Oct-2026 10:55:26 | infrastructure/utils/imaging_test.py::test_intersect_ranges[ranges2-intersect_range2] PASSED [ 72%] |
| 21-Oct-2026 10:55:26 | infrastructure/utils/imaging_test.py::test_intersect_ranges[ranges3-intersect_range3] PASSED [ 72%] |
| 21-Oct-2026 10:55:26 | infrastructure/utils/imaging_test.py::test_intersect_ranges_by_weight[ranges0-0.01-0.5-intersect_range0] PASSED [ 72%] |
| 21-Oct-2026 10:55:26 | infrastructure/utils/imaging_test.py::test_intersect_ranges_by_weight[ranges1-0.01-1.0-intersect_range1] PASSED [ 72%] |
| 21-Oct-2026 10:55:26 | infrastructure/utils/imaging_test.py::test_intersect_ranges_by_weight[ranges2-0.0001-0.7-intersect_range2] PASSED [ 73%] |
| 21-Oct-2026 10:55:26 | infrastructure/utils/imaging_test.py::test_intersect_ranges_by_weight[ranges3-0.001-1.0-intersect_range3] PASSED [ 73%] |
| 21-Oct-2026 10:55:26 | infrastructure/utils/imaging_test.py::test_intersect_ranges_by_weight[ranges4-0.01-1.0-intersect_range4] PASSED [ 73%] |
| 21-Oct-2026 10:55:26 | infrastructure/utils/imaging_test.py::test_merge_ranges[ranges0-merged_ranges0] PASSED [ 73%] |
| 21-Oct-2026 10:55:26 | infrastructure/utils/imaging_test.py::test_merge_ranges[ranges1-merged_ranges1] PASSED [ 73%] |
| 21-Oct-2026 10:55:26 | infrastructure/utils/imaging_test.py::test_merge_ranges[ranges2-merged_ranges2] PASSED [ 73%] |
| 21-Oct-2026 10:55:26 | infrastructure/utils/imaging_test.py::test_equal_to_n_digits[1.234-1.235-3-True] PASSED [ 73%] |
| 21-Oct-2026 10:55:26 | infrastructure/utils/imaging_test.py::test_equal_to_n_digits[1.234-1.235-4-False] PASSED [ 73%] |
| 21-Oct-2026 10:55:26 | infrastructure/utils/imaging_test.py::test_velocity_to_frequency[29.976248175km/s-100.01GHz-100.0GHz] PASSED [ 74%] |
| 21-Oct-2026 10:55:26 | infrastructure/utils/imaging_test.py::test_frequency_to_velocity[100.0GHz-100.01GHz-29.976248175km/s] PASSED [ 74%] |
| 21-Oct-2026 10:55:26 | infrastructure/utils/imaging_test.py::test_predict_kernel[beam0-target_beam0-1e-06-0.001-kn0-2] PASSED [ 74%] |
| 21-Oct-2026 10:55:26 | infrastructure/utils/imaging_test.py::test_predict_kernel[beam1-target_beam1-1e-06-0.001-kn1-1] PASSED [ 74%] |
| 21-Oct-2026 10:55:26 | infrastructure/utils/imaging_test.py::test_predict_kernel[beam2-target_beam2-1e-06-0.001-kn2-0] PASSED [ 74%] |
| 21-Oct-2026 10:55:26 | infrastructure/utils/math_test.py::test_simple PASSED [ 74%] |
| 21-Oct-2026 10:55:26 | infrastructure/utils/math_test.py::test_round_half_up[-2.1-0--2.0] PASSED [ 74%] |
| 21-Oct-2026 10:55:26 | infrastructure/utils/math_test.py::test_round_half_up[-2.5-0--3.0] PASSED [ 74%] |
| 21-Oct-2026 10:55:26 | infrastructure/utils/math_test.py::test_round_half_up[-3.5-0--4.0] PASSED [ 74%] |
| 21-Oct-2026 10:55:26 | infrastructure/utils/math_test.py::test_round_half_up[4.2-0-4.0] PASSED [ 75%] |
| 21-Oct-2026 10:55:26 | infrastructure/utils/math_test.py::test_round_half_up[4.5-0-5.0] PASSED [ 75%] |
| 21-Oct-2026 10:55:26 | infrastructure/utils/math_test.py::test_round_half_up[-6.034543-4--6.0345] PASSED [ 75%] |
| 21-Oct-2026 10:55:26 | infrastructure/utils/math_test.py::test_round_half_up[-7.034443-4--7.0344] PASSED [ 75%] |
| 21-Oct-2026 10:55:26 | infrastructure/utils/math_test.py::test_round_up[-2.1-0--3.0] PASSED [ 75%] |
| 21-Oct-2026 10:55:26 | infrastructure/utils/math_test.py::test_round_up[-2.5-0--3.0] PASSED [ 75%] |
| 21-Oct-2026 10:55:26 | infrastructure/utils/math_test.py::test_round_up[-3.5-0--4.0] PASSED [ 75%] |
| 21-Oct-2026 10:55:26 | infrastructure/utils/math_test.py::test_round_up[4.2-0-5.0] PASSED [ 75%] |
| 21-Oct-2026 10:55:26 | infrastructure/utils/math_test.py::test_round_up[4.5-0-5.0] PASSED [ 75%] |
| 21-Oct-2026 10:55:26 | infrastructure/utils/math_test.py::test_round_up[-6.034543-4--6.0346] PASSED [ 76%] |
| 21-Oct-2026 10:55:26 | infrastructure/utils/math_test.py::test_round_up[-7.034443-4--7.0345] PASSED [ 76%] |
| 21-Oct-2026 10:55:26 | infrastructure/utils/math_test.py::test_round_down[-2.1-0--2.0] PASSED [ 76%] |
| 21-Oct-2026 10:55:26 | infrastructure/utils/math_test.py::test_round_down[-2.5-0--2.0] PASSED [ 76%] |
| 21-Oct-2026 10:55:26 | infrastructure/utils/math_test.py::test_round_down[-3.5-0--3.0] PASSED [ 76%] |
| 21-Oct-2026 10:55:26 | infrastructure/utils/math_test.py::test_round_down[4.2-0-4.0] PASSED [ 76%] |
| 21-Oct-2026 10:55:26 | infrastructure/utils/math_test.py::test_round_down[4.5-0-4.0] PASSED [ 76%] |
| 21-Oct-2026 10:55:26 | infrastructure/utils/math_test.py::test_round_down[-6.034543-4--6.0345] PASSED [ 76%] |
| 21-Oct-2026 10:55:26 | infrastructure/utils/math_test.py::test_round_down[-7.034443-4--7.0344] PASSED [ 77%] |
| 21-Oct-2026 10:55:26 | infrastructure/utils/positioncorrection_test.py::test_do_wide_field_corr[/lustre/cv/sw/casa/casaci/pipeline-testdata/pl-unittest/VLASS1.1.ql.T19t20.J155950+333000.fits-obs_long0-obs_lat0-expected0] PASSED [ 77%] |
| 21-Oct-2026 10:55:26 | infrastructure/utils/positioncorrection_test.py::test_do_wide_field_corr[/lustre/cv/sw/casa/casaci/pipeline-testdata/pl-unittest/VLASS1.2.ql.T17t06.J041750+243000.fits-obs_long1-obs_lat1-expected1] PASSED [ 77%] |
| 21-Oct-2026 10:55:26 | infrastructure/utils/positioncorrection_test.py::test_calc_zd_pa[ra0-dec0-obs_long0-obs_lat0-date_time0-expected0] PASSED [ 77%] |
| 21-Oct-2026 10:55:26 | infrastructure/utils/positioncorrection_test.py::test_calc_zd_pa[ra1-dec1-obs_long1-obs_lat1-date_time1-expected1] PASSED [ 77%] |
| 21-Oct-2026 10:55:26 | infrastructure/utils/sorting_test.py::test_natural_sort[input_list0-expected0] PASSED [ 77%] |
| 21-Oct-2026 10:55:26 | infrastructure/utils/sorting_test.py::test_natural_sort[input_list1-expected1] PASSED [ 77%] |
| 21-Oct-2026 10:55:26 | infrastructure/utils/sorting_test.py::test_natural_sort[input_list2-expected2] PASSED [ 77%] |
| 21-Oct-2026 10:55:26 | infrastructure/utils/sorting_test.py::test_natural_sort[input_list3-expected3] PASSED [ 77%] |
| 21-Oct-2026 10:55:26 | infrastructure/utils/sorting_test.py::test_numeric_sort[input_list0-expected0] PASSED [ 78%] |
| 21-Oct-2026 10:55:26 | infrastructure/utils/sorting_test.py::test_numeric_sort[input_list1-expected1] PASSED [ 78%] |
| 21-Oct-2026 10:55:26 | infrastructure/utils/sorting_test.py::test_numeric_sort[input_list2-expected2] PASSED [ 78%] |
| 21-Oct-2026 10:55:26 | infrastructure/utils/sorting_test.py::test_natural_sort_key[session9-expected0] PASSED [ 78%] |
| 21-Oct-2026 10:55:26 | infrastructure/utils/sorting_test.py::test_natural_sort_key[session10-expected1] PASSED [ 78%] |
| 21-Oct-2026 10:55:39 | infrastructure/utils/sorting_test.py::test_natural_sort_key[session10a-expected2] PASSED [ 78%] |
| 21-Oct-2026 10:55:39 | infrastructure/utils/sorting_test.py::test_natural_sort_key[spw10-expected3] PASSED [ 78%] |
| 21-Oct-2026 10:55:39 | infrastructure/utils/sorting_test.py::test_natural_sort_key[spw100-expected4] PASSED [ 78%] |
| 21-Oct-2026 10:55:39 | infrastructure/utils/sorting_test.py::test_natural_sort_key[spw1-expected5] PASSED [ 78%] |
| 21-Oct-2026 10:55:39 | infrastructure/utils/sorting_test.py::test_natural_sort_key[Spw10-expected6] PASSED [ 79%] |
| 21-Oct-2026 10:55:39 | infrastructure/utils/sorting_test.py::test_numeric_sort_key[9,11,13-expected0] PASSED [ 79%] |
| 21-Oct-2026 10:55:39 | infrastructure/utils/sorting_test.py::test_numeric_sort_key[9,11-expected1] PASSED [ 79%] |
| 21-Oct-2026 10:55:39 | infrastructure/utils/sorting_test.py::test_numeric_sort_key[V1.2-expected2] PASSED [ 79%] |
| 21-Oct-2026 10:55:39 | infrastructure/utils/sorting_test.py::test_numeric_sort_key[v1.2-expected3] PASSED [ 79%] |
| 21-Oct-2026 10:55:39 | infrastructure/utils/utils_test.py::test_find_ranges[-] PASSED [ 79%] |
| 21-Oct-2026 10:55:39 | infrastructure/utils/utils_test.py::test_find_ranges[data1-] PASSED [ 79%] |
| 21-Oct-2026 10:55:39 | infrastructure/utils/utils_test.py::test_find_ranges[1:2-1:2] PASSED [ 79%] |
| 21-Oct-2026 10:55:39 | infrastructure/utils/utils_test.py::test_find_ranges[data3-1~3] PASSED [ 80%] |
| 21-Oct-2026 10:55:39 | infrastructure/utils/utils_test.py::test_find_ranges[data4-5~12,14,16:17] PASSED [ 80%] |
| 21-Oct-2026 10:55:39 | infrastructure/utils/utils_test.py::test_find_ranges[data5-1~3,6~7] PASSED [ 80%] |
| 21-Oct-2026 10:55:39 | infrastructure/utils/utils_test.py::test_find_ranges[data6-1~3,6~7] PASSED [ 80%] |
| 21-Oct-2026 10:55:39 | infrastructure/utils/utils_test.py::test_dict_merge[a0-b0-expected0] PASSED [ 80%] |
| 21-Oct-2026 10:55:39 | infrastructure/utils/utils_test.py::test_dict_merge[a1-1-1] PASSED [ 80%] |
| 21-Oct-2026 10:55:39 | infrastructure/utils/utils_test.py::test_dict_merge[a2-b2-expected2] PASSED [ 80%] |
| 21-Oct-2026 10:55:39 | infrastructure/utils/utils_test.py::test_dict_merge[a3-b3-expected3] PASSED [ 80%] |
| 21-Oct-2026 10:55:39 | infrastructure/utils/utils_test.py::test_dict_merge[a4-b4-expected4] PASSED [ 80%] |
| 21-Oct-2026 10:55:39 | infrastructure/utils/utils_test.py::test_dict_merge[a5-b5-expected5] PASSED [ 81%] |
| 21-Oct-2026 10:55:39 | infrastructure/utils/utils_test.py::test_dict_merge[a6-b6-expected6] PASSED [ 81%] |
| 21-Oct-2026 10:55:39 | infrastructure/utils/utils_test.py::test_are_equal[a0-b0-True] PASSED [ 81%] |
| 21-Oct-2026 10:55:39 | infrastructure/utils/utils_test.py::test_are_equal[a1-b1-False] PASSED [ 81%] |
| 21-Oct-2026 10:55:39 | infrastructure/utils/utils_test.py::test_are_equal[a2-b2-False] PASSED [ 81%] |
| 21-Oct-2026 10:55:39 | infrastructure/utils/utils_test.py::test_are_equal[a3-b3-True] PASSED [ 81%] |
| 21-Oct-2026 10:55:39 | infrastructure/utils/utils_test.py::test_are_equal[a4-b4-False] PASSED [ 81%] |
| 21-Oct-2026 10:55:39 | infrastructure/utils/utils_test.py::test_approx_equal[0.01-0.012-0.01-True] PASSED [ 81%] |
| 21-Oct-2026 10:55:39 | infrastructure/utils/utils_test.py::test_approx_equal[0.01-0.012-0.001-False] PASSED [ 81%] |
| 21-Oct-2026 10:55:39 | infrastructure/utils/utils_test.py::test_approx_equal[1.0-2.0-0.1-False] PASSED [ 82%] |
| 21-Oct-2026 10:55:39 | infrastructure/utils/utils_test.py::test_approx_equal[1-2-10-True] PASSED [ 82%] |
| 21-Oct-2026 10:55:39 | infrastructure/utils/utils_test.py::test_get_num_caltable_polarizations[uid___A002_Xc46ab2_X15ae_repSPW_spw16_17_small.ms.hifa_timegaincal.s17_7.spw0.solintinf.gacal.tbl-1] PASSED [ 82%] |
| 21-Oct-2026 10:55:39 | infrastructure/utils/utils_test.py::test_get_num_caltable_polarizations[uid___A002_Xc46ab2_X15ae_repSPW_spw16_17_small.ms.hifa_timegaincal.s17_2.spw0.solintinf.gpcal.tbl-2] PASSED [ 82%] |
| 21-Oct-2026 10:55:39 | infrastructure/utils/utils_test.py::test_flagged_intervals[vec0-expected0] PASSED [ 82%] |
| 21-Oct-2026 10:55:39 | infrastructure/utils/utils_test.py::test_flagged_intervals[vec1-expected1] PASSED [ 82%] |
| 21-Oct-2026 10:55:39 | infrastructure/utils/utils_test.py::test_flagged_intervals[vec2-expected2] PASSED [ 82%] |
| 21-Oct-2026 10:55:39 | infrastructure/utils/utils_test.py::test_flagged_intervals[vec3-expected3] PASSED [ 82%] |
| 21-Oct-2026 10:55:39 | infrastructure/utils/utils_test.py::test_fieldname_for_casa[-] PASSED [ 83%] |
| 21-Oct-2026 10:55:39 | infrastructure/utils/utils_test.py::test_fieldname_for_casa[helm30-helm30] PASSED [ 83%] |
| 21-Oct-2026 10:55:39 | infrastructure/utils/utils_test.py::test_fieldname_for_casa[helm=30-"helm=30"] PASSED [ 83%] |
| 21-Oct-2026 10:55:39 | infrastructure/utils/utils_test.py::test_fieldname_for_casa[1-"1"] PASSED [ 83%] |
| 21-Oct-2026 10:55:39 | infrastructure/utils/utils_test.py::test_fieldname_clean[-] PASSED [ 83%] |
| 21-Oct-2026 10:55:39 | infrastructure/utils/utils_test.py::test_fieldname_clean[helm30-helm30] PASSED [ 83%] |
| 21-Oct-2026 10:55:39 | infrastructure/utils/utils_test.py::test_fieldname_clean[helm=30-helm_30] PASSED [ 83%] |
| 21-Oct-2026 10:55:39 | infrastructure/utils/utils_test.py::test_fieldname_clean[1-1] PASSED [ 83%] |
| 21-Oct-2026 10:55:39 | infrastructure/utils/utils_test.py::test_get_field_accessor[ms0-field0-Jupiter] PASSED [ 83%] |
| 21-Oct-2026 10:55:39 | infrastructure/utils/utils_test.py::test_get_field_accessor[ms1-field1-3] PASSED [ 84%] |
| 21-Oct-2026 10:55:39 | infrastructure/utils/utils_test.py::test_get_field_identifiers[ms0-expected0] PASSED [ 84%] |
| 21-Oct-2026 10:55:39 | infrastructure/utils/utils_test.py::test_get_field_identifiers[ms1-expected1] PASSED [ 84%] |
| 21-Oct-2026 10:55:39 | infrastructure/utils/utils_test.py::test_get_receiver_type_for_spws[ms0-spwids0-expected0] PASSED [ 84%] |
| 21-Oct-2026 10:55:39 | infrastructure/utils/utils_test.py::test_get_casa_quantity[None-expected0] PASSED [ 84%] |
| 21-Oct-2026 10:55:39 | infrastructure/utils/utils_test.py::test_get_casa_quantity[10klambda-expected1] PASSED [ 84%] |
| 21-Oct-2026 10:55:39 | infrastructure/utils/utils_test.py::test_get_casa_quantity[10.0-expected2] PASSED [ 84%] |
| 21-Oct-2026 10:55:39 | infrastructure/utils/utils_test.py::test_place_repr_source_first[itemlist0-f2-expected0] PASSED [ 84%] |
| 21-Oct-2026 10:55:39 | infrastructure/utils/utils_test.py::test_place_repr_source_first[itemlist1-f2-expected1] PASSED [ 84%] |
| 21-Oct-2026 10:55:39 | infrastructure/utils/utils_test.py::test_get_taskhistory_fromimage PASSED [ 85%] |
| 21-Oct-2026 10:55:39 | infrastructure/utils/utils_test.py::test_list_to_str[value0-[1, 2, 3]] PASSED [ 85%] |
| 21-Oct-2026 10:55:39 | infrastructure/utils/utils_test.py::test_list_to_str[value1-[1, 2, 3]] PASSED [ 85%] |
| 21-Oct-2026 10:55:39 | infrastructure/utils/utils_test.py::test_list_to_str[value2-[1, 2, 3]] PASSED [ 85%] |
| 21-Oct-2026 10:55:39 | infrastructure/utils/utils_test.py::test_list_to_str[1-1] PASSED [ 85%] |
| 21-Oct-2026 10:55:39 | infrastructure/utils/utils_test.py::test_list_to_str[value4-<lambda>] PASSED [ 85%] |
| 21-Oct-2026 10:55:39 | infrastructure/utils/utils_test.py::test_list_to_str[value5-<lambda>] PASSED [ 85%] |
| 21-Oct-2026 10:55:39 | infrastructure/utils/utils_test.py::test_list_to_str_py310[value0-[[np.int64(1)], [np.int64(2), np.int64(3)]]] PASSED [ 85%] |
| 21-Oct-2026 10:55:39 | infrastructure/utils/utils_test.py::test_build_refantignore[ea01-ignorerefant0-ea01,ea02,ea03] PASSED [ 86%] |
| 21-Oct-2026 10:55:39 | infrastructure/utils/utils_test.py::test_build_refantignore[ea01-ignorerefant1-ea01] PASSED [ 86%] |
| 21-Oct-2026 10:55:39 | infrastructure/utils/utils_test.py::test_build_refantignore[-ignorerefant2-ea02,ea03] PASSED [ 86%] |
| 21-Oct-2026 10:55:39 | infrastructure/utils/utils_test.py::test_build_refantignore[-ignorerefant3-] PASSED [ 86%] |
| 21-Oct-2026 10:55:39 | infrastructure/utils/utils_test.py::test_wrap_long_str[short_field-kwargs0-short_field] PASSED [ 86%] |
| 21-Oct-2026 10:55:39 | infrastructure/utils/utils_test.py::test_wrap_long_str[field1,field2,field3-kwargs1-field1,field2,field3] PASSED [ 86%] |
| 21-Oct-2026 10:55:39 | infrastructure/utils/utils_test.py::test_wrap_long_str[field_alpha,field_beta,field_gamma,field_delta-kwargs2-field_alpha,\nfield_beta,\nfield_gamma,\nfield_delta] PASSED [ 86%] |
| 21-Oct-2026 10:55:39 | infrastructure/utils/utils_test.py::test_wrap_long_str[field_alpha,field_beta,field_gamma,field_delta-kwargs3-field_alpha,<br>field_beta,<br>field_gamma,<br>field_delta] PASSED [ 86%] |
| 21-Oct-2026 10:55:39 | infrastructure/utils/weblog_test.py::test_OrderedDefaultdict_insertion PASSED [ 86%] |
| 21-Oct-2026 10:55:39 | infrastructure/utils/weblog_test.py::test_OrderedDefaultdict_typical_use_case PASSED [ 87%] |
| 21-Oct-2026 10:55:39 | infrastructure/utils/weblog_test.py::test_merge_td_columns[params0-expected0] PASSED [ 87%] |
| 21-Oct-2026 10:55:39 | infrastructure/utils/weblog_test.py::test_merge_td_columns[params1-expected1] PASSED [ 87%] |
| 21-Oct-2026 10:55:39 | infrastructure/utils/weblog_test.py::test_merge_td_columns[params2-expected2] PASSED [ 87%] |
| 21-Oct-2026 10:55:39 | infrastructure/utils/weblog_test.py::test_merge_td_columns_num_to_merge[0-params0-expected0] PASSED [ 87%] |
| 21-Oct-2026 10:55:39 | infrastructure/utils/weblog_test.py::test_merge_td_columns_num_to_merge[1-params1-expected1] PASSED [ 87%] |
| 21-Oct-2026 10:55:39 | infrastructure/utils/weblog_test.py::test_merge_td_columns_num_to_merge[2-params2-expected2] PASSED [ 87%] |
| 21-Oct-2026 10:55:39 | infrastructure/utils/weblog_test.py::test_merge_td_columns_num_to_merge[3-params3-expected3] PASSED [ 87%] |
| 21-Oct-2026 10:55:39 | infrastructure/utils/weblog_test.py::test_merge_td_columns_num_to_merge[20-params4-expected4] PASSED [ 87%] |
| 21-Oct-2026 10:55:39 | infrastructure/utils/weblog_test.py::test_merge_td_columns_num_to_merge[-1-params5-expected5] PASSED [ 88%] |
| 21-Oct-2026 10:55:39 | infrastructure/utils/weblog_test.py::test_merge_td_columns_vertical_align PASSED [ 88%] |
| 21-Oct-2026 10:55:39 | infrastructure/utils/weblog_test.py::test_total_time_on_target_on_source PASSED [ 88%] |
| 21-Oct-2026 10:55:39 | infrastructure/utils/weblog_test.py::test_total_time_on_source PASSED [ 88%] |
| 21-Oct-2026 10:55:39 | infrastructure/utils_test.py::test_string_to_val[True-True] PASSED [ 88%] |
| 21-Oct-2026 10:55:39 | infrastructure/utils_test.py::test_string_to_val[false-false] PASSED [ 88%] |
| 21-Oct-2026 10:55:47 | infrastructure/utils_test.py::test_string_to_val[1,2,3-1,2,3] PASSED [ 88%] |
| 21-Oct-2026 10:55:47 | infrastructure/utils_test.py::test_string_to_val[(1,2,3)-expected_value3] PASSED [ 88%] |
| 21-Oct-2026 10:55:47 | infrastructure/utils_test.py::test_string_to_val[[1,2,3]-expected_value4] PASSED [ 89%] |
| 21-Oct-2026 10:55:47 | infrastructure/utils_test.py::test_string_to_val[None-None] PASSED [ 89%] |
| 21-Oct-2026 10:55:47 | infrastructure/utils_test.py::test_string_to_val[none-none] PASSED [ 89%] |
| 21-Oct-2026 10:55:47 | infrastructure/utils_test.py::test_string_to_val['none'-none] PASSED [ 89%] |
| 21-Oct-2026 10:55:47 | infrastructure/utils_test.py::test_string_to_val[>12klambda->12klambda] PASSED [ 89%] |
| 21-Oct-2026 10:55:47 | infrastructure/utils_test.py::test_string_to_val[<12km-<12km] PASSED [ 89%] |
| 21-Oct-2026 10:55:47 | infrastructure/utils_test.py::test_string_to_val[[[0,0,1,1],[0,1,0,1]]-expected_value10] PASSED [ 89%] |
| 21-Oct-2026 10:55:47 | qa/scorecalculator_test.py::test_get_line_ranges[lines0-expected0] PASSED [ 89%] |
| 21-Oct-2026 10:55:47 | qa/scorecalculator_test.py::test_get_line_ranges[lines1-expected1] PASSED [ 89%] |
| 21-Oct-2026 10:55:47 | qa/scorecalculator_test.py::test_get_line_ranges[lines2-expected2] PASSED [ 90%] |
| 21-Oct-2026 10:55:47 | qa/scorecalculator_test.py::test_get_line_ranges[lines3-expected3] PASSED [ 90%] |
| 21-Oct-2026 10:55:47 | qa/scorecalculator_test.py::test_get_line_ranges[lines4-expected4] PASSED [ 90%] |
| 21-Oct-2026 10:55:47 | qa/scorecalculator_test.py::test_examine_sd_edge_lines[lines0-2048-edge0-False] PASSED [ 90%] |
| 21-Oct-2026 10:55:47 | qa/scorecalculator_test.py::test_examine_sd_edge_lines[lines1-1024-edge1-False] PASSED [ 90%] |
| 21-Oct-2026 10:55:47 | qa/scorecalculator_test.py::test_examine_sd_edge_lines[lines2-1024-edge2-False] PASSED [ 90%] |
| 21-Oct-2026 10:55:47 | qa/scorecalculator_test.py::test_examine_sd_edge_lines[lines3-1024-edge3-True] PASSED [ 90%] |
| 21-Oct-2026 10:55:47 | qa/scorecalculator_test.py::test_examine_sd_edge_lines[lines4-1024-edge4-True] PASSED [ 90%] |
| 21-Oct-2026 10:55:47 | qa/scorecalculator_test.py::test_examine_sd_edge_lines[lines5-1024-edge5-True] PASSED [ 90%] |
| 21-Oct-2026 10:55:47 | qa/scorecalculator_test.py::test_examine_sd_edge_lines[lines6-1024-edge6-True] PASSED [ 91%] |
| 21-Oct-2026 10:55:47 | qa/scorecalculator_test.py::test_examine_sd_edge_lines[lines7-1024-edge7-True] PASSED [ 91%] |
| 21-Oct-2026 10:55:47 | qa/scorecalculator_test.py::test_examine_sd_edge_lines[lines8-1024-edge8-True] PASSED [ 91%] |
| 21-Oct-2026 10:55:47 | qa/scorecalculator_test.py::test_examine_sd_edge_lines[lines9-1024-edge9-True] PASSED [ 91%] |
| 21-Oct-2026 10:55:47 | qa/scorecalculator_test.py::test_examine_sd_edge_lines[lines10-1024-edge10-True] PASSED [ 91%] |
| 21-Oct-2026 10:55:47 | qa/scorecalculator_test.py::test_examine_sd_edge_lines[lines11-1024-edge11-True] PASSED [ 91%] |
| 21-Oct-2026 10:55:47 | qa/scorecalculator_test.py::test_examine_sd_edge_lines[lines12-1024-edge12-True] PASSED [ 91%] |
| 21-Oct-2026 10:55:47 | qa/scorecalculator_test.py::test_examine_sd_edge_lines[lines13-1024-edge13-True] PASSED [ 91%] |
| 21-Oct-2026 10:55:47 | qa/scorecalculator_test.py::test_examine_sd_edge_lines[lines14-1024-edge14-True] PASSED [ 92%] |
| 21-Oct-2026 10:55:47 | qa/scorecalculator_test.py::test_examine_sd_edge_lines[lines15-1024-edge15-False] PASSED [ 92%] |
| 21-Oct-2026 10:55:47 | qa/scorecalculator_test.py::test_examine_sd_edge_lines[lines16-1024-edge16-True] PASSED [ 92%] |
| 21-Oct-2026 10:55:47 | qa/scorecalculator_test.py::test_examine_sd_edge_lines[lines17-1024-edge17-False] PASSED [ 92%] |
| 21-Oct-2026 10:55:47 | qa/scorecalculator_test.py::test_examine_sd_wide_lines[lines0-2048-edge0-False] PASSED [ 92%] |
| 21-Oct-2026 10:55:47 | qa/scorecalculator_test.py::test_examine_sd_wide_lines[lines1-1024-edge1-False] PASSED [ 92%] |
| 21-Oct-2026 10:55:47 | qa/scorecalculator_test.py::test_examine_sd_wide_lines[lines2-2048-edge2-False] PASSED [ 92%] |
| 21-Oct-2026 10:55:47 | qa/scorecalculator_test.py::test_examine_sd_wide_lines[lines3-1024-edge3-True] PASSED [ 92%] |
| 21-Oct-2026 10:55:47 | qa/scorecalculator_test.py::test_examine_sd_wide_lines[lines4-1024-edge4-True] PASSED [ 92%] |
| 21-Oct-2026 10:55:47 | qa/scorecalculator_test.py::test_examine_sd_wide_lines[lines5-1024-edge5-True] PASSED [ 93%] |
| 21-Oct-2026 10:55:47 | qa/scorecalculator_test.py::test_examine_sd_wide_lines[lines6-2048-edge6-True] PASSED [ 93%] |
| 21-Oct-2026 10:55:47 | qa/scorecalculator_test.py::test_examine_sd_wide_lines[lines7-1024-edge7-False] PASSED [ 93%] |
| 21-Oct-2026 10:55:47 | qa/scorecalculator_test.py::test_examine_sd_wide_lines[lines8-1024-edge8-True] PASSED [ 93%] |
| 21-Oct-2026 10:55:47 | qa/scorecalculator_test.py::test_examine_sd_wide_lines[lines9-1024-edge9-True] PASSED [ 93%] |
| 21-Oct-2026 10:55:47 | qa/scorecalculator_test.py::test_examine_sd_wide_lines[lines10-1024-edge10-True] PASSED [ 93%] |
| 21-Oct-2026 10:55:47 | qa/scorecalculator_test.py::test_examine_sd_wide_lines[lines11-1024-edge11-True] PASSED [ 93%] |
| 21-Oct-2026 10:55:47 | qa/scorecalculator_test.py::test_channel_ranges_for_image[edge0-16-1-ranges0-expected0] PASSED [ 93%] |
| 21-Oct-2026 10:55:47 | qa/scorecalculator_test.py::test_channel_ranges_for_image[edge1-16--1-ranges1-expected1] PASSED [ 93%] |
| 21-Oct-2026 10:55:47 | qa/scorecalculator_test.py::test_channel_ranges_for_image[edge2-16-1-ranges2-expected2] PASSED [ 94%] |
| 21-Oct-2026 10:55:47 | qa/scorecalculator_test.py::test_channel_ranges_for_image[edge3-16-1-ranges3-expected3] PASSED [ 94%] |
| 21-Oct-2026 10:55:47 | qa/scorecalculator_test.py::test_channel_ranges_for_image[edge4-16--1-ranges4-expected4] PASSED [ 94%] |
| 21-Oct-2026 10:55:47 | qa/scorecalculator_test.py::test_channel_ranges_for_image[edge5-16--1-ranges5-expected5] PASSED [ 94%] |
| 21-Oct-2026 10:55:47 | qa/scorecalculator_test.py::test_log_qa_weblog_disabled[return_val0-expected_infos0-expected_warns0] PASSED [ 94%] |
| 21-Oct-2026 10:55:47 | qa/scorecalculator_test.py::test_log_qa_weblog_disabled[return_val1-expected_infos1-expected_warns1] PASSED [ 94%] |
| 21-Oct-2026 10:55:47 | qa/scorecalculator_test.py::test_log_qa_weblog_disabled[return_val2-expected_infos2-expected_warns2] PASSED [ 94%] |
| 21-Oct-2026 10:55:47 | qa/scorecalculator_test.py::test_log_qa_weblog_disabled[return_val3-expected_infos3-expected_warns3] PASSED [ 94%] |
| 21-Oct-2026 10:55:47 | qa/scorecalculator_test.py::test_log_qa_weblog_disabled[return_val4-expected_infos4-expected_warns4] PASSED [ 95%] |
| 21-Oct-2026 10:55:47 | qa/scorecalculator_test.py::test_log_qa_weblog_disabled[return_val5-expected_infos5-expected_warns5] PASSED [ 95%] |
| 21-Oct-2026 10:55:47 | qa/scorecalculator_test.py::test_log_qa_weblog_disabled[None-expected_infos6-expected_warns6] PASSED [ 95%] |
| 21-Oct-2026 10:55:47 | qa/scorecalculator_test.py::test_log_qa_weblog_disabled[0.85-expected_infos7-expected_warns7] PASSED [ 95%] |
| 21-Oct-2026 10:55:47 | qa/scorecalculator_test.py::test_log_qa_weblog_enabled PASSED [ 95%] |
| 21-Oct-2026 10:55:47 | qa/scorecalculator_test.py::test_score_amp_vs_time_plots_weblog_disabled PASSED [ 95%] |
| 21-Oct-2026 10:55:47 | qa/scorecalculator_test.py::test_results_accept_respects_disable_qa[True-False] PASSED [ 95%] |
| 21-Oct-2026 10:55:47 | qa/scorecalculator_test.py::test_results_accept_respects_disable_qa[False-True] PASSED [ 95%] |
| 21-Oct-2026 10:55:47 | recipes/recipe_converter_test.py::test_get_recipe_dir PASSED [ 95%] |
| 21-Oct-2026 10:55:47 | recipes/recipe_converter_test.py::test_get_cli_dir[hsd] PASSED [ 96%] |
| 21-Oct-2026 10:55:47 | recipes/recipe_converter_test.py::test_get_cli_dir[hif] PASSED [ 96%] |
| 21-Oct-2026 10:55:47 | recipes/recipe_converter_test.py::test_get_cli_dir[blah] PASSED [ 96%] |
| 21-Oct-2026 10:55:47 | recipes/recipe_converter_test.py::test_get_element[<root><a><b>data</b></a></root>-b-1] PASSED [ 96%] |
| 21-Oct-2026 10:55:47 | recipes/recipe_converter_test.py::test_get_element[<root><a><b>data</b></a></root>-a-1] PASSED [ 96%] |
| 21-Oct-2026 10:55:47 | recipes/recipe_converter_test.py::test_get_element[<root><a><b>data</b></a></root>-c-0] PASSED [ 96%] |
| 21-Oct-2026 10:55:47 | recipes/recipe_converter_test.py::test_get_element[<root><a><b>data</b><b>data</b></a></root>-b-2] PASSED [ 96%] |
| 21-Oct-2026 10:55:47 | recipes/recipe_converter_test.py::test_get_data[<a>data</a>-data] PASSED [ 96%] |
| 21-Oct-2026 10:55:47 | recipes/recipe_converter_test.py::test_get_data[<a><b>data</b></a>-AttributeError] PASSED [ 96%] |
| 21-Oct-2026 10:55:47 | recipes/recipe_converter_test.py::test_parse_parameter[<root><Keyword>spw</Keyword><Value>0</Value></root>-expected0] PASSED [ 97%] |
| 21-Oct-2026 10:55:47 | recipes/recipe_converter_test.py::test_parse_command[<ProcessingCommand><Command>h_save</Command><ParameterSet></ParameterSet></ProcessingCommand>-expected0] PASSED [ 97%] |
| 21-Oct-2026 10:55:47 | recipes/recipe_converter_test.py::test_parse_command[<ProcessingCommand><Command>h_save</Command><ParameterSet><Parameter><Keyword>filename</Keyword><Value>output.context</Value></Parameter></ParameterSet></ProcessingCommand>-expected1] PASSED [ 97%] |
| 21-Oct-2026 10:55:47 | recipes/recipe_converter_test.py::test_parse_command[<ProcessingCommand><Command>breakpoint</Command><ParameterSet></ParameterSet></ProcessingCommand>-expected2] PASSED [ 97%] |
| 21-Oct-2026 10:55:47 | recipes/recipe_converter_test.py::test_parse_command[<ProcessingCommand><task><shortdescription>do something</shortdescription></task></ProcessingCommand>-AssertionError] PASSED [ 97%] |
| 21-Oct-2026 10:55:47 | recipes/recipe_converter_test.py::test_parse_command[<ProcessingCommand><Command>h_init</Command><ParameterSet></ParameterSet><Command>h_save</Command><ParameterSet></ParameterSet></ProcessingCommand>-AssertionError] PASSED [ 97%] |
| 21-Oct-2026 10:55:47 | recipes/recipe_converter_test.py::test_parse_command[<ProcessingCommand><Command>h_save</Command></ProcessingCommand>-AssertionError] PASSED [ 97%] |
| 21-Oct-2026 10:55:47 | recipes/recipe_converter_test.py::test_parse[<ProcessingProcedure></ProcessingProcedure>-AssertionError] PASSED [ 97%] |
| 21-Oct-2026 10:55:49 | recipes/recipe_converter_test.py::test_parse[<ProcessingProcedure><ProcedureTitle>h_test</ProcedureTitle><ProcessingCommand><Command>h_save</Command><ParameterSet></ParameterSet></ProcessingCommand></ProcessingProcedure>-expected1] PASSED [ 98%] |
| 21-Oct-2026 10:55:49 | recipes/recipe_converter_test.py::test_get_comment[breakpoint-config0- # ---- breakpoint ----] PASSED [ 98%] |
| 21-Oct-2026 10:55:49 | recipes/recipe_converter_test.py::test_get_comment[breakpoint-config1- # ---- breakpoint ----] PASSED [ 98%] |
| 21-Oct-2026 10:55:49 | recipes/recipe_converter_test.py::test_get_comment[hsd_baseline-config2-] PASSED [ 98%] |
| 21-Oct-2026 10:55:49 | recipes/recipe_converter_test.py::test_get_comment[hsd_baseline-config3- # This is comment\n] PASSED [ 98%] |
| 21-Oct-2026 10:55:49 | recipes/recipe_converter_test.py::test_get_comment[hsd_baseline-config4- # This is comment\n] PASSED [ 98%] |
| 21-Oct-2026 10:55:49 | recipes/recipe_converter_test.py::test_get_comment[hsd_baseline-config5- # This is \n # multi-line comment\n] PASSED [ 98%] |
| 21-Oct-2026 10:55:49 | recipes/recipe_converter_test.py::test_get_comment[hsd_baseline-config6- # This is \n # multi-line comment\n] PASSED [ 98%] |
| 21-Oct-2026 10:55:49 | recipes/recipe_converter_test.py::test_get_execution_command[breakpoint-config0-] PASSED [ 98%] |
| 21-Oct-2026 10:55:49 | recipes/recipe_converter_test.py::test_get_execution_command[hsd_baseline-config1- hsd_baseline()] PASSED [ 99%] |
| 21-Oct-2026 10:55:49 | recipes/recipe_converter_test.py::test_get_execution_command[hsd_baseline-config2- hsd_baseline(pstr='strval', pint=3)] PASSED [ 99%] |
| 21-Oct-2026 10:55:49 | recipes/recipe_converter_test.py::test_get_execution_command[hsd_importdata-config3- hsd_importdata(vis=vislist)\n\n if importonly:\n raise Exception(IMPORT_ONLY)] PASSED [ 99%] |
| 21-Oct-2026 10:55:49 | recipes/recipe_converter_test.py::test_c2p PASSED [ 99%] |
| 21-Oct-2026 10:55:49 | recipes/recipe_converter_test.py::test_to_procedure PASSED [ 99%] |
| 21-Oct-2026 10:55:49 | recipes/recipe_converter_test.py::test_export[False-] PASSED [ 99%] |
| 21-Oct-2026 10:55:49 | recipes/recipe_converter_test.py::test_export[True-plotlevel='summary'] PASSED [ 99%] |
| 21-Oct-2026 10:55:49 | recipes/recipe_converter_test.py::test_main SKIPPED (Skip testing ma...) [ 99%] |
| 21-Oct-2026 10:55:49 | recipes/recipe_converter_test.py::test_generate_all SKIPPED (Skip te...) [100%] |
| 21-Oct-2026 10:55:49 | |
| 21-Oct-2026 10:55:49 | =============================== warnings summary =============================== |
| 21-Oct-2026 10:55:49 | ../../casa-6.7.7-15-pipeline-2026.3.0.35+dirty-py3.12.el8/lib/py/lib/python3.12/site-packages/casaconfig/private/get_data_info.py:195 |
| 21-Oct-2026 10:55:49 | /lustre/cv/sw/casa/casaci/cvpost128/bamboohome/xml-data/build-dir/PIPESPECS-TESTPIPEMAINCASAMASTER-ML228PY312TEST/casa-build-utils/pipeline/workdir/casa-6.7.7-15-pipeline-2026.3.0.35+dirty-py3.12.el8/lib/py/lib/python3.12/site-packages/casaconfig/private/get_data_info.py:195: DeprecationWarning: read_text is deprecated. Use files() instead. Refer to https://importlib-resources.readthedocs.io/en/latest/using.html#migrating-from-legacy for migration advice. |
| 21-Oct-2026 10:55:49 | readme_lines = importlib.resources.read_text('casaconfig','release_data_readme.txt').split('\n') |
| 21-Oct-2026 10:55:49 | |
| 21-Oct-2026 10:55:49 | ../../casa-6.7.7-15-pipeline-2026.3.0.35+dirty-py3.12.el8/lib/py/lib/python3.12/importlib/resources/_legacy.py:79 |
| 21-Oct-2026 10:55:49 | /lustre/cv/sw/casa/casaci/cvpost128/bamboohome/xml-data/build-dir/PIPESPECS-TESTPIPEMAINCASAMASTER-ML228PY312TEST/casa-build-utils/pipeline/workdir/casa-6.7.7-15-pipeline-2026.3.0.35+dirty-py3.12.el8/lib/py/lib/python3.12/importlib/resources/_legacy.py:79: DeprecationWarning: open_text is deprecated. Use files() instead. Refer to https://importlib-resources.readthedocs.io/en/latest/using.html#migrating-from-legacy for migration advice. |
| 21-Oct-2026 10:55:49 | with open_text(package, resource, encoding, errors) as fp: |
| 21-Oct-2026 10:55:49 | |
| 21-Oct-2026 10:55:49 | ../../casa-6.7.7-15-pipeline-2026.3.0.35+dirty-py3.12.el8/lib/py/lib/python3.12/site-packages/google/protobuf/internal/well_known_types.py:91 |
| 21-Oct-2026 10:55:49 | /lustre/cv/sw/casa/casaci/cvpost128/bamboohome/xml-data/build-dir/PIPESPECS-TESTPIPEMAINCASAMASTER-ML228PY312TEST/casa-build-utils/pipeline/workdir/casa-6.7.7-15-pipeline-2026.3.0.35+dirty-py3.12.el8/lib/py/lib/python3.12/site-packages/google/protobuf/internal/well_known_types.py:91: DeprecationWarning: datetime.datetime.utcfromtimestamp() is deprecated and scheduled for removal in a future version. Use timezone-aware objects to represent datetimes in UTC: datetime.datetime.fromtimestamp(timestamp, datetime.UTC). |
| 21-Oct-2026 10:55:49 | _EPOCH_DATETIME_NAIVE = datetime.datetime.utcfromtimestamp(0) |
| 21-Oct-2026 10:55:49 | |
| 21-Oct-2026 10:55:49 | ../../casa-6.7.7-15-pipeline-2026.3.0.35+dirty-py3.12.el8/lib/py/lib/python3.12/site-packages/casaplotms/private/plotms_pb2.py:19 |
| 21-Oct-2026 10:55:49 | /lustre/cv/sw/casa/casaci/cvpost128/bamboohome/xml-data/build-dir/PIPESPECS-TESTPIPEMAINCASAMASTER-ML228PY312TEST/casa-build-utils/pipeline/workdir/casa-6.7.7-15-pipeline-2026.3.0.35+dirty-py3.12.el8/lib/py/lib/python3.12/site-packages/casaplotms/private/plotms_pb2.py:19: DeprecationWarning: Call to deprecated create function FileDescriptor(). Note: Create unlinked descriptors is going to go away. Please use get/find descriptors from generated code or query the descriptor_pool. |
| 21-Oct-2026 10:55:49 | DESCRIPTOR = _descriptor.FileDescriptor( |
| 21-Oct-2026 10:55:49 | |
| 21-Oct-2026 10:55:49 | ../../casa-6.7.7-15-pipeline-2026.3.0.35+dirty-py3.12.el8/lib/py/lib/python3.12/site-packages/casaplotms/private/plotms_pb2.py:38 |
| 21-Oct-2026 10:55:49 | /lustre/cv/sw/casa/casaci/cvpost128/bamboohome/xml-data/build-dir/PIPESPECS-TESTPIPEMAINCASAMASTER-ML228PY312TEST/casa-build-utils/pipeline/workdir/casa-6.7.7-15-pipeline-2026.3.0.35+dirty-py3.12.el8/lib/py/lib/python3.12/site-packages/casaplotms/private/plotms_pb2.py:38: DeprecationWarning: Call to deprecated create function FieldDescriptor(). Note: Create unlinked descriptors is going to go away. Please use get/find descriptors from generated code or query the descriptor_pool. |
| 21-Oct-2026 10:55:49 | _descriptor.FieldDescriptor( |
| 21-Oct-2026 10:55:49 | |
| 21-Oct-2026 10:55:49 | ../../casa-6.7.7-15-pipeline-2026.3.0.35+dirty-py3.12.el8/lib/py/lib/python3.12/site-packages/casaplotms/private/plotms_pb2.py:31 |
| 21-Oct-2026 10:55:49 | /lustre/cv/sw/casa/casaci/cvpost128/bamboohome/xml-data/build-dir/PIPESPECS-TESTPIPEMAINCASAMASTER-ML228PY312TEST/casa-build-utils/pipeline/workdir/casa-6.7.7-15-pipeline-2026.3.0.35+dirty-py3.12.el8/lib/py/lib/python3.12/site-packages/casaplotms/private/plotms_pb2.py:31: DeprecationWarning: Call to deprecated create function Descriptor(). Note: Create unlinked descriptors is going to go away. Please use get/find descriptors from generated code or query the descriptor_pool. |
| 21-Oct-2026 10:55:49 | _PID = _descriptor.Descriptor( |
| 21-Oct-2026 10:55:49 | |
| 21-Oct-2026 10:55:49 | ../../casa-6.7.7-15-pipeline-2026.3.0.35+dirty-py3.12.el8/lib/py/lib/python3.12/site-packages/casaplotms/private/plotms_pb2.py:69 |
| 21-Oct-2026 10:55:49 | /lustre/cv/sw/casa/casaci/cvpost128/bamboohome/xml-data/build-dir/PIPESPECS-TESTPIPEMAINCASAMASTER-ML228PY312TEST/casa-build-utils/pipeline/workdir/casa-6.7.7-15-pipeline-2026.3.0.35+dirty-py3.12.el8/lib/py/lib/python3.12/site-packages/casaplotms/private/plotms_pb2.py:69: DeprecationWarning: Call to deprecated create function FieldDescriptor(). Note: Create unlinked descriptors is going to go away. Please use get/find descriptors from generated code or query the descriptor_pool. |
| 21-Oct-2026 10:55:49 | _descriptor.FieldDescriptor( |
| 21-Oct-2026 10:55:49 | |
| 21-Oct-2026 10:55:49 | ../../casa-6.7.7-15-pipeline-2026.3.0.35+dirty-py3.12.el8/lib/py/lib/python3.12/site-packages/casaplotms/private/plotms_pb2.py:62 |
| 21-Oct-2026 10:55:49 | /lustre/cv/sw/casa/casaci/cvpost128/bamboohome/xml-data/build-dir/PIPESPECS-TESTPIPEMAINCASAMASTER-ML228PY312TEST/casa-build-utils/pipeline/workdir/casa-6.7.7-15-pipeline-2026.3.0.35+dirty-py3.12.el8/lib/py/lib/python3.12/site-packages/casaplotms/private/plotms_pb2.py:62: DeprecationWarning: Call to deprecated create function Descriptor(). Note: Create unlinked descriptors is going to go away. Please use get/find descriptors from generated code or query the descriptor_pool. |
| 21-Oct-2026 10:55:49 | _NUMPLOTS = _descriptor.Descriptor( |
| 21-Oct-2026 10:55:49 | |
| 21-Oct-2026 10:55:49 | ../../casa-6.7.7-15-pipeline-2026.3.0.35+dirty-py3.12.el8/lib/py/lib/python3.12/site-packages/casaplotms/private/plotms_pb2.py:100 |
| 21-Oct-2026 10:55:49 | /lustre/cv/sw/casa/casaci/cvpost128/bamboohome/xml-data/build-dir/PIPESPECS-TESTPIPEMAINCASAMASTER-ML228PY312TEST/casa-build-utils/pipeline/workdir/casa-6.7.7-15-pipeline-2026.3.0.35+dirty-py3.12.el8/lib/py/lib/python3.12/site-packages/casaplotms/private/plotms_pb2.py:100: DeprecationWarning: Call to deprecated create function FieldDescriptor(). Note: Create unlinked descriptors is going to go away. Please use get/find descriptors from generated code or query the descriptor_pool. |
| 21-Oct-2026 10:55:49 | _descriptor.FieldDescriptor( |
| 21-Oct-2026 10:55:49 | |
| 21-Oct-2026 10:55:49 | ../../casa-6.7.7-15-pipeline-2026.3.0.35+dirty-py3.12.el8/lib/py/lib/python3.12/site-packages/casaplotms/private/plotms_pb2.py:93 |
| 21-Oct-2026 10:55:49 | /lustre/cv/sw/casa/casaci/cvpost128/bamboohome/xml-data/build-dir/PIPESPECS-TESTPIPEMAINCASAMASTER-ML228PY312TEST/casa-build-utils/pipeline/workdir/casa-6.7.7-15-pipeline-2026.3.0.35+dirty-py3.12.el8/lib/py/lib/python3.12/site-packages/casaplotms/private/plotms_pb2.py:93: DeprecationWarning: Call to deprecated create function Descriptor(). Note: Create unlinked descriptors is going to go away. Please use get/find descriptors from generated code or query the descriptor_pool. |
| 21-Oct-2026 10:55:49 | _TOGGLE = _descriptor.Descriptor( |
| 21-Oct-2026 10:55:49 | |
| 21-Oct-2026 10:55:49 | ../../casa-6.7.7-15-pipeline-2026.3.0.35+dirty-py3.12.el8/lib/py/lib/python3.12/site-packages/casaplotms/private/plotms_pb2.py:131 |
| 21-Oct-2026 10:55:49 | /lustre/cv/sw/casa/casaci/cvpost128/bamboohome/xml-data/build-dir/PIPESPECS-TESTPIPEMAINCASAMASTER-ML228PY312TEST/casa-build-utils/pipeline/workdir/casa-6.7.7-15-pipeline-2026.3.0.35+dirty-py3.12.el8/lib/py/lib/python3.12/site-packages/casaplotms/private/plotms_pb2.py:131: DeprecationWarning: Call to deprecated create function FieldDescriptor(). Note: Create unlinked descriptors is going to go away. Please use get/find descriptors from generated code or query the descriptor_pool. |
| 21-Oct-2026 10:55:49 | _descriptor.FieldDescriptor( |
| 21-Oct-2026 10:55:49 | |
| 21-Oct-2026 10:55:49 | ../../casa-6.7.7-15-pipeline-2026.3.0.35+dirty-py3.12.el8/lib/py/lib/python3.12/site-packages/casaplotms/private/plotms_pb2.py:138 |
| 21-Oct-2026 10:55:49 | /lustre/cv/sw/casa/casaci/cvpost128/bamboohome/xml-data/build-dir/PIPESPECS-TESTPIPEMAINCASAMASTER-ML228PY312TEST/casa-build-utils/pipeline/workdir/casa-6.7.7-15-pipeline-2026.3.0.35+dirty-py3.12.el8/lib/py/lib/python3.12/site-packages/casaplotms/private/plotms_pb2.py:138: DeprecationWarning: Call to deprecated create function FieldDescriptor(). Note: Create unlinked descriptors is going to go away. Please use get/find descriptors from generated code or query the descriptor_pool. |
| 21-Oct-2026 10:55:49 | _descriptor.FieldDescriptor( |
| 21-Oct-2026 10:55:49 | |
| 21-Oct-2026 10:55:49 | ../../casa-6.7.7-15-pipeline-2026.3.0.35+dirty-py3.12.el8/lib/py/lib/python3.12/site-packages/casaplotms/private/plotms_pb2.py:124 |
| 21-Oct-2026 10:55:49 | /lustre/cv/sw/casa/casaci/cvpost128/bamboohome/xml-data/build-dir/PIPESPECS-TESTPIPEMAINCASAMASTER-ML228PY312TEST/casa-build-utils/pipeline/workdir/casa-6.7.7-15-pipeline-2026.3.0.35+dirty-py3.12.el8/lib/py/lib/python3.12/site-packages/casaplotms/private/plotms_pb2.py:124: DeprecationWarning: Call to deprecated create function Descriptor(). Note: Create unlinked descriptors is going to go away. Please use get/find descriptors from generated code or query the descriptor_pool. |
| 21-Oct-2026 10:55:49 | _GRIDSIZE = _descriptor.Descriptor( |
| 21-Oct-2026 10:55:49 | |
| 21-Oct-2026 10:55:49 | ../../casa-6.7.7-15-pipeline-2026.3.0.35+dirty-py3.12.el8/lib/py/lib/python3.12/site-packages/casaplotms/private/plotms_pb2.py:169 |
| 21-Oct-2026 10:55:49 | /lustre/cv/sw/casa/casaci/cvpost128/bamboohome/xml-data/build-dir/PIPESPECS-TESTPIPEMAINCASAMASTER-ML228PY312TEST/casa-build-utils/pipeline/workdir/casa-6.7.7-15-pipeline-2026.3.0.35+dirty-py3.12.el8/lib/py/lib/python3.12/site-packages/casaplotms/private/plotms_pb2.py:169: DeprecationWarning: Call to deprecated create function FieldDescriptor(). Note: Create unlinked descriptors is going to go away. Please use get/find descriptors from generated code or query the descriptor_pool. |
| 21-Oct-2026 10:55:49 | _descriptor.FieldDescriptor( |
| 21-Oct-2026 10:55:49 | |
| 21-Oct-2026 10:55:49 | ../../casa-6.7.7-15-pipeline-2026.3.0.35+dirty-py3.12.el8/lib/py/lib/python3.12/site-packages/casaplotms/private/plotms_pb2.py:176 |
| 21-Oct-2026 10:55:49 | /lustre/cv/sw/casa/casaci/cvpost128/bamboohome/xml-data/build-dir/PIPESPECS-TESTPIPEMAINCASAMASTER-ML228PY312TEST/casa-build-utils/pipeline/workdir/casa-6.7.7-15-pipeline-2026.3.0.35+dirty-py3.12.el8/lib/py/lib/python3.12/site-packages/casaplotms/private/plotms_pb2.py:176: DeprecationWarning: Call to deprecated create function FieldDescriptor(). Note: Create unlinked descriptors is going to go away. Please use get/find descriptors from generated code or query the descriptor_pool. |
| 21-Oct-2026 10:55:49 | _descriptor.FieldDescriptor( |
| 21-Oct-2026 10:55:49 | |
| 21-Oct-2026 10:55:49 | ../../casa-6.7.7-15-pipeline-2026.3.0.35+dirty-py3.12.el8/lib/py/lib/python3.12/site-packages/casaplotms/private/plotms_pb2.py:183 |
| 21-Oct-2026 10:55:49 | /lustre/cv/sw/casa/casaci/cvpost128/bamboohome/xml-data/build-dir/PIPESPECS-TESTPIPEMAINCASAMASTER-ML228PY312TEST/casa-build-utils/pipeline/workdir/casa-6.7.7-15-pipeline-2026.3.0.35+dirty-py3.12.el8/lib/py/lib/python3.12/site-packages/casaplotms/private/plotms_pb2.py:183: DeprecationWarning: Call to deprecated create function FieldDescriptor(). Note: Create unlinked descriptors is going to go away. Please use get/find descriptors from generated code or query the descriptor_pool. |
| 21-Oct-2026 10:55:49 | _descriptor.FieldDescriptor( |
| 21-Oct-2026 10:55:49 | |
| 21-Oct-2026 10:55:49 | ../../casa-6.7.7-15-pipeline-2026.3.0.35+dirty-py3.12.el8/lib/py/lib/python3.12/site-packages/casaplotms/private/plotms_pb2.py:162 |
| 21-Oct-2026 10:55:49 | /lustre/cv/sw/casa/casaci/cvpost128/bamboohome/xml-data/build-dir/PIPESPECS-TESTPIPEMAINCASAMASTER-ML228PY312TEST/casa-build-utils/pipeline/workdir/casa-6.7.7-15-pipeline-2026.3.0.35+dirty-py3.12.el8/lib/py/lib/python3.12/site-packages/casaplotms/private/plotms_pb2.py:162: DeprecationWarning: Call to deprecated create function Descriptor(). Note: Create unlinked descriptors is going to go away. Please use get/find descriptors from generated code or query the descriptor_pool. |
| 21-Oct-2026 10:55:49 | _SETVIS = _descriptor.Descriptor( |
| 21-Oct-2026 10:55:49 | |
| 21-Oct-2026 10:55:49 | ../../casa-6.7.7-15-pipeline-2026.3.0.35+dirty-py3.12.el8/lib/py/lib/python3.12/site-packages/casaplotms/private/plotms_pb2.py:214 |
| 21-Oct-2026 10:55:49 | /lustre/cv/sw/casa/casaci/cvpost128/bamboohome/xml-data/build-dir/PIPESPECS-TESTPIPEMAINCASAMASTER-ML228PY312TEST/casa-build-utils/pipeline/workdir/casa-6.7.7-15-pipeline-2026.3.0.35+dirty-py3.12.el8/lib/py/lib/python3.12/site-packages/casaplotms/private/plotms_pb2.py:214: DeprecationWarning: Call to deprecated create function FieldDescriptor(). Note: Create unlinked descriptors is going to go away. Please use get/find descriptors from generated code or query the descriptor_pool. |
| 21-Oct-2026 10:55:49 | _descriptor.FieldDescriptor( |
| 21-Oct-2026 10:55:49 | |
| 21-Oct-2026 10:55:49 | ../../casa-6.7.7-15-pipeline-2026.3.0.35+dirty-py3.12.el8/lib/py/lib/python3.12/site-packages/casaplotms/private/plotms_pb2.py:221 |
| 21-Oct-2026 10:55:49 | /lustre/cv/sw/casa/casaci/cvpost128/bamboohome/xml-data/build-dir/PIPESPECS-TESTPIPEMAINCASAMASTER-ML228PY312TEST/casa-build-utils/pipeline/workdir/casa-6.7.7-15-pipeline-2026.3.0.35+dirty-py3.12.el8/lib/py/lib/python3.12/site-packages/casaplotms/private/plotms_pb2.py:221: DeprecationWarning: Call to deprecated create function FieldDescriptor(). Note: Create unlinked descriptors is going to go away. Please use get/find descriptors from generated code or query the descriptor_pool. |
| 21-Oct-2026 10:55:49 | _descriptor.FieldDescriptor( |
| 21-Oct-2026 10:55:49 | |
| 21-Oct-2026 10:55:49 | ../../casa-6.7.7-15-pipeline-2026.3.0.35+dirty-py3.12.el8/lib/py/lib/python3.12/site-packages/casaplotms/private/plotms_pb2.py:228 |
| 21-Oct-2026 10:55:49 | /lustre/cv/sw/casa/casaci/cvpost128/bamboohome/xml-data/build-dir/PIPESPECS-TESTPIPEMAINCASAMASTER-ML228PY312TEST/casa-build-utils/pipeline/workdir/casa-6.7.7-15-pipeline-2026.3.0.35+dirty-py3.12.el8/lib/py/lib/python3.12/site-packages/casaplotms/private/plotms_pb2.py:228: DeprecationWarning: Call to deprecated create function FieldDescriptor(). Note: Create unlinked descriptors is going to go away. Please use get/find descriptors from generated code or query the descriptor_pool. |
| 21-Oct-2026 10:55:49 | _descriptor.FieldDescriptor( |
| 21-Oct-2026 10:55:49 | |
| 21-Oct-2026 10:55:49 | ../../casa-6.7.7-15-pipeline-2026.3.0.35+dirty-py3.12.el8/lib/py/lib/python3.12/site-packages/casaplotms/private/plotms_pb2.py:235 |
| 21-Oct-2026 10:55:49 | /lustre/cv/sw/casa/casaci/cvpost128/bamboohome/xml-data/build-dir/PIPESPECS-TESTPIPEMAINCASAMASTER-ML228PY312TEST/casa-build-utils/pipeline/workdir/casa-6.7.7-15-pipeline-2026.3.0.35+dirty-py3.12.el8/lib/py/lib/python3.12/site-packages/casaplotms/private/plotms_pb2.py:235: DeprecationWarning: Call to deprecated create function FieldDescriptor(). Note: Create unlinked descriptors is going to go away. Please use get/find descriptors from generated code or query the descriptor_pool. |
| 21-Oct-2026 10:55:49 | _descriptor.FieldDescriptor( |
| 21-Oct-2026 10:55:49 | |
| 21-Oct-2026 10:55:49 | ../../casa-6.7.7-15-pipeline-2026.3.0.35+dirty-py3.12.el8/lib/py/lib/python3.12/site-packages/casaplotms/private/plotms_pb2.py:242 |
| 21-Oct-2026 10:55:49 | /lustre/cv/sw/casa/casaci/cvpost128/bamboohome/xml-data/build-dir/PIPESPECS-TESTPIPEMAINCASAMASTER-ML228PY312TEST/casa-build-utils/pipeline/workdir/casa-6.7.7-15-pipeline-2026.3.0.35+dirty-py3.12.el8/lib/py/lib/python3.12/site-packages/casaplotms/private/plotms_pb2.py:242: DeprecationWarning: Call to deprecated create function FieldDescriptor(). Note: Create unlinked descriptors is going to go away. Please use get/find descriptors from generated code or query the descriptor_pool. |
| 21-Oct-2026 10:55:49 | _descriptor.FieldDescriptor( |
| 21-Oct-2026 10:55:49 | |
| 21-Oct-2026 10:55:49 | ../../casa-6.7.7-15-pipeline-2026.3.0.35+dirty-py3.12.el8/lib/py/lib/python3.12/site-packages/casaplotms/private/plotms_pb2.py:249 |
| 21-Oct-2026 10:55:49 | /lustre/cv/sw/casa/casaci/cvpost128/bamboohome/xml-data/build-dir/PIPESPECS-TESTPIPEMAINCASAMASTER-ML228PY312TEST/casa-build-utils/pipeline/workdir/casa-6.7.7-15-pipeline-2026.3.0.35+dirty-py3.12.el8/lib/py/lib/python3.12/site-packages/casaplotms/private/plotms_pb2.py:249: DeprecationWarning: Call to deprecated create function FieldDescriptor(). Note: Create unlinked descriptors is going to go away. Please use get/find descriptors from generated code or query the descriptor_pool. |
| 21-Oct-2026 10:55:49 | _descriptor.FieldDescriptor( |
| 21-Oct-2026 10:55:49 | |
| 21-Oct-2026 10:55:49 | ../../casa-6.7.7-15-pipeline-2026.3.0.35+dirty-py3.12.el8/lib/py/lib/python3.12/site-packages/casaplotms/private/plotms_pb2.py:256 |
| 21-Oct-2026 10:55:49 | /lustre/cv/sw/casa/casaci/cvpost128/bamboohome/xml-data/build-dir/PIPESPECS-TESTPIPEMAINCASAMASTER-ML228PY312TEST/casa-build-utils/pipeline/workdir/casa-6.7.7-15-pipeline-2026.3.0.35+dirty-py3.12.el8/lib/py/lib/python3.12/site-packages/casaplotms/private/plotms_pb2.py:256: DeprecationWarning: Call to deprecated create function FieldDescriptor(). Note: Create unlinked descriptors is going to go away. Please use get/find descriptors from generated code or query the descriptor_pool. |
| 21-Oct-2026 10:55:49 | _descriptor.FieldDescriptor( |
| 21-Oct-2026 10:55:49 | |
| 21-Oct-2026 10:55:49 | ../../casa-6.7.7-15-pipeline-2026.3.0.35+dirty-py3.12.el8/lib/py/lib/python3.12/site-packages/casaplotms/private/plotms_pb2.py:263 |
| 21-Oct-2026 10:55:49 | /lustre/cv/sw/casa/casaci/cvpost128/bamboohome/xml-data/build-dir/PIPESPECS-TESTPIPEMAINCASAMASTER-ML228PY312TEST/casa-build-utils/pipeline/workdir/casa-6.7.7-15-pipeline-2026.3.0.35+dirty-py3.12.el8/lib/py/lib/python3.12/site-packages/casaplotms/private/plotms_pb2.py:263: DeprecationWarning: Call to deprecated create function FieldDescriptor(). Note: Create unlinked descriptors is going to go away. Please use get/find descriptors from generated code or query the descriptor_pool. |
| 21-Oct-2026 10:55:49 | _descriptor.FieldDescriptor( |
| 21-Oct-2026 10:55:49 | |
| 21-Oct-2026 10:55:49 | ../../casa-6.7.7-15-pipeline-2026.3.0.35+dirty-py3.12.el8/lib/py/lib/python3.12/site-packages/casaplotms/private/plotms_pb2.py:270 |
| 21-Oct-2026 10:55:49 | /lustre/cv/sw/casa/casaci/cvpost128/bamboohome/xml-data/build-dir/PIPESPECS-TESTPIPEMAINCASAMASTER-ML228PY312TEST/casa-build-utils/pipeline/workdir/casa-6.7.7-15-pipeline-2026.3.0.35+dirty-py3.12.el8/lib/py/lib/python3.12/site-packages/casaplotms/private/plotms_pb2.py:270: DeprecationWarning: Call to deprecated create function FieldDescriptor(). Note: Create unlinked descriptors is going to go away. Please use get/find descriptors from generated code or query the descriptor_pool. |
| 21-Oct-2026 10:55:49 | _descriptor.FieldDescriptor( |
| 21-Oct-2026 10:55:49 | |
| 21-Oct-2026 10:55:49 | ../../casa-6.7.7-15-pipeline-2026.3.0.35+dirty-py3.12.el8/lib/py/lib/python3.12/site-packages/casaplotms/private/plotms_pb2.py:277 |
| 21-Oct-2026 10:55:49 | /lustre/cv/sw/casa/casaci/cvpost128/bamboohome/xml-data/build-dir/PIPESPECS-TESTPIPEMAINCASAMASTER-ML228PY312TEST/casa-build-utils/pipeline/workdir/casa-6.7.7-15-pipeline-2026.3.0.35+dirty-py3.12.el8/lib/py/lib/python3.12/site-packages/casaplotms/private/plotms_pb2.py:277: DeprecationWarning: Call to deprecated create function FieldDescriptor(). Note: Create unlinked descriptors is going to go away. Please use get/find descriptors from generated code or query the descriptor_pool. |
| 21-Oct-2026 10:55:49 | _descriptor.FieldDescriptor( |
| 21-Oct-2026 10:55:49 | |
| 21-Oct-2026 10:55:49 | ../../casa-6.7.7-15-pipeline-2026.3.0.35+dirty-py3.12.el8/lib/py/lib/python3.12/site-packages/casaplotms/private/plotms_pb2.py:284 |
| 21-Oct-2026 10:55:49 | /lustre/cv/sw/casa/casaci/cvpost128/bamboohome/xml-data/build-dir/PIPESPECS-TESTPIPEMAINCASAMASTER-ML228PY312TEST/casa-build-utils/pipeline/workdir/casa-6.7.7-15-pipeline-2026.3.0.35+dirty-py3.12.el8/lib/py/lib/python3.12/site-packages/casaplotms/private/plotms_pb2.py:284: DeprecationWarning: Call to deprecated create function FieldDescriptor(). Note: Create unlinked descriptors is going to go away. Please use get/find descriptors from generated code or query the descriptor_pool. |
| 21-Oct-2026 10:55:49 | _descriptor.FieldDescriptor( |
| 21-Oct-2026 10:55:49 | |
| 21-Oct-2026 10:55:49 | ../../casa-6.7.7-15-pipeline-2026.3.0.35+dirty-py3.12.el8/lib/py/lib/python3.12/site-packages/casaplotms/private/plotms_pb2.py:291 |
| 21-Oct-2026 10:55:49 | /lustre/cv/sw/casa/casaci/cvpost128/bamboohome/xml-data/build-dir/PIPESPECS-TESTPIPEMAINCASAMASTER-ML228PY312TEST/casa-build-utils/pipeline/workdir/casa-6.7.7-15-pipeline-2026.3.0.35+dirty-py3.12.el8/lib/py/lib/python3.12/site-packages/casaplotms/private/plotms_pb2.py:291: DeprecationWarning: Call to deprecated create function FieldDescriptor(). Note: Create unlinked descriptors is going to go away. Please use get/find descriptors from generated code or query the descriptor_pool. |
| 21-Oct-2026 10:55:49 | _descriptor.FieldDescriptor( |
| 21-Oct-2026 10:55:49 | |
| 21-Oct-2026 10:55:49 | ../../casa-6.7.7-15-pipeline-2026.3.0.35+dirty-py3.12.el8/lib/py/lib/python3.12/site-packages/casaplotms/private/plotms_pb2.py:207 |
| 21-Oct-2026 10:55:49 | /lustre/cv/sw/casa/casaci/cvpost128/bamboohome/xml-data/build-dir/PIPESPECS-TESTPIPEMAINCASAMASTER-ML228PY312TEST/casa-build-utils/pipeline/workdir/casa-6.7.7-15-pipeline-2026.3.0.35+dirty-py3.12.el8/lib/py/lib/python3.12/site-packages/casaplotms/private/plotms_pb2.py:207: DeprecationWarning: Call to deprecated create function Descriptor(). Note: Create unlinked descriptors is going to go away. Please use get/find descriptors from generated code or query the descriptor_pool. |
| 21-Oct-2026 10:55:49 | _SETAXES = _descriptor.Descriptor( |
| 21-Oct-2026 10:55:49 | |
| 21-Oct-2026 10:55:49 | ../../casa-6.7.7-15-pipeline-2026.3.0.35+dirty-py3.12.el8/lib/py/lib/python3.12/site-packages/casaplotms/private/plotms_pb2.py:322 |
| 21-Oct-2026 10:55:49 | /lustre/cv/sw/casa/casaci/cvpost128/bamboohome/xml-data/build-dir/PIPESPECS-TESTPIPEMAINCASAMASTER-ML228PY312TEST/casa-build-utils/pipeline/workdir/casa-6.7.7-15-pipeline-2026.3.0.35+dirty-py3.12.el8/lib/py/lib/python3.12/site-packages/casaplotms/private/plotms_pb2.py:322: DeprecationWarning: Call to deprecated create function FieldDescriptor(). Note: Create unlinked descriptors is going to go away. Please use get/find descriptors from generated code or query the descriptor_pool. |
| 21-Oct-2026 10:55:49 | _descriptor.FieldDescriptor( |
| 21-Oct-2026 10:55:49 | |
| 21-Oct-2026 10:55:49 | ../../casa-6.7.7-15-pipeline-2026.3.0.35+dirty-py3.12.el8/lib/py/lib/python3.12/site-packages/casaplotms/private/plotms_pb2.py:329 |
| 21-Oct-2026 10:55:49 | /lustre/cv/sw/casa/casaci/cvpost128/bamboohome/xml-data/build-dir/PIPESPECS-TESTPIPEMAINCASAMASTER-ML228PY312TEST/casa-build-utils/pipeline/workdir/casa-6.7.7-15-pipeline-2026.3.0.35+dirty-py3.12.el8/lib/py/lib/python3.12/site-packages/casaplotms/private/plotms_pb2.py:329: DeprecationWarning: Call to deprecated create function FieldDescriptor(). Note: Create unlinked descriptors is going to go away. Please use get/find descriptors from generated code or query the descriptor_pool. |
| 21-Oct-2026 10:55:49 | _descriptor.FieldDescriptor( |
| 21-Oct-2026 10:55:49 | |
| 21-Oct-2026 10:55:49 | ../../casa-6.7.7-15-pipeline-2026.3.0.35+dirty-py3.12.el8/lib/py/lib/python3.12/site-packages/casaplotms/private/plotms_pb2.py:336 |
| 21-Oct-2026 10:55:49 | /lustre/cv/sw/casa/casaci/cvpost128/bamboohome/xml-data/build-dir/PIPESPECS-TESTPIPEMAINCASAMASTER-ML228PY312TEST/casa-build-utils/pipeline/workdir/casa-6.7.7-15-pipeline-2026.3.0.35+dirty-py3.12.el8/lib/py/lib/python3.12/site-packages/casaplotms/private/plotms_pb2.py:336: DeprecationWarning: Call to deprecated create function FieldDescriptor(). Note: Create unlinked descriptors is going to go away. Please use get/find descriptors from generated code or query the descriptor_pool. |
| 21-Oct-2026 10:55:49 | _descriptor.FieldDescriptor( |
| 21-Oct-2026 10:55:49 | |
| 21-Oct-2026 10:55:49 | ../../casa-6.7.7-15-pipeline-2026.3.0.35+dirty-py3.12.el8/lib/py/lib/python3.12/site-packages/casaplotms/private/plotms_pb2.py:315 |
| 21-Oct-2026 10:55:49 | /lustre/cv/sw/casa/casaci/cvpost128/bamboohome/xml-data/build-dir/PIPESPECS-TESTPIPEMAINCASAMASTER-ML228PY312TEST/casa-build-utils/pipeline/workdir/casa-6.7.7-15-pipeline-2026.3.0.35+dirty-py3.12.el8/lib/py/lib/python3.12/site-packages/casaplotms/private/plotms_pb2.py:315: DeprecationWarning: Call to deprecated create function Descriptor(). Note: Create unlinked descriptors is going to go away. Please use get/find descriptors from generated code or query the descriptor_pool. |
| 21-Oct-2026 10:55:49 | _SETTOGGLE = _descriptor.Descriptor( |
| 21-Oct-2026 10:55:49 | |
| 21-Oct-2026 10:55:49 | ../../casa-6.7.7-15-pipeline-2026.3.0.35+dirty-py3.12.el8/lib/py/lib/python3.12/site-packages/casaplotms/private/plotms_pb2.py:367 |
| 21-Oct-2026 10:55:49 | /lustre/cv/sw/casa/casaci/cvpost128/bamboohome/xml-data/build-dir/PIPESPECS-TESTPIPEMAINCASAMASTER-ML228PY312TEST/casa-build-utils/pipeline/workdir/casa-6.7.7-15-pipeline-2026.3.0.35+dirty-py3.12.el8/lib/py/lib/python3.12/site-packages/casaplotms/private/plotms_pb2.py:367: DeprecationWarning: Call to deprecated create function FieldDescriptor(). Note: Create unlinked descriptors is going to go away. Please use get/find descriptors from generated code or query the descriptor_pool. |
| 21-Oct-2026 10:55:49 | _descriptor.FieldDescriptor( |
| 21-Oct-2026 10:55:49 | |
| 21-Oct-2026 10:55:49 | ../../casa-6.7.7-15-pipeline-2026.3.0.35+dirty-py3.12.el8/lib/py/lib/python3.12/site-packages/casaplotms/private/plotms_pb2.py:374 |
| 21-Oct-2026 10:55:49 | /lustre/cv/sw/casa/casaci/cvpost128/bamboohome/xml-data/build-dir/PIPESPECS-TESTPIPEMAINCASAMASTER-ML228PY312TEST/casa-build-utils/pipeline/workdir/casa-6.7.7-15-pipeline-2026.3.0.35+dirty-py3.12.el8/lib/py/lib/python3.12/site-packages/casaplotms/private/plotms_pb2.py:374: DeprecationWarning: Call to deprecated create function FieldDescriptor(). Note: Create unlinked descriptors is going to go away. Please use get/find descriptors from generated code or query the descriptor_pool. |
| 21-Oct-2026 10:55:49 | _descriptor.FieldDescriptor( |
| 21-Oct-2026 10:55:49 | |
| 21-Oct-2026 10:55:49 | ../../casa-6.7.7-15-pipeline-2026.3.0.35+dirty-py3.12.el8/lib/py/lib/python3.12/site-packages/casaplotms/private/plotms_pb2.py:381 |
| 21-Oct-2026 10:55:49 | /lustre/cv/sw/casa/casaci/cvpost128/bamboohome/xml-data/build-dir/PIPESPECS-TESTPIPEMAINCASAMASTER-ML228PY312TEST/casa-build-utils/pipeline/workdir/casa-6.7.7-15-pipeline-2026.3.0.35+dirty-py3.12.el8/lib/py/lib/python3.12/site-packages/casaplotms/private/plotms_pb2.py:381: DeprecationWarning: Call to deprecated create function FieldDescriptor(). Note: Create unlinked descriptors is going to go away. Please use get/find descriptors from generated code or query the descriptor_pool. |
| 21-Oct-2026 10:55:49 | _descriptor.FieldDescriptor( |
| 21-Oct-2026 10:55:49 | |
| 21-Oct-2026 10:55:49 | ../../casa-6.7.7-15-pipeline-2026.3.0.35+dirty-py3.12.el8/lib/py/lib/python3.12/site-packages/casaplotms/private/plotms_pb2.py:388 |
| 21-Oct-2026 10:55:49 | /lustre/cv/sw/casa/casaci/cvpost128/bamboohome/xml-data/build-dir/PIPESPECS-TESTPIPEMAINCASAMASTER-ML228PY312TEST/casa-build-utils/pipeline/workdir/casa-6.7.7-15-pipeline-2026.3.0.35+dirty-py3.12.el8/lib/py/lib/python3.12/site-packages/casaplotms/private/plotms_pb2.py:388: DeprecationWarning: Call to deprecated create function FieldDescriptor(). Note: Create unlinked descriptors is going to go away. Please use get/find descriptors from generated code or query the descriptor_pool. |
| 21-Oct-2026 10:55:49 | _descriptor.FieldDescriptor( |
| 21-Oct-2026 10:55:49 | |
| 21-Oct-2026 10:55:49 | ../../casa-6.7.7-15-pipeline-2026.3.0.35+dirty-py3.12.el8/lib/py/lib/python3.12/site-packages/casaplotms/private/plotms_pb2.py:395 |
| 21-Oct-2026 10:55:49 | /lustre/cv/sw/casa/casaci/cvpost128/bamboohome/xml-data/build-dir/PIPESPECS-TESTPIPEMAINCASAMASTER-ML228PY312TEST/casa-build-utils/pipeline/workdir/casa-6.7.7-15-pipeline-2026.3.0.35+dirty-py3.12.el8/lib/py/lib/python3.12/site-packages/casaplotms/private/plotms_pb2.py:395: DeprecationWarning: Call to deprecated create function FieldDescriptor(). Note: Create unlinked descriptors is going to go away. Please use get/find descriptors from generated code or query the descriptor_pool. |
| 21-Oct-2026 10:55:49 | _descriptor.FieldDescriptor( |
| 21-Oct-2026 10:55:49 | |
| 21-Oct-2026 10:55:49 | ../../casa-6.7.7-15-pipeline-2026.3.0.35+dirty-py3.12.el8/lib/py/lib/python3.12/site-packages/casaplotms/private/plotms_pb2.py:402 |
| 21-Oct-2026 10:55:49 | /lustre/cv/sw/casa/casaci/cvpost128/bamboohome/xml-data/build-dir/PIPESPECS-TESTPIPEMAINCASAMASTER-ML228PY312TEST/casa-build-utils/pipeline/workdir/casa-6.7.7-15-pipeline-2026.3.0.35+dirty-py3.12.el8/lib/py/lib/python3.12/site-packages/casaplotms/private/plotms_pb2.py:402: DeprecationWarning: Call to deprecated create function FieldDescriptor(). Note: Create unlinked descriptors is going to go away. Please use get/find descriptors from generated code or query the descriptor_pool. |
| 21-Oct-2026 10:55:49 | _descriptor.FieldDescriptor( |
| 21-Oct-2026 10:55:49 | |
| 21-Oct-2026 10:55:49 | ../../casa-6.7.7-15-pipeline-2026.3.0.35+dirty-py3.12.el8/lib/py/lib/python3.12/site-packages/casaplotms/private/plotms_pb2.py:409 |
| 21-Oct-2026 10:55:49 | /lustre/cv/sw/casa/casaci/cvpost128/bamboohome/xml-data/build-dir/PIPESPECS-TESTPIPEMAINCASAMASTER-ML228PY312TEST/casa-build-utils/pipeline/workdir/casa-6.7.7-15-pipeline-2026.3.0.35+dirty-py3.12.el8/lib/py/lib/python3.12/site-packages/casaplotms/private/plotms_pb2.py:409: DeprecationWarning: Call to deprecated create function FieldDescriptor(). Note: Create unlinked descriptors is going to go away. Please use get/find descriptors from generated code or query the descriptor_pool. |
| 21-Oct-2026 10:55:49 | _descriptor.FieldDescriptor( |
| 21-Oct-2026 10:55:49 | |
| 21-Oct-2026 10:55:49 | ../../casa-6.7.7-15-pipeline-2026.3.0.35+dirty-py3.12.el8/lib/py/lib/python3.12/site-packages/casaplotms/private/plotms_pb2.py:416 |
| 21-Oct-2026 10:55:49 | /lustre/cv/sw/casa/casaci/cvpost128/bamboohome/xml-data/build-dir/PIPESPECS-TESTPIPEMAINCASAMASTER-ML228PY312TEST/casa-build-utils/pipeline/workdir/casa-6.7.7-15-pipeline-2026.3.0.35+dirty-py3.12.el8/lib/py/lib/python3.12/site-packages/casaplotms/private/plotms_pb2.py:416: DeprecationWarning: Call to deprecated create function FieldDescriptor(). Note: Create unlinked descriptors is going to go away. Please use get/find descriptors from generated code or query the descriptor_pool. |
| 21-Oct-2026 10:55:49 | _descriptor.FieldDescriptor( |
| 21-Oct-2026 10:55:49 | |
| 21-Oct-2026 10:55:49 | ../../casa-6.7.7-15-pipeline-2026.3.0.35+dirty-py3.12.el8/lib/py/lib/python3.12/site-packages/casaplotms/private/plotms_pb2.py:423 |
| 21-Oct-2026 10:55:49 | /lustre/cv/sw/casa/casaci/cvpost128/bamboohome/xml-data/build-dir/PIPESPECS-TESTPIPEMAINCASAMASTER-ML228PY312TEST/casa-build-utils/pipeline/workdir/casa-6.7.7-15-pipeline-2026.3.0.35+dirty-py3.12.el8/lib/py/lib/python3.12/site-packages/casaplotms/private/plotms_pb2.py:423: DeprecationWarning: Call to deprecated create function FieldDescriptor(). Note: Create unlinked descriptors is going to go away. Please use get/find descriptors from generated code or query the descriptor_pool. |
| 21-Oct-2026 10:55:49 | _descriptor.FieldDescriptor( |
| 21-Oct-2026 10:55:49 | |
| 21-Oct-2026 10:55:49 | ../../casa-6.7.7-15-pipeline-2026.3.0.35+dirty-py3.12.el8/lib/py/lib/python3.12/site-packages/casaplotms/private/plotms_pb2.py:430 |
| 21-Oct-2026 10:55:49 | /lustre/cv/sw/casa/casaci/cvpost128/bamboohome/xml-data/build-dir/PIPESPECS-TESTPIPEMAINCASAMASTER-ML228PY312TEST/casa-build-utils/pipeline/workdir/casa-6.7.7-15-pipeline-2026.3.0.35+dirty-py3.12.el8/lib/py/lib/python3.12/site-packages/casaplotms/private/plotms_pb2.py:430: DeprecationWarning: Call to deprecated create function FieldDescriptor(). Note: Create unlinked descriptors is going to go away. Please use get/find descriptors from generated code or query the descriptor_pool. |
| 21-Oct-2026 10:55:49 | _descriptor.FieldDescriptor( |
| 21-Oct-2026 10:55:49 | |
| 21-Oct-2026 10:55:49 | ../../casa-6.7.7-15-pipeline-2026.3.0.35+dirty-py3.12.el8/lib/py/lib/python3.12/site-packages/casaplotms/private/plotms_pb2.py:437 |
| 21-Oct-2026 10:55:49 | /lustre/cv/sw/casa/casaci/cvpost128/bamboohome/xml-data/build-dir/PIPESPECS-TESTPIPEMAINCASAMASTER-ML228PY312TEST/casa-build-utils/pipeline/workdir/casa-6.7.7-15-pipeline-2026.3.0.35+dirty-py3.12.el8/lib/py/lib/python3.12/site-packages/casaplotms/private/plotms_pb2.py:437: DeprecationWarning: Call to deprecated create function FieldDescriptor(). Note: Create unlinked descriptors is going to go away. Please use get/find descriptors from generated code or query the descriptor_pool. |
| 21-Oct-2026 10:55:49 | _descriptor.FieldDescriptor( |
| 21-Oct-2026 10:55:49 | |
| 21-Oct-2026 10:55:49 | ../../casa-6.7.7-15-pipeline-2026.3.0.35+dirty-py3.12.el8/lib/py/lib/python3.12/site-packages/casaplotms/private/plotms_pb2.py:444 |
| 21-Oct-2026 10:55:49 | /lustre/cv/sw/casa/casaci/cvpost128/bamboohome/xml-data/build-dir/PIPESPECS-TESTPIPEMAINCASAMASTER-ML228PY312TEST/casa-build-utils/pipeline/workdir/casa-6.7.7-15-pipeline-2026.3.0.35+dirty-py3.12.el8/lib/py/lib/python3.12/site-packages/casaplotms/private/plotms_pb2.py:444: DeprecationWarning: Call to deprecated create function FieldDescriptor(). Note: Create unlinked descriptors is going to go away. Please use get/find descriptors from generated code or query the descriptor_pool. |
| 21-Oct-2026 10:55:49 | _descriptor.FieldDescriptor( |
| 21-Oct-2026 10:55:49 | |
| 21-Oct-2026 10:55:49 | ../../casa-6.7.7-15-pipeline-2026.3.0.35+dirty-py3.12.el8/lib/py/lib/python3.12/site-packages/casaplotms/private/plotms_pb2.py:451 |
| 21-Oct-2026 10:55:49 | /lustre/cv/sw/casa/casaci/cvpost128/bamboohome/xml-data/build-dir/PIPESPECS-TESTPIPEMAINCASAMASTER-ML228PY312TEST/casa-build-utils/pipeline/workdir/casa-6.7.7-15-pipeline-2026.3.0.35+dirty-py3.12.el8/lib/py/lib/python3.12/site-packages/casaplotms/private/plotms_pb2.py:451: DeprecationWarning: Call to deprecated create function FieldDescriptor(). Note: Create unlinked descriptors is going to go away. Please use get/find descriptors from generated code or query the descriptor_pool. |
| 21-Oct-2026 10:55:49 | _descriptor.FieldDescriptor( |
| 21-Oct-2026 10:55:49 | |
| 21-Oct-2026 10:55:49 | ../../casa-6.7.7-15-pipeline-2026.3.0.35+dirty-py3.12.el8/lib/py/lib/python3.12/site-packages/casaplotms/private/plotms_pb2.py:458 |
| 21-Oct-2026 10:55:49 | /lustre/cv/sw/casa/casaci/cvpost128/bamboohome/xml-data/build-dir/PIPESPECS-TESTPIPEMAINCASAMASTER-ML228PY312TEST/casa-build-utils/pipeline/workdir/casa-6.7.7-15-pipeline-2026.3.0.35+dirty-py3.12.el8/lib/py/lib/python3.12/site-packages/casaplotms/private/plotms_pb2.py:458: DeprecationWarning: Call to deprecated create function FieldDescriptor(). Note: Create unlinked descriptors is going to go away. Please use get/find descriptors from generated code or query the descriptor_pool. |
| 21-Oct-2026 10:55:49 | _descriptor.FieldDescriptor( |
| 21-Oct-2026 10:55:49 | |
| 21-Oct-2026 10:55:49 | ../../casa-6.7.7-15-pipeline-2026.3.0.35+dirty-py3.12.el8/lib/py/lib/python3.12/site-packages/casaplotms/private/plotms_pb2.py:465 |
| 21-Oct-2026 10:55:49 | /lustre/cv/sw/casa/casaci/cvpost128/bamboohome/xml-data/build-dir/PIPESPECS-TESTPIPEMAINCASAMASTER-ML228PY312TEST/casa-build-utils/pipeline/workdir/casa-6.7.7-15-pipeline-2026.3.0.35+dirty-py3.12.el8/lib/py/lib/python3.12/site-packages/casaplotms/private/plotms_pb2.py:465: DeprecationWarning: Call to deprecated create function FieldDescriptor(). Note: Create unlinked descriptors is going to go away. Please use get/find descriptors from generated code or query the descriptor_pool. |
| 21-Oct-2026 10:55:49 | _descriptor.FieldDescriptor( |
| 21-Oct-2026 10:55:49 | |
| 21-Oct-2026 10:55:49 | ../../casa-6.7.7-15-pipeline-2026.3.0.35+dirty-py3.12.el8/lib/py/lib/python3.12/site-packages/casaplotms/private/plotms_pb2.py:360 |
| 21-Oct-2026 10:55:49 | /lustre/cv/sw/casa/casaci/cvpost128/bamboohome/xml-data/build-dir/PIPESPECS-TESTPIPEMAINCASAMASTER-ML228PY312TEST/casa-build-utils/pipeline/workdir/casa-6.7.7-15-pipeline-2026.3.0.35+dirty-py3.12.el8/lib/py/lib/python3.12/site-packages/casaplotms/private/plotms_pb2.py:360: DeprecationWarning: Call to deprecated create function Descriptor(). Note: Create unlinked descriptors is going to go away. Please use get/find descriptors from generated code or query the descriptor_pool. |
| 21-Oct-2026 10:55:49 | _SETSELECTION = _descriptor.Descriptor( |
| 21-Oct-2026 10:55:49 | |
| 21-Oct-2026 10:55:49 | ../../casa-6.7.7-15-pipeline-2026.3.0.35+dirty-py3.12.el8/lib/py/lib/python3.12/site-packages/casaplotms/private/plotms_pb2.py:496 |
| 21-Oct-2026 10:55:49 | /lustre/cv/sw/casa/casaci/cvpost128/bamboohome/xml-data/build-dir/PIPESPECS-TESTPIPEMAINCASAMASTER-ML228PY312TEST/casa-build-utils/pipeline/workdir/casa-6.7.7-15-pipeline-2026.3.0.35+dirty-py3.12.el8/lib/py/lib/python3.12/site-packages/casaplotms/private/plotms_pb2.py:496: DeprecationWarning: Call to deprecated create function FieldDescriptor(). Note: Create unlinked descriptors is going to go away. Please use get/find descriptors from generated code or query the descriptor_pool. |
| 21-Oct-2026 10:55:49 | _descriptor.FieldDescriptor( |
| 21-Oct-2026 10:55:49 | |
| 21-Oct-2026 10:55:49 | ../../casa-6.7.7-15-pipeline-2026.3.0.35+dirty-py3.12.el8/lib/py/lib/python3.12/site-packages/casaplotms/private/plotms_pb2.py:503 |
| 21-Oct-2026 10:55:49 | /lustre/cv/sw/casa/casaci/cvpost128/bamboohome/xml-data/build-dir/PIPESPECS-TESTPIPEMAINCASAMASTER-ML228PY312TEST/casa-build-utils/pipeline/workdir/casa-6.7.7-15-pipeline-2026.3.0.35+dirty-py3.12.el8/lib/py/lib/python3.12/site-packages/casaplotms/private/plotms_pb2.py:503: DeprecationWarning: Call to deprecated create function FieldDescriptor(). Note: Create unlinked descriptors is going to go away. Please use get/find descriptors from generated code or query the descriptor_pool. |
| 21-Oct-2026 10:55:49 | _descriptor.FieldDescriptor( |
| 21-Oct-2026 10:55:49 | |
| 21-Oct-2026 10:55:49 | ../../casa-6.7.7-15-pipeline-2026.3.0.35+dirty-py3.12.el8/lib/py/lib/python3.12/site-packages/casaplotms/private/plotms_pb2.py:510 |
| 21-Oct-2026 10:55:49 | /lustre/cv/sw/casa/casaci/cvpost128/bamboohome/xml-data/build-dir/PIPESPECS-TESTPIPEMAINCASAMASTER-ML228PY312TEST/casa-build-utils/pipeline/workdir/casa-6.7.7-15-pipeline-2026.3.0.35+dirty-py3.12.el8/lib/py/lib/python3.12/site-packages/casaplotms/private/plotms_pb2.py:510: DeprecationWarning: Call to deprecated create function FieldDescriptor(). Note: Create unlinked descriptors is going to go away. Please use get/find descriptors from generated code or query the descriptor_pool. |
| 21-Oct-2026 10:55:49 | _descriptor.FieldDescriptor( |
| 21-Oct-2026 10:55:49 | |
| 21-Oct-2026 10:55:49 | ../../casa-6.7.7-15-pipeline-2026.3.0.35+dirty-py3.12.el8/lib/py/lib/python3.12/site-packages/casaplotms/private/plotms_pb2.py:517 |
| 21-Oct-2026 10:55:49 | /lustre/cv/sw/casa/casaci/cvpost128/bamboohome/xml-data/build-dir/PIPESPECS-TESTPIPEMAINCASAMASTER-ML228PY312TEST/casa-build-utils/pipeline/workdir/casa-6.7.7-15-pipeline-2026.3.0.35+dirty-py3.12.el8/lib/py/lib/python3.12/site-packages/casaplotms/private/plotms_pb2.py:517: DeprecationWarning: Call to deprecated create function FieldDescriptor(). Note: Create unlinked descriptors is going to go away. Please use get/find descriptors from generated code or query the descriptor_pool. |
| 21-Oct-2026 10:55:49 | _descriptor.FieldDescriptor( |
| 21-Oct-2026 10:55:49 | |
| 21-Oct-2026 10:55:49 | ../../casa-6.7.7-15-pipeline-2026.3.0.35+dirty-py3.12.el8/lib/py/lib/python3.12/site-packages/casaplotms/private/plotms_pb2.py:524 |
| 21-Oct-2026 10:55:49 | /lustre/cv/sw/casa/casaci/cvpost128/bamboohome/xml-data/build-dir/PIPESPECS-TESTPIPEMAINCASAMASTER-ML228PY312TEST/casa-build-utils/pipeline/workdir/casa-6.7.7-15-pipeline-2026.3.0.35+dirty-py3.12.el8/lib/py/lib/python3.12/site-packages/casaplotms/private/plotms_pb2.py:524: DeprecationWarning: Call to deprecated create function FieldDescriptor(). Note: Create unlinked descriptors is going to go away. Please use get/find descriptors from generated code or query the descriptor_pool. |
| 21-Oct-2026 10:55:49 | _descriptor.FieldDescriptor( |
| 21-Oct-2026 10:55:49 | |
| 21-Oct-2026 10:55:49 | ../../casa-6.7.7-15-pipeline-2026.3.0.35+dirty-py3.12.el8/lib/py/lib/python3.12/site-packages/casaplotms/private/plotms_pb2.py:531 |
| 21-Oct-2026 10:55:49 | /lustre/cv/sw/casa/casaci/cvpost128/bamboohome/xml-data/build-dir/PIPESPECS-TESTPIPEMAINCASAMASTER-ML228PY312TEST/casa-build-utils/pipeline/workdir/casa-6.7.7-15-pipeline-2026.3.0.35+dirty-py3.12.el8/lib/py/lib/python3.12/site-packages/casaplotms/private/plotms_pb2.py:531: DeprecationWarning: Call to deprecated create function FieldDescriptor(). Note: Create unlinked descriptors is going to go away. Please use get/find descriptors from generated code or query the descriptor_pool. |
| 21-Oct-2026 10:55:49 | _descriptor.FieldDescriptor( |
| 21-Oct-2026 10:55:49 | |
| 21-Oct-2026 10:55:49 | ../../casa-6.7.7-15-pipeline-2026.3.0.35+dirty-py3.12.el8/lib/py/lib/python3.12/site-packages/casaplotms/private/plotms_pb2.py:538 |
| 21-Oct-2026 10:55:49 | /lustre/cv/sw/casa/casaci/cvpost128/bamboohome/xml-data/build-dir/PIPESPECS-TESTPIPEMAINCASAMASTER-ML228PY312TEST/casa-build-utils/pipeline/workdir/casa-6.7.7-15-pipeline-2026.3.0.35+dirty-py3.12.el8/lib/py/lib/python3.12/site-packages/casaplotms/private/plotms_pb2.py:538: DeprecationWarning: Call to deprecated create function FieldDescriptor(). Note: Create unlinked descriptors is going to go away. Please use get/find descriptors from generated code or query the descriptor_pool. |
| 21-Oct-2026 10:55:49 | _descriptor.FieldDescriptor( |
| 21-Oct-2026 10:55:49 | |
| 21-Oct-2026 10:55:49 | ../../casa-6.7.7-15-pipeline-2026.3.0.35+dirty-py3.12.el8/lib/py/lib/python3.12/site-packages/casaplotms/private/plotms_pb2.py:545 |
| 21-Oct-2026 10:55:49 | /lustre/cv/sw/casa/casaci/cvpost128/bamboohome/xml-data/build-dir/PIPESPECS-TESTPIPEMAINCASAMASTER-ML228PY312TEST/casa-build-utils/pipeline/workdir/casa-6.7.7-15-pipeline-2026.3.0.35+dirty-py3.12.el8/lib/py/lib/python3.12/site-packages/casaplotms/private/plotms_pb2.py:545: DeprecationWarning: Call to deprecated create function FieldDescriptor(). Note: Create unlinked descriptors is going to go away. Please use get/find descriptors from generated code or query the descriptor_pool. |
| 21-Oct-2026 10:55:49 | _descriptor.FieldDescriptor( |
| 21-Oct-2026 10:55:49 | |
| 21-Oct-2026 10:55:49 | ../../casa-6.7.7-15-pipeline-2026.3.0.35+dirty-py3.12.el8/lib/py/lib/python3.12/site-packages/casaplotms/private/plotms_pb2.py:552 |
| 21-Oct-2026 10:55:49 | /lustre/cv/sw/casa/casaci/cvpost128/bamboohome/xml-data/build-dir/PIPESPECS-TESTPIPEMAINCASAMASTER-ML228PY312TEST/casa-build-utils/pipeline/workdir/casa-6.7.7-15-pipeline-2026.3.0.35+dirty-py3.12.el8/lib/py/lib/python3.12/site-packages/casaplotms/private/plotms_pb2.py:552: DeprecationWarning: Call to deprecated create function FieldDescriptor(). Note: Create unlinked descriptors is going to go away. Please use get/find descriptors from generated code or query the descriptor_pool. |
| 21-Oct-2026 10:55:49 | _descriptor.FieldDescriptor( |
| 21-Oct-2026 10:55:49 | |
| 21-Oct-2026 10:55:49 | ../../casa-6.7.7-15-pipeline-2026.3.0.35+dirty-py3.12.el8/lib/py/lib/python3.12/site-packages/casaplotms/private/plotms_pb2.py:559 |
| 21-Oct-2026 10:55:49 | /lustre/cv/sw/casa/casaci/cvpost128/bamboohome/xml-data/build-dir/PIPESPECS-TESTPIPEMAINCASAMASTER-ML228PY312TEST/casa-build-utils/pipeline/workdir/casa-6.7.7-15-pipeline-2026.3.0.35+dirty-py3.12.el8/lib/py/lib/python3.12/site-packages/casaplotms/private/plotms_pb2.py:559: DeprecationWarning: Call to deprecated create function FieldDescriptor(). Note: Create unlinked descriptors is going to go away. Please use get/find descriptors from generated code or query the descriptor_pool. |
| 21-Oct-2026 10:55:49 | _descriptor.FieldDescriptor( |
| 21-Oct-2026 10:55:49 | |
| 21-Oct-2026 10:55:49 | ../../casa-6.7.7-15-pipeline-2026.3.0.35+dirty-py3.12.el8/lib/py/lib/python3.12/site-packages/casaplotms/private/plotms_pb2.py:489 |
| 21-Oct-2026 10:55:49 | /lustre/cv/sw/casa/casaci/cvpost128/bamboohome/xml-data/build-dir/PIPESPECS-TESTPIPEMAINCASAMASTER-ML228PY312TEST/casa-build-utils/pipeline/workdir/casa-6.7.7-15-pipeline-2026.3.0.35+dirty-py3.12.el8/lib/py/lib/python3.12/site-packages/casaplotms/private/plotms_pb2.py:489: DeprecationWarning: Call to deprecated create function Descriptor(). Note: Create unlinked descriptors is going to go away. Please use get/find descriptors from generated code or query the descriptor_pool. |
| 21-Oct-2026 10:55:49 | _SETAVERAGING = _descriptor.Descriptor( |
| 21-Oct-2026 10:55:49 | |
| 21-Oct-2026 10:55:49 | ../../casa-6.7.7-15-pipeline-2026.3.0.35+dirty-py3.12.el8/lib/py/lib/python3.12/site-packages/casaplotms/private/plotms_pb2.py:590 |
| 21-Oct-2026 10:55:49 | /lustre/cv/sw/casa/casaci/cvpost128/bamboohome/xml-data/build-dir/PIPESPECS-TESTPIPEMAINCASAMASTER-ML228PY312TEST/casa-build-utils/pipeline/workdir/casa-6.7.7-15-pipeline-2026.3.0.35+dirty-py3.12.el8/lib/py/lib/python3.12/site-packages/casaplotms/private/plotms_pb2.py:590: DeprecationWarning: Call to deprecated create function FieldDescriptor(). Note: Create unlinked descriptors is going to go away. Please use get/find descriptors from generated code or query the descriptor_pool. |
| 21-Oct-2026 10:55:49 | _descriptor.FieldDescriptor( |
| 21-Oct-2026 10:55:49 | |
| 21-Oct-2026 10:55:49 | ../../casa-6.7.7-15-pipeline-2026.3.0.35+dirty-py3.12.el8/lib/py/lib/python3.12/site-packages/casaplotms/private/plotms_pb2.py:597 |
| 21-Oct-2026 10:55:49 | /lustre/cv/sw/casa/casaci/cvpost128/bamboohome/xml-data/build-dir/PIPESPECS-TESTPIPEMAINCASAMASTER-ML228PY312TEST/casa-build-utils/pipeline/workdir/casa-6.7.7-15-pipeline-2026.3.0.35+dirty-py3.12.el8/lib/py/lib/python3.12/site-packages/casaplotms/private/plotms_pb2.py:597: DeprecationWarning: Call to deprecated create function FieldDescriptor(). Note: Create unlinked descriptors is going to go away. Please use get/find descriptors from generated code or query the descriptor_pool. |
| 21-Oct-2026 10:55:49 | _descriptor.FieldDescriptor( |
| 21-Oct-2026 10:55:49 | |
| 21-Oct-2026 10:55:49 | ../../casa-6.7.7-15-pipeline-2026.3.0.35+dirty-py3.12.el8/lib/py/lib/python3.12/site-packages/casaplotms/private/plotms_pb2.py:604 |
| 21-Oct-2026 10:55:49 | /lustre/cv/sw/casa/casaci/cvpost128/bamboohome/xml-data/build-dir/PIPESPECS-TESTPIPEMAINCASAMASTER-ML228PY312TEST/casa-build-utils/pipeline/workdir/casa-6.7.7-15-pipeline-2026.3.0.35+dirty-py3.12.el8/lib/py/lib/python3.12/site-packages/casaplotms/private/plotms_pb2.py:604: DeprecationWarning: Call to deprecated create function FieldDescriptor(). Note: Create unlinked descriptors is going to go away. Please use get/find descriptors from generated code or query the descriptor_pool. |
| 21-Oct-2026 10:55:49 | _descriptor.FieldDescriptor( |
| 21-Oct-2026 10:55:49 | |
| 21-Oct-2026 10:55:49 | ../../casa-6.7.7-15-pipeline-2026.3.0.35+dirty-py3.12.el8/lib/py/lib/python3.12/site-packages/casaplotms/private/plotms_pb2.py:611 |
| 21-Oct-2026 10:55:49 | /lustre/cv/sw/casa/casaci/cvpost128/bamboohome/xml-data/build-dir/PIPESPECS-TESTPIPEMAINCASAMASTER-ML228PY312TEST/casa-build-utils/pipeline/workdir/casa-6.7.7-15-pipeline-2026.3.0.35+dirty-py3.12.el8/lib/py/lib/python3.12/site-packages/casaplotms/private/plotms_pb2.py:611: DeprecationWarning: Call to deprecated create function FieldDescriptor(). Note: Create unlinked descriptors is going to go away. Please use get/find descriptors from generated code or query the descriptor_pool. |
| 21-Oct-2026 10:55:49 | _descriptor.FieldDescriptor( |
| 21-Oct-2026 10:55:49 | |
| 21-Oct-2026 10:55:49 | ../../casa-6.7.7-15-pipeline-2026.3.0.35+dirty-py3.12.el8/lib/py/lib/python3.12/site-packages/casaplotms/private/plotms_pb2.py:618 |
| 21-Oct-2026 10:55:49 | /lustre/cv/sw/casa/casaci/cvpost128/bamboohome/xml-data/build-dir/PIPESPECS-TESTPIPEMAINCASAMASTER-ML228PY312TEST/casa-build-utils/pipeline/workdir/casa-6.7.7-15-pipeline-2026.3.0.35+dirty-py3.12.el8/lib/py/lib/python3.12/site-packages/casaplotms/private/plotms_pb2.py:618: DeprecationWarning: Call to deprecated create function FieldDescriptor(). Note: Create unlinked descriptors is going to go away. Please use get/find descriptors from generated code or query the descriptor_pool. |
| 21-Oct-2026 10:55:49 | _descriptor.FieldDescriptor( |
| 21-Oct-2026 10:55:49 | |
| 21-Oct-2026 10:55:49 | ../../casa-6.7.7-15-pipeline-2026.3.0.35+dirty-py3.12.el8/lib/py/lib/python3.12/site-packages/casaplotms/private/plotms_pb2.py:625 |
| 21-Oct-2026 10:55:49 | /lustre/cv/sw/casa/casaci/cvpost128/bamboohome/xml-data/build-dir/PIPESPECS-TESTPIPEMAINCASAMASTER-ML228PY312TEST/casa-build-utils/pipeline/workdir/casa-6.7.7-15-pipeline-2026.3.0.35+dirty-py3.12.el8/lib/py/lib/python3.12/site-packages/casaplotms/private/plotms_pb2.py:625: DeprecationWarning: Call to deprecated create function FieldDescriptor(). Note: Create unlinked descriptors is going to go away. Please use get/find descriptors from generated code or query the descriptor_pool. |
| 21-Oct-2026 10:55:49 | _descriptor.FieldDescriptor( |
| 21-Oct-2026 10:55:49 | |
| 21-Oct-2026 10:55:49 | ../../casa-6.7.7-15-pipeline-2026.3.0.35+dirty-py3.12.el8/lib/py/lib/python3.12/site-packages/casaplotms/private/plotms_pb2.py:583 |
| 21-Oct-2026 10:55:49 | /lustre/cv/sw/casa/casaci/cvpost128/bamboohome/xml-data/build-dir/PIPESPECS-TESTPIPEMAINCASAMASTER-ML228PY312TEST/casa-build-utils/pipeline/workdir/casa-6.7.7-15-pipeline-2026.3.0.35+dirty-py3.12.el8/lib/py/lib/python3.12/site-packages/casaplotms/private/plotms_pb2.py:583: DeprecationWarning: Call to deprecated create function Descriptor(). Note: Create unlinked descriptors is going to go away. Please use get/find descriptors from generated code or query the descriptor_pool. |
| 21-Oct-2026 10:55:49 | _SETTRANSFORM = _descriptor.Descriptor( |
| 21-Oct-2026 10:55:49 | |
| 21-Oct-2026 10:55:49 | ../../casa-6.7.7-15-pipeline-2026.3.0.35+dirty-py3.12.el8/lib/py/lib/python3.12/site-packages/casaplotms/private/plotms_pb2.py:656 |
| 21-Oct-2026 10:55:49 | /lustre/cv/sw/casa/casaci/cvpost128/bamboohome/xml-data/build-dir/PIPESPECS-TESTPIPEMAINCASAMASTER-ML228PY312TEST/casa-build-utils/pipeline/workdir/casa-6.7.7-15-pipeline-2026.3.0.35+dirty-py3.12.el8/lib/py/lib/python3.12/site-packages/casaplotms/private/plotms_pb2.py:656: DeprecationWarning: Call to deprecated create function FieldDescriptor(). Note: Create unlinked descriptors is going to go away. Please use get/find descriptors from generated code or query the descriptor_pool. |
| 21-Oct-2026 10:55:49 | _descriptor.FieldDescriptor( |
| 21-Oct-2026 10:55:49 | |
| 21-Oct-2026 10:55:49 | ../../casa-6.7.7-15-pipeline-2026.3.0.35+dirty-py3.12.el8/lib/py/lib/python3.12/site-packages/casaplotms/private/plotms_pb2.py:663 |
| 21-Oct-2026 10:55:49 | /lustre/cv/sw/casa/casaci/cvpost128/bamboohome/xml-data/build-dir/PIPESPECS-TESTPIPEMAINCASAMASTER-ML228PY312TEST/casa-build-utils/pipeline/workdir/casa-6.7.7-15-pipeline-2026.3.0.35+dirty-py3.12.el8/lib/py/lib/python3.12/site-packages/casaplotms/private/plotms_pb2.py:663: DeprecationWarning: Call to deprecated create function FieldDescriptor(). Note: Create unlinked descriptors is going to go away. Please use get/find descriptors from generated code or query the descriptor_pool. |
| 21-Oct-2026 10:55:49 | _descriptor.FieldDescriptor( |
| 21-Oct-2026 10:55:49 | |
| 21-Oct-2026 10:55:49 | ../../casa-6.7.7-15-pipeline-2026.3.0.35+dirty-py3.12.el8/lib/py/lib/python3.12/site-packages/casaplotms/private/plotms_pb2.py:670 |
| 21-Oct-2026 10:55:49 | /lustre/cv/sw/casa/casaci/cvpost128/bamboohome/xml-data/build-dir/PIPESPECS-TESTPIPEMAINCASAMASTER-ML228PY312TEST/casa-build-utils/pipeline/workdir/casa-6.7.7-15-pipeline-2026.3.0.35+dirty-py3.12.el8/lib/py/lib/python3.12/site-packages/casaplotms/private/plotms_pb2.py:670: DeprecationWarning: Call to deprecated create function FieldDescriptor(). Note: Create unlinked descriptors is going to go away. Please use get/find descriptors from generated code or query the descriptor_pool. |
| 21-Oct-2026 10:55:49 | _descriptor.FieldDescriptor( |
| 21-Oct-2026 10:55:49 | |
| 21-Oct-2026 10:55:49 | ../../casa-6.7.7-15-pipeline-2026.3.0.35+dirty-py3.12.el8/lib/py/lib/python3.12/site-packages/casaplotms/private/plotms_pb2.py:677 |
| 21-Oct-2026 10:55:49 | /lustre/cv/sw/casa/casaci/cvpost128/bamboohome/xml-data/build-dir/PIPESPECS-TESTPIPEMAINCASAMASTER-ML228PY312TEST/casa-build-utils/pipeline/workdir/casa-6.7.7-15-pipeline-2026.3.0.35+dirty-py3.12.el8/lib/py/lib/python3.12/site-packages/casaplotms/private/plotms_pb2.py:677: DeprecationWarning: Call to deprecated create function FieldDescriptor(). Note: Create unlinked descriptors is going to go away. Please use get/find descriptors from generated code or query the descriptor_pool. |
| 21-Oct-2026 10:55:49 | _descriptor.FieldDescriptor( |
| 21-Oct-2026 10:55:49 | |
| 21-Oct-2026 10:55:49 | ../../casa-6.7.7-15-pipeline-2026.3.0.35+dirty-py3.12.el8/lib/py/lib/python3.12/site-packages/casaplotms/private/plotms_pb2.py:649 |
| 21-Oct-2026 10:55:49 | /lustre/cv/sw/casa/casaci/cvpost128/bamboohome/xml-data/build-dir/PIPESPECS-TESTPIPEMAINCASAMASTER-ML228PY312TEST/casa-build-utils/pipeline/workdir/casa-6.7.7-15-pipeline-2026.3.0.35+dirty-py3.12.el8/lib/py/lib/python3.12/site-packages/casaplotms/private/plotms_pb2.py:649: DeprecationWarning: Call to deprecated create function Descriptor(). Note: Create unlinked descriptors is going to go away. Please use get/find descriptors from generated code or query the descriptor_pool. |
| 21-Oct-2026 10:55:49 | _SETCALIBRATION = _descriptor.Descriptor( |
| 21-Oct-2026 10:55:49 | |
| 21-Oct-2026 10:55:49 | ../../casa-6.7.7-15-pipeline-2026.3.0.35+dirty-py3.12.el8/lib/py/lib/python3.12/site-packages/casaplotms/private/plotms_pb2.py:708 |
| 21-Oct-2026 10:55:49 | /lustre/cv/sw/casa/casaci/cvpost128/bamboohome/xml-data/build-dir/PIPESPECS-TESTPIPEMAINCASAMASTER-ML228PY312TEST/casa-build-utils/pipeline/workdir/casa-6.7.7-15-pipeline-2026.3.0.35+dirty-py3.12.el8/lib/py/lib/python3.12/site-packages/casaplotms/private/plotms_pb2.py:708: DeprecationWarning: Call to deprecated create function FieldDescriptor(). Note: Create unlinked descriptors is going to go away. Please use get/find descriptors from generated code or query the descriptor_pool. |
| 21-Oct-2026 10:55:49 | _descriptor.FieldDescriptor( |
| 21-Oct-2026 10:55:49 | |
| 21-Oct-2026 10:55:49 | ../../casa-6.7.7-15-pipeline-2026.3.0.35+dirty-py3.12.el8/lib/py/lib/python3.12/site-packages/casaplotms/private/plotms_pb2.py:715 |
| 21-Oct-2026 10:55:49 | /lustre/cv/sw/casa/casaci/cvpost128/bamboohome/xml-data/build-dir/PIPESPECS-TESTPIPEMAINCASAMASTER-ML228PY312TEST/casa-build-utils/pipeline/workdir/casa-6.7.7-15-pipeline-2026.3.0.35+dirty-py3.12.el8/lib/py/lib/python3.12/site-packages/casaplotms/private/plotms_pb2.py:715: DeprecationWarning: Call to deprecated create function FieldDescriptor(). Note: Create unlinked descriptors is going to go away. Please use get/find descriptors from generated code or query the descriptor_pool. |
| 21-Oct-2026 10:55:49 | _descriptor.FieldDescriptor( |
| 21-Oct-2026 10:55:49 | |
| 21-Oct-2026 10:55:49 | ../../casa-6.7.7-15-pipeline-2026.3.0.35+dirty-py3.12.el8/lib/py/lib/python3.12/site-packages/casaplotms/private/plotms_pb2.py:722 |
| 21-Oct-2026 10:55:49 | /lustre/cv/sw/casa/casaci/cvpost128/bamboohome/xml-data/build-dir/PIPESPECS-TESTPIPEMAINCASAMASTER-ML228PY312TEST/casa-build-utils/pipeline/workdir/casa-6.7.7-15-pipeline-2026.3.0.35+dirty-py3.12.el8/lib/py/lib/python3.12/site-packages/casaplotms/private/plotms_pb2.py:722: DeprecationWarning: Call to deprecated create function FieldDescriptor(). Note: Create unlinked descriptors is going to go away. Please use get/find descriptors from generated code or query the descriptor_pool. |
| 21-Oct-2026 10:55:49 | _descriptor.FieldDescriptor( |
| 21-Oct-2026 10:55:49 | |
| 21-Oct-2026 10:55:49 | ../../casa-6.7.7-15-pipeline-2026.3.0.35+dirty-py3.12.el8/lib/py/lib/python3.12/site-packages/casaplotms/private/plotms_pb2.py:729 |
| 21-Oct-2026 10:55:49 | /lustre/cv/sw/casa/casaci/cvpost128/bamboohome/xml-data/build-dir/PIPESPECS-TESTPIPEMAINCASAMASTER-ML228PY312TEST/casa-build-utils/pipeline/workdir/casa-6.7.7-15-pipeline-2026.3.0.35+dirty-py3.12.el8/lib/py/lib/python3.12/site-packages/casaplotms/private/plotms_pb2.py:729: DeprecationWarning: Call to deprecated create function FieldDescriptor(). Note: Create unlinked descriptors is going to go away. Please use get/find descriptors from generated code or query the descriptor_pool. |
| 21-Oct-2026 10:55:49 | _descriptor.FieldDescriptor( |
| 21-Oct-2026 10:55:49 | |
| 21-Oct-2026 10:55:49 | ../../casa-6.7.7-15-pipeline-2026.3.0.35+dirty-py3.12.el8/lib/py/lib/python3.12/site-packages/casaplotms/private/plotms_pb2.py:736 |
| 21-Oct-2026 10:55:49 | /lustre/cv/sw/casa/casaci/cvpost128/bamboohome/xml-data/build-dir/PIPESPECS-TESTPIPEMAINCASAMASTER-ML228PY312TEST/casa-build-utils/pipeline/workdir/casa-6.7.7-15-pipeline-2026.3.0.35+dirty-py3.12.el8/lib/py/lib/python3.12/site-packages/casaplotms/private/plotms_pb2.py:736: DeprecationWarning: Call to deprecated create function FieldDescriptor(). Note: Create unlinked descriptors is going to go away. Please use get/find descriptors from generated code or query the descriptor_pool. |
| 21-Oct-2026 10:55:49 | _descriptor.FieldDescriptor( |
| 21-Oct-2026 10:55:49 | |
| 21-Oct-2026 10:55:49 | ../../casa-6.7.7-15-pipeline-2026.3.0.35+dirty-py3.12.el8/lib/py/lib/python3.12/site-packages/casaplotms/private/plotms_pb2.py:743 |
| 21-Oct-2026 10:55:49 | /lustre/cv/sw/casa/casaci/cvpost128/bamboohome/xml-data/build-dir/PIPESPECS-TESTPIPEMAINCASAMASTER-ML228PY312TEST/casa-build-utils/pipeline/workdir/casa-6.7.7-15-pipeline-2026.3.0.35+dirty-py3.12.el8/lib/py/lib/python3.12/site-packages/casaplotms/private/plotms_pb2.py:743: DeprecationWarning: Call to deprecated create function FieldDescriptor(). Note: Create unlinked descriptors is going to go away. Please use get/find descriptors from generated code or query the descriptor_pool. |
| 21-Oct-2026 10:55:49 | _descriptor.FieldDescriptor( |
| 21-Oct-2026 10:55:49 | |
| 21-Oct-2026 10:55:49 | ../../casa-6.7.7-15-pipeline-2026.3.0.35+dirty-py3.12.el8/lib/py/lib/python3.12/site-packages/casaplotms/private/plotms_pb2.py:750 |
| 21-Oct-2026 10:55:49 | /lustre/cv/sw/casa/casaci/cvpost128/bamboohome/xml-data/build-dir/PIPESPECS-TESTPIPEMAINCASAMASTER-ML228PY312TEST/casa-build-utils/pipeline/workdir/casa-6.7.7-15-pipeline-2026.3.0.35+dirty-py3.12.el8/lib/py/lib/python3.12/site-packages/casaplotms/private/plotms_pb2.py:750: DeprecationWarning: Call to deprecated create function FieldDescriptor(). Note: Create unlinked descriptors is going to go away. Please use get/find descriptors from generated code or query the descriptor_pool. |
| 21-Oct-2026 10:55:49 | _descriptor.FieldDescriptor( |
| 21-Oct-2026 10:55:49 | |
| 21-Oct-2026 10:55:49 | ../../casa-6.7.7-15-pipeline-2026.3.0.35+dirty-py3.12.el8/lib/py/lib/python3.12/site-packages/casaplotms/private/plotms_pb2.py:757 |
| 21-Oct-2026 10:55:49 | /lustre/cv/sw/casa/casaci/cvpost128/bamboohome/xml-data/build-dir/PIPESPECS-TESTPIPEMAINCASAMASTER-ML228PY312TEST/casa-build-utils/pipeline/workdir/casa-6.7.7-15-pipeline-2026.3.0.35+dirty-py3.12.el8/lib/py/lib/python3.12/site-packages/casaplotms/private/plotms_pb2.py:757: DeprecationWarning: Call to deprecated create function FieldDescriptor(). Note: Create unlinked descriptors is going to go away. Please use get/find descriptors from generated code or query the descriptor_pool. |
| 21-Oct-2026 10:55:49 | _descriptor.FieldDescriptor( |
| 21-Oct-2026 10:55:49 | |
| 21-Oct-2026 10:55:49 | ../../casa-6.7.7-15-pipeline-2026.3.0.35+dirty-py3.12.el8/lib/py/lib/python3.12/site-packages/casaplotms/private/plotms_pb2.py:764 |
| 21-Oct-2026 10:55:49 | /lustre/cv/sw/casa/casaci/cvpost128/bamboohome/xml-data/build-dir/PIPESPECS-TESTPIPEMAINCASAMASTER-ML228PY312TEST/casa-build-utils/pipeline/workdir/casa-6.7.7-15-pipeline-2026.3.0.35+dirty-py3.12.el8/lib/py/lib/python3.12/site-packages/casaplotms/private/plotms_pb2.py:764: DeprecationWarning: Call to deprecated create function FieldDescriptor(). Note: Create unlinked descriptors is going to go away. Please use get/find descriptors from generated code or query the descriptor_pool. |
| 21-Oct-2026 10:55:49 | _descriptor.FieldDescriptor( |
| 21-Oct-2026 10:55:49 | |
| 21-Oct-2026 10:55:49 | ../../casa-6.7.7-15-pipeline-2026.3.0.35+dirty-py3.12.el8/lib/py/lib/python3.12/site-packages/casaplotms/private/plotms_pb2.py:771 |
| 21-Oct-2026 10:55:49 | /lustre/cv/sw/casa/casaci/cvpost128/bamboohome/xml-data/build-dir/PIPESPECS-TESTPIPEMAINCASAMASTER-ML228PY312TEST/casa-build-utils/pipeline/workdir/casa-6.7.7-15-pipeline-2026.3.0.35+dirty-py3.12.el8/lib/py/lib/python3.12/site-packages/casaplotms/private/plotms_pb2.py:771: DeprecationWarning: Call to deprecated create function FieldDescriptor(). Note: Create unlinked descriptors is going to go away. Please use get/find descriptors from generated code or query the descriptor_pool. |
| 21-Oct-2026 10:55:49 | _descriptor.FieldDescriptor( |
| 21-Oct-2026 10:55:49 | |
| 21-Oct-2026 10:55:49 | ../../casa-6.7.7-15-pipeline-2026.3.0.35+dirty-py3.12.el8/lib/py/lib/python3.12/site-packages/casaplotms/private/plotms_pb2.py:701 |
| 21-Oct-2026 10:55:49 | /lustre/cv/sw/casa/casaci/cvpost128/bamboohome/xml-data/build-dir/PIPESPECS-TESTPIPEMAINCASAMASTER-ML228PY312TEST/casa-build-utils/pipeline/workdir/casa-6.7.7-15-pipeline-2026.3.0.35+dirty-py3.12.el8/lib/py/lib/python3.12/site-packages/casaplotms/private/plotms_pb2.py:701: DeprecationWarning: Call to deprecated create function Descriptor(). Note: Create unlinked descriptors is going to go away. Please use get/find descriptors from generated code or query the descriptor_pool. |
| 21-Oct-2026 10:55:49 | _SETFLAGEXTENSION = _descriptor.Descriptor( |
| 21-Oct-2026 10:55:49 | |
| 21-Oct-2026 10:55:49 | ../../casa-6.7.7-15-pipeline-2026.3.0.35+dirty-py3.12.el8/lib/py/lib/python3.12/site-packages/casaplotms/private/plotms_pb2.py:802 |
| 21-Oct-2026 10:55:49 | /lustre/cv/sw/casa/casaci/cvpost128/bamboohome/xml-data/build-dir/PIPESPECS-TESTPIPEMAINCASAMASTER-ML228PY312TEST/casa-build-utils/pipeline/workdir/casa-6.7.7-15-pipeline-2026.3.0.35+dirty-py3.12.el8/lib/py/lib/python3.12/site-packages/casaplotms/private/plotms_pb2.py:802: DeprecationWarning: Call to deprecated create function FieldDescriptor(). Note: Create unlinked descriptors is going to go away. Please use get/find descriptors from generated code or query the descriptor_pool. |
| 21-Oct-2026 10:55:49 | _descriptor.FieldDescriptor( |
| 21-Oct-2026 10:55:49 | |
| 21-Oct-2026 10:55:49 | ../../casa-6.7.7-15-pipeline-2026.3.0.35+dirty-py3.12.el8/lib/py/lib/python3.12/site-packages/casaplotms/private/plotms_pb2.py:795 |
| 21-Oct-2026 10:55:49 | /lustre/cv/sw/casa/casaci/cvpost128/bamboohome/xml-data/build-dir/PIPESPECS-TESTPIPEMAINCASAMASTER-ML228PY312TEST/casa-build-utils/pipeline/workdir/casa-6.7.7-15-pipeline-2026.3.0.35+dirty-py3.12.el8/lib/py/lib/python3.12/site-packages/casaplotms/private/plotms_pb2.py:795: DeprecationWarning: Call to deprecated create function Descriptor(). Note: Create unlinked descriptors is going to go away. Please use get/find descriptors from generated code or query the descriptor_pool. |
| 21-Oct-2026 10:55:49 | _EXPORTRANGE = _descriptor.Descriptor( |
| 21-Oct-2026 10:55:49 | |
| 21-Oct-2026 10:55:49 | ../../casa-6.7.7-15-pipeline-2026.3.0.35+dirty-py3.12.el8/lib/py/lib/python3.12/site-packages/casaplotms/private/plotms_pb2.py:833 |
| 21-Oct-2026 10:55:49 | /lustre/cv/sw/casa/casaci/cvpost128/bamboohome/xml-data/build-dir/PIPESPECS-TESTPIPEMAINCASAMASTER-ML228PY312TEST/casa-build-utils/pipeline/workdir/casa-6.7.7-15-pipeline-2026.3.0.35+dirty-py3.12.el8/lib/py/lib/python3.12/site-packages/casaplotms/private/plotms_pb2.py:833: DeprecationWarning: Call to deprecated create function FieldDescriptor(). Note: Create unlinked descriptors is going to go away. Please use get/find descriptors from generated code or query the descriptor_pool. |
| 21-Oct-2026 10:55:49 | _descriptor.FieldDescriptor( |
| 21-Oct-2026 10:55:49 | |
| 21-Oct-2026 10:55:49 | ../../casa-6.7.7-15-pipeline-2026.3.0.35+dirty-py3.12.el8/lib/py/lib/python3.12/site-packages/casaplotms/private/plotms_pb2.py:840 |
| 21-Oct-2026 10:55:49 | /lustre/cv/sw/casa/casaci/cvpost128/bamboohome/xml-data/build-dir/PIPESPECS-TESTPIPEMAINCASAMASTER-ML228PY312TEST/casa-build-utils/pipeline/workdir/casa-6.7.7-15-pipeline-2026.3.0.35+dirty-py3.12.el8/lib/py/lib/python3.12/site-packages/casaplotms/private/plotms_pb2.py:840: DeprecationWarning: Call to deprecated create function FieldDescriptor(). Note: Create unlinked descriptors is going to go away. Please use get/find descriptors from generated code or query the descriptor_pool. |
| 21-Oct-2026 10:55:49 | _descriptor.FieldDescriptor( |
| 21-Oct-2026 10:55:49 | |
| 21-Oct-2026 10:55:49 | ../../casa-6.7.7-15-pipeline-2026.3.0.35+dirty-py3.12.el8/lib/py/lib/python3.12/site-packages/casaplotms/private/plotms_pb2.py:847 |
| 21-Oct-2026 10:55:49 | /lustre/cv/sw/casa/casaci/cvpost128/bamboohome/xml-data/build-dir/PIPESPECS-TESTPIPEMAINCASAMASTER-ML228PY312TEST/casa-build-utils/pipeline/workdir/casa-6.7.7-15-pipeline-2026.3.0.35+dirty-py3.12.el8/lib/py/lib/python3.12/site-packages/casaplotms/private/plotms_pb2.py:847: DeprecationWarning: Call to deprecated create function FieldDescriptor(). Note: Create unlinked descriptors is going to go away. Please use get/find descriptors from generated code or query the descriptor_pool. |
| 21-Oct-2026 10:55:49 | _descriptor.FieldDescriptor( |
| 21-Oct-2026 10:55:49 | |
| 21-Oct-2026 10:55:49 | ../../casa-6.7.7-15-pipeline-2026.3.0.35+dirty-py3.12.el8/lib/py/lib/python3.12/site-packages/casaplotms/private/plotms_pb2.py:854 |
| 21-Oct-2026 10:55:49 | /lustre/cv/sw/casa/casaci/cvpost128/bamboohome/xml-data/build-dir/PIPESPECS-TESTPIPEMAINCASAMASTER-ML228PY312TEST/casa-build-utils/pipeline/workdir/casa-6.7.7-15-pipeline-2026.3.0.35+dirty-py3.12.el8/lib/py/lib/python3.12/site-packages/casaplotms/private/plotms_pb2.py:854: DeprecationWarning: Call to deprecated create function FieldDescriptor(). Note: Create unlinked descriptors is going to go away. Please use get/find descriptors from generated code or query the descriptor_pool. |
| 21-Oct-2026 10:55:49 | _descriptor.FieldDescriptor( |
| 21-Oct-2026 10:55:49 | |
| 21-Oct-2026 10:55:49 | ../../casa-6.7.7-15-pipeline-2026.3.0.35+dirty-py3.12.el8/lib/py/lib/python3.12/site-packages/casaplotms/private/plotms_pb2.py:861 |
| 21-Oct-2026 10:55:49 | /lustre/cv/sw/casa/casaci/cvpost128/bamboohome/xml-data/build-dir/PIPESPECS-TESTPIPEMAINCASAMASTER-ML228PY312TEST/casa-build-utils/pipeline/workdir/casa-6.7.7-15-pipeline-2026.3.0.35+dirty-py3.12.el8/lib/py/lib/python3.12/site-packages/casaplotms/private/plotms_pb2.py:861: DeprecationWarning: Call to deprecated create function FieldDescriptor(). Note: Create unlinked descriptors is going to go away. Please use get/find descriptors from generated code or query the descriptor_pool. |
| 21-Oct-2026 10:55:49 | _descriptor.FieldDescriptor( |
| 21-Oct-2026 10:55:49 | |
| 21-Oct-2026 10:55:49 | ../../casa-6.7.7-15-pipeline-2026.3.0.35+dirty-py3.12.el8/lib/py/lib/python3.12/site-packages/casaplotms/private/plotms_pb2.py:868 |
| 21-Oct-2026 10:55:49 | /lustre/cv/sw/casa/casaci/cvpost128/bamboohome/xml-data/build-dir/PIPESPECS-TESTPIPEMAINCASAMASTER-ML228PY312TEST/casa-build-utils/pipeline/workdir/casa-6.7.7-15-pipeline-2026.3.0.35+dirty-py3.12.el8/lib/py/lib/python3.12/site-packages/casaplotms/private/plotms_pb2.py:868: DeprecationWarning: Call to deprecated create function FieldDescriptor(). Note: Create unlinked descriptors is going to go away. Please use get/find descriptors from generated code or query the descriptor_pool. |
| 21-Oct-2026 10:55:49 | _descriptor.FieldDescriptor( |
| 21-Oct-2026 10:55:49 | |
| 21-Oct-2026 10:55:49 | ../../casa-6.7.7-15-pipeline-2026.3.0.35+dirty-py3.12.el8/lib/py/lib/python3.12/site-packages/casaplotms/private/plotms_pb2.py:875 |
| 21-Oct-2026 10:55:49 | /lustre/cv/sw/casa/casaci/cvpost128/bamboohome/xml-data/build-dir/PIPESPECS-TESTPIPEMAINCASAMASTER-ML228PY312TEST/casa-build-utils/pipeline/workdir/casa-6.7.7-15-pipeline-2026.3.0.35+dirty-py3.12.el8/lib/py/lib/python3.12/site-packages/casaplotms/private/plotms_pb2.py:875: DeprecationWarning: Call to deprecated create function FieldDescriptor(). Note: Create unlinked descriptors is going to go away. Please use get/find descriptors from generated code or query the descriptor_pool. |
| 21-Oct-2026 10:55:49 | _descriptor.FieldDescriptor( |
| 21-Oct-2026 10:55:49 | |
| 21-Oct-2026 10:55:49 | ../../casa-6.7.7-15-pipeline-2026.3.0.35+dirty-py3.12.el8/lib/py/lib/python3.12/site-packages/casaplotms/private/plotms_pb2.py:882 |
| 21-Oct-2026 10:55:49 | /lustre/cv/sw/casa/casaci/cvpost128/bamboohome/xml-data/build-dir/PIPESPECS-TESTPIPEMAINCASAMASTER-ML228PY312TEST/casa-build-utils/pipeline/workdir/casa-6.7.7-15-pipeline-2026.3.0.35+dirty-py3.12.el8/lib/py/lib/python3.12/site-packages/casaplotms/private/plotms_pb2.py:882: DeprecationWarning: Call to deprecated create function FieldDescriptor(). Note: Create unlinked descriptors is going to go away. Please use get/find descriptors from generated code or query the descriptor_pool. |
| 21-Oct-2026 10:55:49 | _descriptor.FieldDescriptor( |
| 21-Oct-2026 10:55:49 | |
| 21-Oct-2026 10:55:49 | ../../casa-6.7.7-15-pipeline-2026.3.0.35+dirty-py3.12.el8/lib/py/lib/python3.12/site-packages/casaplotms/private/plotms_pb2.py:889 |
| 21-Oct-2026 10:55:49 | /lustre/cv/sw/casa/casaci/cvpost128/bamboohome/xml-data/build-dir/PIPESPECS-TESTPIPEMAINCASAMASTER-ML228PY312TEST/casa-build-utils/pipeline/workdir/casa-6.7.7-15-pipeline-2026.3.0.35+dirty-py3.12.el8/lib/py/lib/python3.12/site-packages/casaplotms/private/plotms_pb2.py:889: DeprecationWarning: Call to deprecated create function FieldDescriptor(). Note: Create unlinked descriptors is going to go away. Please use get/find descriptors from generated code or query the descriptor_pool. |
| 21-Oct-2026 10:55:49 | _descriptor.FieldDescriptor( |
| 21-Oct-2026 10:55:49 | |
| 21-Oct-2026 10:55:49 | ../../casa-6.7.7-15-pipeline-2026.3.0.35+dirty-py3.12.el8/lib/py/lib/python3.12/site-packages/casaplotms/private/plotms_pb2.py:826 |
| 21-Oct-2026 10:55:49 | /lustre/cv/sw/casa/casaci/cvpost128/bamboohome/xml-data/build-dir/PIPESPECS-TESTPIPEMAINCASAMASTER-ML228PY312TEST/casa-build-utils/pipeline/workdir/casa-6.7.7-15-pipeline-2026.3.0.35+dirty-py3.12.el8/lib/py/lib/python3.12/site-packages/casaplotms/private/plotms_pb2.py:826: DeprecationWarning: Call to deprecated create function Descriptor(). Note: Create unlinked descriptors is going to go away. Please use get/find descriptors from generated code or query the descriptor_pool. |
| 21-Oct-2026 10:55:49 | _SETITERATE = _descriptor.Descriptor( |
| 21-Oct-2026 10:55:49 | |
| 21-Oct-2026 10:55:49 | ../../casa-6.7.7-15-pipeline-2026.3.0.35+dirty-py3.12.el8/lib/py/lib/python3.12/site-packages/casaplotms/private/plotms_pb2.py:920 |
| 21-Oct-2026 10:55:49 | /lustre/cv/sw/casa/casaci/cvpost128/bamboohome/xml-data/build-dir/PIPESPECS-TESTPIPEMAINCASAMASTER-ML228PY312TEST/casa-build-utils/pipeline/workdir/casa-6.7.7-15-pipeline-2026.3.0.35+dirty-py3.12.el8/lib/py/lib/python3.12/site-packages/casaplotms/private/plotms_pb2.py:920: DeprecationWarning: Call to deprecated create function FieldDescriptor(). Note: Create unlinked descriptors is going to go away. Please use get/find descriptors from generated code or query the descriptor_pool. |
| 21-Oct-2026 10:55:49 | _descriptor.FieldDescriptor( |
| 21-Oct-2026 10:55:49 | |
| 21-Oct-2026 10:55:49 | ../../casa-6.7.7-15-pipeline-2026.3.0.35+dirty-py3.12.el8/lib/py/lib/python3.12/site-packages/casaplotms/private/plotms_pb2.py:927 |
| 21-Oct-2026 10:55:49 | /lustre/cv/sw/casa/casaci/cvpost128/bamboohome/xml-data/build-dir/PIPESPECS-TESTPIPEMAINCASAMASTER-ML228PY312TEST/casa-build-utils/pipeline/workdir/casa-6.7.7-15-pipeline-2026.3.0.35+dirty-py3.12.el8/lib/py/lib/python3.12/site-packages/casaplotms/private/plotms_pb2.py:927: DeprecationWarning: Call to deprecated create function FieldDescriptor(). Note: Create unlinked descriptors is going to go away. Please use get/find descriptors from generated code or query the descriptor_pool. |
| 21-Oct-2026 10:55:49 | _descriptor.FieldDescriptor( |
| 21-Oct-2026 10:55:49 | |
| 21-Oct-2026 10:55:49 | ../../casa-6.7.7-15-pipeline-2026.3.0.35+dirty-py3.12.el8/lib/py/lib/python3.12/site-packages/casaplotms/private/plotms_pb2.py:934 |
| 21-Oct-2026 10:55:49 | /lustre/cv/sw/casa/casaci/cvpost128/bamboohome/xml-data/build-dir/PIPESPECS-TESTPIPEMAINCASAMASTER-ML228PY312TEST/casa-build-utils/pipeline/workdir/casa-6.7.7-15-pipeline-2026.3.0.35+dirty-py3.12.el8/lib/py/lib/python3.12/site-packages/casaplotms/private/plotms_pb2.py:934: DeprecationWarning: Call to deprecated create function FieldDescriptor(). Note: Create unlinked descriptors is going to go away. Please use get/find descriptors from generated code or query the descriptor_pool. |
| 21-Oct-2026 10:55:49 | _descriptor.FieldDescriptor( |
| 21-Oct-2026 10:55:49 | |
| 21-Oct-2026 10:55:49 | ../../casa-6.7.7-15-pipeline-2026.3.0.35+dirty-py3.12.el8/lib/py/lib/python3.12/site-packages/casaplotms/private/plotms_pb2.py:913 |
| 21-Oct-2026 10:55:49 | /lustre/cv/sw/casa/casaci/cvpost128/bamboohome/xml-data/build-dir/PIPESPECS-TESTPIPEMAINCASAMASTER-ML228PY312TEST/casa-build-utils/pipeline/workdir/casa-6.7.7-15-pipeline-2026.3.0.35+dirty-py3.12.el8/lib/py/lib/python3.12/site-packages/casaplotms/private/plotms_pb2.py:913: DeprecationWarning: Call to deprecated create function Descriptor(). Note: Create unlinked descriptors is going to go away. Please use get/find descriptors from generated code or query the descriptor_pool. |
| 21-Oct-2026 10:55:49 | _SETSTRING = _descriptor.Descriptor( |
| 21-Oct-2026 10:55:49 | |
| 21-Oct-2026 10:55:49 | ../../casa-6.7.7-15-pipeline-2026.3.0.35+dirty-py3.12.el8/lib/py/lib/python3.12/site-packages/casaplotms/private/plotms_pb2.py:965 |
| 21-Oct-2026 10:55:59 | /lustre/cv/sw/casa/casaci/cvpost128/bamboohome/xml-data/build-dir/PIPESPECS-TESTPIPEMAINCASAMASTER-ML228PY312TEST/casa-build-utils/pipeline/workdir/casa-6.7.7-15-pipeline-2026.3.0.35+dirty-py3.12.el8/lib/py/lib/python3.12/site-packages/casaplotms/private/plotms_pb2.py:965: DeprecationWarning: Call to deprecated create function FieldDescriptor(). Note: Create unlinked descriptors is going to go away. Please use get/find descriptors from generated code or query the descriptor_pool. |
| 21-Oct-2026 10:55:59 | _descriptor.FieldDescriptor( |
| 21-Oct-2026 10:55:59 | |
| 21-Oct-2026 10:55:59 | ../../casa-6.7.7-15-pipeline-2026.3.0.35+dirty-py3.12.el8/lib/py/lib/python3.12/site-packages/casaplotms/private/plotms_pb2.py:972 |
| 21-Oct-2026 10:55:59 | /lustre/cv/sw/casa/casaci/cvpost128/bamboohome/xml-data/build-dir/PIPESPECS-TESTPIPEMAINCASAMASTER-ML228PY312TEST/casa-build-utils/pipeline/workdir/casa-6.7.7-15-pipeline-2026.3.0.35+dirty-py3.12.el8/lib/py/lib/python3.12/site-packages/casaplotms/private/plotms_pb2.py:972: DeprecationWarning: Call to deprecated create function FieldDescriptor(). Note: Create unlinked descriptors is going to go away. Please use get/find descriptors from generated code or query the descriptor_pool. |
| 21-Oct-2026 10:55:59 | _descriptor.FieldDescriptor( |
| 21-Oct-2026 10:55:59 | |
| 21-Oct-2026 10:55:59 | ../../casa-6.7.7-15-pipeline-2026.3.0.35+dirty-py3.12.el8/lib/py/lib/python3.12/site-packages/casaplotms/private/plotms_pb2.py:979 |
| 21-Oct-2026 10:55:59 | /lustre/cv/sw/casa/casaci/cvpost128/bamboohome/xml-data/build-dir/PIPESPECS-TESTPIPEMAINCASAMASTER-ML228PY312TEST/casa-build-utils/pipeline/workdir/casa-6.7.7-15-pipeline-2026.3.0.35+dirty-py3.12.el8/lib/py/lib/python3.12/site-packages/casaplotms/private/plotms_pb2.py:979: DeprecationWarning: Call to deprecated create function FieldDescriptor(). Note: Create unlinked descriptors is going to go away. Please use get/find descriptors from generated code or query the descriptor_pool. |
| 21-Oct-2026 10:55:59 | _descriptor.FieldDescriptor( |
| 21-Oct-2026 10:55:59 | |
| 21-Oct-2026 10:55:59 | pipeline/hifa/tasks/applycal/ampphase_vs_freq_qa_test.py::test_score_all_scans |
| 21-Oct-2026 10:55:59 | /lustre/cv/sw/casa/casaci/cvpost128/bamboohome/xml-data/build-dir/PIPESPECS-TESTPIPEMAINCASAMASTER-ML228PY312TEST/casa-build-utils/pipeline/workdir/casa-6.7.7-15-pipeline-2026.3.0.35+dirty-py3.12.el8/lib/py/lib/python3.12/site-packages/numpy/ma/core.py:518: ComplexWarning: Casting complex values to real discards the imaginary part |
| 21-Oct-2026 10:55:59 | fill_value = np.asarray(fill_value, dtype=ndtype) |
| 21-Oct-2026 10:55:59 | |
| 21-Oct-2026 10:55:59 | -- Docs: https://docs.pytest.org/en/stable/how-to/capture-warnings.html |
| 21-Oct-2026 10:55:59 | - generated xml file: /lustre/cv/sw/casa/casaci/cvpost128/bamboohome/xml-data/build-dir/PIPESPECS-TESTPIPEMAINCASAMASTER-ML228PY312TEST/casa-build-utils/pipeline/workdir/pipeline_unit_test_result.xml - |
| 21-Oct-2026 10:55:59 | =========================== short test summary info ============================ |
| 21-Oct-2026 10:55:59 | SKIPPED [2] h/tasks/common/atmutil_test.py:218: need_vis |
| 21-Oct-2026 10:55:59 | SKIPPED [3] h/tasks/common/atmutil_test.py:238: need_vis |
| 21-Oct-2026 10:55:59 | SKIPPED [2] h/tasks/common/atmutil_test.py:256: need_vis |
| 21-Oct-2026 10:55:59 | SKIPPED [1] infrastructure/daskhelpers_test.py:87: dask not installed |
| 21-Oct-2026 10:55:59 | SKIPPED [1] infrastructure/daskhelpers_test.py:153: dask not installed |
| 21-Oct-2026 10:55:59 | SKIPPED [1] infrastructure/daskhelpers_test.py:202: dask not installed |
| 21-Oct-2026 10:55:59 | SKIPPED [1] recipes/recipe_converter_test.py:382: Skip testing main. Its output must be carefully examined by developer. |
| 21-Oct-2026 10:55:59 | SKIPPED [1] recipes/recipe_converter_test.py:387: Skip testing generate_all. Its output must be carefully examined by developer. |
| 21-Oct-2026 10:55:59 | ========== 854 passed, 12 skipped, 104 warnings in 447.82s (0:07:27) =========== |
| 21-Oct-2026 10:55:59 | 0 |
| 21-Oct-2026 10:55:59 | Running regression tests |
| 21-Oct-2026 10:55:59 | xvfb-run /lustre/cv/sw/casa/casaci/cvpost128/bamboohome/xml-data/build-dir/PIPESPECS-TESTPIPEMAINCASAMASTER-ML228PY312TEST/casa-build-utils/pipeline/workdir/casa-6.7.7-15-pipeline-2026.3.0.35+dirty-py3.12.el8/bin/casa --cachedir=/lustre/cv/sw/casa/casaci/pipelinercdir --cachedir=/lustre/cv/sw/casa/casaci/pipelinercdir --nogui --nologger --log2term --agg -c"import pytest; pytest.main(['-s', '-vv', '-n', '12', '--dist=worksteal','--forked', '--junitxml=/lustre/cv/sw/casa/casaci/cvpost128/bamboohome/xml-data/build-dir/PIPESPECS-TESTPIPEMAINCASAMASTER-ML228PY312TEST/casa-build-utils/pipeline/workdir/pipeline_regression_test_result.xml', '/lustre/cv/sw/casa/casaci/cvpost128/bamboohome/xml-data/build-dir/PIPESPECS-TESTPIPEMAINCASAMASTER-ML228PY312TEST/casa-build-utils/pipeline/workdir/pipeline/tests/regression/fast'])" |
| 21-Oct-2026 10:55:59 | Executing: xvfb-run /lustre/cv/sw/casa/casaci/cvpost128/bamboohome/xml-data/build-dir/PIPESPECS-TESTPIPEMAINCASAMASTER-ML228PY312TEST/casa-build-utils/pipeline/workdir/casa-6.7.7-15-pipeline-2026.3.0.35+dirty-py3.12.el8/bin/casa --cachedir=/lustre/cv/sw/casa/casaci/pipelinercdir --cachedir=/lustre/cv/sw/casa/casaci/pipelinercdir --nogui --nologger --log2term --agg -c"import pytest; pytest.main(['-s', '-vv', '-n', '12', '--dist=worksteal','--forked', '--junitxml=/lustre/cv/sw/casa/casaci/cvpost128/bamboohome/xml-data/build-dir/PIPESPECS-TESTPIPEMAINCASAMASTER-ML228PY312TEST/casa-build-utils/pipeline/workdir/pipeline_regression_test_result.xml', '/lustre/cv/sw/casa/casaci/cvpost128/bamboohome/xml-data/build-dir/PIPESPECS-TESTPIPEMAINCASAMASTER-ML228PY312TEST/casa-build-utils/pipeline/workdir/pipeline/tests/regression/fast'])" |
| 21-Oct-2026 10:55:59 | |
| 21-Oct-2026 10:55:59 | Using user configuration file /users/casaci/.casa/config.py |
| 21-Oct-2026 10:55:59 | |
| 21-Oct-2026 10:55:59 | No event loop hook running. |
| 21-Oct-2026 10:55:59 | 2026-10-21 14:55:55 SEVERE ::casa |
| 21-Oct-2026 10:55:59 | 2026-10-21 14:55:55 SEVERE ::casa The expected casa data was not found at measurespath. CASA may still work if the data can be found in datapath. |
| 21-Oct-2026 10:55:59 | 2026-10-21 14:55:55 SEVERE ::casa The expected measures data was not found at measurespath. CASA may still work if the data can be found in datapath. |
| 21-Oct-2026 10:55:59 | 2026-10-21 14:55:55 SEVERE ::casa visit https://casadocs.readthedocs.io/en/stable/notebooks/external-data.html for more information |
| 21-Oct-2026 10:55:59 | 2026-10-21 14:55:55 SEVERE ::casa |
| 21-Oct-2026 10:55:59 | Using location of IERSeop2000 table found in datapath for measurespath /home/casa/data/master |
| 21-Oct-2026 10:55:59 | CASA 6.7.7.15 -- Common Astronomy Software Applications [6.7.7.15] |
| 21-Oct-2026 10:55:59 | 2026-10-21 14:55:59 INFO ::casa Using user configuration file /users/casaci/.casa/config.py |
| 21-Oct-2026 10:55:59 | 2026-10-21 14:55:59 INFO ::casa loaded config file : /lustre/cv/sw/casa/casaci/cvpost128/bamboohome/xml-data/build-dir/PIPESPECS-TESTPIPEMAINCASAMASTER-ML228PY312TEST/casa-build-utils/pipeline/workdir/casa-6.7.7-15-pipeline-2026.3.0.35+dirty-py3.12.el8/lib/py/lib/python3.12/site-packages/casaconfig/config.py |
| 21-Oct-2026 10:55:59 | 2026-10-21 14:55:59 INFO ::casa loaded config file : /home/casa/casasiteconfig.py |
| 21-Oct-2026 10:55:59 | 2026-10-21 14:55:59 INFO ::casa loaded config file : /users/casaci/.casa/config.py |
| 21-Oct-2026 10:55:59 | 2026-10-21 14:55:59 INFO ::casa |
| 21-Oct-2026 10:55:59 | 2026-10-21 14:55:59 INFO ::casa config values |
| 21-Oct-2026 10:55:59 | 2026-10-21 14:55:59 INFO ::casa agg = True |
| 21-Oct-2026 10:55:59 | 2026-10-21 14:55:59 INFO ::casa cachedir = '/lustre/cv/sw/casa/casaci/pipelinercdir' |
| 21-Oct-2026 10:55:59 | 2026-10-21 14:55:59 INFO ::casa casaconfig_verbose = 1 |
| 21-Oct-2026 10:55:59 | 2026-10-21 14:55:59 INFO ::casa colors = 'Neutral' |
| 21-Oct-2026 10:55:59 | 2026-10-21 14:55:59 INFO ::casa data_auto_update = False |
| 21-Oct-2026 10:55:59 | 2026-10-21 14:55:59 INFO ::casa data_update_interval = 1 |
| 21-Oct-2026 10:55:59 | 2026-10-21 14:55:59 INFO ::casa datapath = ['/export/cvpost134-4tb/casa/casa-data/casatestdata', '/export/cvpost134-4tb/casa/casa-data/casatestdata-large', '/export/cvpost134-4tb/casa/casa-data/casa-data', '/export/cvpost135-4tb/casa/casa-data/casatestdata', '/export/cvpost135-4tb/casa/casa-data/casatestdata-large', '/home/casa/data/master', '/opt/casa/data/casatestdata', '/opt/casa/data/casatestdata-large', '/lustre/cv/sw/casa/casaci/data/casatestdata', '/lustre/cv/sw/casa/casaci/data/casatestdata-large', '/lustre/cv/sw/casa/casaci/pipeline-testdata', '/opt/pltestdata/pipeline-testdata', '/export/cvpost134-4tb/casa/casa-data/casatestdata', '/export/cvpost135-4tb/casa/casa-data/casatestdata', '/export/data_2/casatestdata-large'] |
| 21-Oct-2026 10:55:59 | 2026-10-21 14:55:59 INFO ::casa iplog = False |
| 21-Oct-2026 10:55:59 | 2026-10-21 14:55:59 INFO ::casa iplogfile = '/lustre/cv/sw/casa/casaci/cvpost128/bamboohome/xml-data/build-dir/PIPESPECS-TESTPIPEMAINCASAMASTER-ML228PY312TEST/casa-build-utils/pipeline/workdir/pipeline/ipython-20261021-145553.log' |
| 21-Oct-2026 10:55:59 | 2026-10-21 14:55:59 INFO ::casa log2term = True |
| 21-Oct-2026 10:55:59 | 2026-10-21 14:55:59 INFO ::casa logfile = '/lustre/cv/sw/casa/casaci/cvpost128/bamboohome/xml-data/build-dir/PIPESPECS-TESTPIPEMAINCASAMASTER-ML228PY312TEST/casa-build-utils/pipeline/workdir/pipeline/casa-20261021-145553.log' |
| 21-Oct-2026 10:55:59 | 2026-10-21 14:55:59 INFO ::casa measures_auto_update = False |
| 21-Oct-2026 10:55:59 | 2026-10-21 14:55:59 INFO ::casa measures_site = ['https://iers.astron.nl/', 'https://go.nrao.edu/iers/'] |
| 21-Oct-2026 10:55:59 | 2026-10-21 14:55:59 INFO ::casa measures_site_interval = 2 |
| 21-Oct-2026 10:55:59 | 2026-10-21 14:55:59 INFO ::casa measures_update_interval = 1 |
| 21-Oct-2026 10:55:59 | 2026-10-21 14:55:59 INFO ::casa measurespath = '/opt/casa/data/master' |
| 21-Oct-2026 10:55:59 | 2026-10-21 14:55:59 INFO ::casa nogui = True |
| 21-Oct-2026 10:55:59 | 2026-10-21 14:55:59 INFO ::casa nologfile = False |
| 21-Oct-2026 10:55:59 | 2026-10-21 14:55:59 INFO ::casa nologger = True |
| 21-Oct-2026 10:56:09 | 2026-10-21 14:55:59 INFO ::casa pipeline = False |
| 21-Oct-2026 10:56:09 | 2026-10-21 14:55:59 INFO ::casa skipnetworkcheck = False |
| 21-Oct-2026 10:56:09 | 2026-10-21 14:55:59 INFO ::casa startupfile = '/users/casaci/.casa/startup.py' |
| 21-Oct-2026 10:56:09 | 2026-10-21 14:55:59 INFO ::casa user_site = False |
| 21-Oct-2026 10:56:09 | 2026-10-21 14:55:59 INFO ::casa |
| 21-Oct-2026 10:56:09 | 2026-10-21 14:55:59 INFO ::casa casarundata version is unknown, this is probably a legacy version not installed by casaconfig |
| 21-Oct-2026 10:56:09 | 2026-10-21 14:55:59 INFO ::casa measures version is unknown, this is probably a legacy version not installed by casaconfig |
| 21-Oct-2026 10:56:09 | 2026-10-21 14:55:59 INFO ::casa |
| 21-Oct-2026 10:56:09 | 2026-10-21 14:55:59 INFO ::casa Checking Measures tables in data repository sub-directory /home/casa/data/master/geodetic |
| 21-Oct-2026 10:56:09 | 2026-10-21 14:55:59 INFO ::casa IERSeop2000 (version date, last date in table (UTC)): 2026/10/15/15:15, 2026/09/15/00:00:00 |
| 21-Oct-2026 10:56:09 | 2026-10-21 14:55:59 INFO ::casa IERSeop97 (version date, last date in table (UTC)): 2026/10/15/15:15, 2026/09/15/00:00:00 |
| 21-Oct-2026 10:56:09 | 2026-10-21 14:55:59 INFO ::casa IERSpredict (version date, last date in table (UTC)): 2026/10/20/15:15, 2027/01/18/00:00:00 |
| 21-Oct-2026 10:56:09 | 2026-10-21 14:55:59 INFO ::casa TAI_UTC (version date, last date in table (UTC)): 2026/10/05/15:15, 2017/01/01/00:00:00 |
| 21-Oct-2026 10:56:09 | 2026-10-21 14:55:59 INFO: Environment is not MPI enabled. Pipeline operating in single host mode |
| 21-Oct-2026 10:56:09 | 2026-10-21 14:55:59 INFO pipeline::pipeline.infrastructure.mpihelpers::casa Environment is not MPI enabled. Pipeline operating in single host mode |
| 21-Oct-2026 10:56:09 | ============================= test session starts ============================== |
| 21-Oct-2026 10:56:09 | platform linux -- Python 3.12.4, pytest-9.1.1, pluggy-1.7.0 -- /lustre/cv/sw/casa/casaci/cvpost128/bamboohome/xml-data/build-dir/PIPESPECS-TESTPIPEMAINCASAMASTER-ML228PY312TEST/casa-build-utils/pipeline/workdir/casa-6.7.7-15-pipeline-2026.3.0.35+dirty-py3.12.el8/lib/py/bin/python3 |
| 21-Oct-2026 10:56:09 | cachedir: .pytest_cache |
| 21-Oct-2026 10:56:09 | rootdir: /lustre/cv/sw/casa/casaci/cvpost128/bamboohome/xml-data/build-dir/PIPESPECS-TESTPIPEMAINCASAMASTER-ML228PY312TEST/casa-build-utils/pipeline/workdir/pipeline |
| 21-Oct-2026 10:56:09 | configfile: pyproject.toml |
| 21-Oct-2026 10:56:09 | plugins: xdist-3.8.0, forked-1.7.5 |
| 21-Oct-2026 10:56:09 | created: 12/12 workers |
| 21-Oct-2026 10:56:09 | 2026-10-21 14:56:03 SEVERE ::casa |
| 21-Oct-2026 10:56:09 | 2026-10-21 14:56:03 SEVERE ::casa The expected casa data was not found at measurespath. CASA may still work if the data can be found in datapath. |
| 21-Oct-2026 10:56:09 | 2026-10-21 14:56:03 SEVERE ::casa The expected measures data was not found at measurespath. CASA may still work if the data can be found in datapath. |
| 21-Oct-2026 10:56:09 | 2026-10-21 14:56:03 SEVERE ::casa visit https://casadocs.readthedocs.io/en/stable/notebooks/external-data.html for more information |
| 21-Oct-2026 10:56:09 | 2026-10-21 14:56:03 SEVERE ::casa |
| 21-Oct-2026 10:56:09 | 2026-10-21 14:56:03 SEVERE ::casa |
| 21-Oct-2026 10:56:09 | 2026-10-21 14:56:03 SEVERE ::casa The expected casa data was not found at measurespath. CASA may still work if the data can be found in datapath. |
| 21-Oct-2026 10:56:09 | 2026-10-21 14:56:03 SEVERE ::casa The expected measures data was not found at measurespath. CASA may still work if the data can be found in datapath. |
| 21-Oct-2026 10:56:09 | 2026-10-21 14:56:03 SEVERE ::casa visit https://casadocs.readthedocs.io/en/stable/notebooks/external-data.html for more information |
| 21-Oct-2026 10:56:09 | 2026-10-21 14:56:03 SEVERE ::casa |
| 21-Oct-2026 10:56:09 | 2026-10-21 14:56:03 SEVERE ::casa |
| 21-Oct-2026 10:56:09 | 2026-10-21 14:56:03 SEVERE ::casa The expected casa data was not found at measurespath. CASA may still work if the data can be found in datapath. |
| 21-Oct-2026 10:56:09 | 2026-10-21 14:56:03 SEVERE ::casa The expected measures data was not found at measurespath. CASA may still work if the data can be found in datapath. |
| 21-Oct-2026 10:56:09 | 2026-10-21 14:56:03 SEVERE ::casa visit https://casadocs.readthedocs.io/en/stable/notebooks/external-data.html for more information |
| 21-Oct-2026 10:56:09 | 2026-10-21 14:56:03 SEVERE ::casa |
| 21-Oct-2026 10:56:09 | 2026-10-21 14:56:03 SEVERE ::casa |
| 21-Oct-2026 10:56:09 | 2026-10-21 14:56:03 SEVERE ::casa The expected casa data was not found at measurespath. CASA may still work if the data can be found in datapath. |
| 21-Oct-2026 10:56:09 | 2026-10-21 14:56:03 SEVERE ::casa The expected measures data was not found at measurespath. CASA may still work if the data can be found in datapath. |
| 21-Oct-2026 10:56:09 | 2026-10-21 14:56:03 SEVERE ::casa visit https://casadocs.readthedocs.io/en/stable/notebooks/external-data.html for more information |
| 21-Oct-2026 10:56:09 | 2026-10-21 14:56:03 SEVERE ::casa |
| 21-Oct-2026 10:56:09 | 2026-10-21 14:56:03 SEVERE ::casa |
| 21-Oct-2026 10:56:09 | 2026-10-21 14:56:03 SEVERE ::casa The expected casa data was not found at measurespath. CASA may still work if the data can be found in datapath. |
| 21-Oct-2026 10:56:09 | 2026-10-21 14:56:03 SEVERE ::casa The expected measures data was not found at measurespath. CASA may still work if the data can be found in datapath. |
| 21-Oct-2026 10:56:09 | 2026-10-21 14:56:03 SEVERE ::casa visit https://casadocs.readthedocs.io/en/stable/notebooks/external-data.html for more information |
| 21-Oct-2026 10:56:09 | 2026-10-21 14:56:03 SEVERE ::casa |
| 21-Oct-2026 10:56:09 | 2026-10-21 14:56:03 SEVERE ::casa |
| 21-Oct-2026 10:56:09 | 2026-10-21 14:56:03 SEVERE ::casa The expected casa data was not found at measurespath. CASA may still work if the data can be found in datapath. |
| 21-Oct-2026 10:56:09 | 2026-10-21 14:56:03 SEVERE ::casa The expected measures data was not found at measurespath. CASA may still work if the data can be found in datapath. |
| 21-Oct-2026 10:56:09 | 2026-10-21 14:56:03 SEVERE ::casa visit https://casadocs.readthedocs.io/en/stable/notebooks/external-data.html for more information |
| 21-Oct-2026 10:56:09 | 2026-10-21 14:56:03 SEVERE ::casa |
| 21-Oct-2026 10:56:09 | 2026-10-21 14:56:03 SEVERE ::casa |
| 21-Oct-2026 10:56:09 | 2026-10-21 14:56:03 SEVERE ::casa The expected casa data was not found at measurespath. CASA may still work if the data can be found in datapath. |
| 21-Oct-2026 10:56:09 | 2026-10-21 14:56:03 SEVERE ::casa The expected measures data was not found at measurespath. CASA may still work if the data can be found in datapath. |
| 21-Oct-2026 10:56:09 | 2026-10-21 14:56:03 SEVERE ::casa visit https://casadocs.readthedocs.io/en/stable/notebooks/external-data.html for more information |
| 21-Oct-2026 10:56:09 | 2026-10-21 14:56:03 SEVERE ::casa |
| 21-Oct-2026 10:56:09 | 2026-10-21 14:56:03 SEVERE ::casa |
| 21-Oct-2026 10:56:09 | 2026-10-21 14:56:03 SEVERE ::casa The expected casa data was not found at measurespath. CASA may still work if the data can be found in datapath. |
| 21-Oct-2026 10:56:09 | 2026-10-21 14:56:03 SEVERE ::casa The expected measures data was not found at measurespath. CASA may still work if the data can be found in datapath. |
| 21-Oct-2026 10:56:09 | 2026-10-21 14:56:03 SEVERE ::casa visit https://casadocs.readthedocs.io/en/stable/notebooks/external-data.html for more information |
| 21-Oct-2026 10:56:09 | 2026-10-21 14:56:03 SEVERE ::casa |
| 21-Oct-2026 10:56:09 | 2026-10-21 14:56:03 SEVERE ::casa |
| 21-Oct-2026 10:56:09 | 2026-10-21 14:56:03 SEVERE ::casa The expected casa data was not found at measurespath. CASA may still work if the data can be found in datapath. |
| 21-Oct-2026 10:56:09 | 2026-10-21 14:56:03 SEVERE ::casa The expected measures data was not found at measurespath. CASA may still work if the data can be found in datapath. |
| 21-Oct-2026 10:56:09 | 2026-10-21 14:56:03 SEVERE ::casa visit https://casadocs.readthedocs.io/en/stable/notebooks/external-data.html for more information |
| 21-Oct-2026 10:56:09 | 2026-10-21 14:56:03 SEVERE ::casa |
| 21-Oct-2026 10:56:09 | 2026-10-21 14:56:04 SEVERE ::casa |
| 21-Oct-2026 10:56:09 | 2026-10-21 14:56:04 SEVERE ::casa The expected casa data was not found at measurespath. CASA may still work if the data can be found in datapath. |
| 21-Oct-2026 10:56:09 | 2026-10-21 14:56:04 SEVERE ::casa The expected measures data was not found at measurespath. CASA may still work if the data can be found in datapath. |
| 21-Oct-2026 10:56:09 | 2026-10-21 14:56:04 SEVERE ::casa visit https://casadocs.readthedocs.io/en/stable/notebooks/external-data.html for more information |
| 21-Oct-2026 10:56:09 | 2026-10-21 14:56:04 SEVERE ::casa |
| 21-Oct-2026 10:56:09 | 2026-10-21 14:56:04 SEVERE ::casa |
| 21-Oct-2026 10:56:09 | 2026-10-21 14:56:04 SEVERE ::casa The expected casa data was not found at measurespath. CASA may still work if the data can be found in datapath. |
| 21-Oct-2026 10:56:09 | 2026-10-21 14:56:04 SEVERE ::casa The expected measures data was not found at measurespath. CASA may still work if the data can be found in datapath. |
| 21-Oct-2026 10:56:09 | 2026-10-21 14:56:04 SEVERE ::casa visit https://casadocs.readthedocs.io/en/stable/notebooks/external-data.html for more information |
| 21-Oct-2026 10:56:09 | 2026-10-21 14:56:04 SEVERE ::casa |
| 21-Oct-2026 10:56:09 | 2026-10-21 14:56:04 SEVERE ::casa |
| 21-Oct-2026 10:56:09 | 2026-10-21 14:56:04 SEVERE ::casa The expected casa data was not found at measurespath. CASA may still work if the data can be found in datapath. |
| 21-Oct-2026 10:56:09 | 2026-10-21 14:56:04 SEVERE ::casa The expected measures data was not found at measurespath. CASA may still work if the data can be found in datapath. |
| 21-Oct-2026 10:56:09 | 2026-10-21 14:56:04 SEVERE ::casa visit https://casadocs.readthedocs.io/en/stable/notebooks/external-data.html for more information |
| 21-Oct-2026 10:56:09 | 2026-10-21 14:56:04 SEVERE ::casa |
| 21-Oct-2026 10:56:09 | 12 workers [18 items] |
| 21-Oct-2026 10:56:09 | |
| 21-Oct-2026 10:56:09 | scheduling tests via WorkStealingScheduling |
| 21-Oct-2026 10:56:09 | |
| 21-Oct-2026 10:56:09 | tests/regression/fast/vla_fast_test.py::test_13A_537__restore__cont_cube_selfcal__regression |
| 21-Oct-2026 18:21:54 | Agent 'cvpost128.cv.nrao.edu' went offline while building PIPESPECS-TESTPIPEMAINCASAMASTER-ML228PY312TEST-148. The results of that build will not be available. |
| 21-Oct-2026 18:23:10 | Failing task since return code of [/lustre/cv/sw/casa/casaci/cvpost128/bamboohome/temp/PIPESPECS-TESTPIPEMAINCASAMASTER-ML228PY312TEST-148-ScriptBuildTask-2898741367980162606.sh] was 143 while expected 0 |
| 21-Oct-2026 18:23:10 | Finished task 'Test' with result: Failed |
| 21-Oct-2026 18:23:10 | Running post build plugin 'Docker Container Cleanup' |
| 21-Oct-2026 18:23:10 | Running post build plugin 'NCover Results Collector' |
| 21-Oct-2026 18:23:10 | Running post build plugin 'Build Results Label Collector' |
| 21-Oct-2026 18:23:10 | Running post build plugin 'Clover Results Collector' |
| 21-Oct-2026 18:23:10 | Running post build plugin 'npm Cache Cleanup' |
| 21-Oct-2026 18:23:10 | Running post build plugin 'Artifact Copier' |
| 21-Oct-2026 18:23:10 | Publishing an artifact: Unit Test Result xml |
| 21-Oct-2026 18:23:10 | Artifact transfer failed with http code 401. Agent will try to recover. |
| 21-Oct-2026 18:23:10 | Unable to publish artifact [Unit Test Result xml]: |
| 21-Oct-2026 18:23:10 | The artifact is required, build will now fail. |
| 21-Oct-2026 18:23:10 | The artifact hasn't been successfully published after 240.4 ms |
| 21-Oct-2026 18:23:10 | Publishing an artifact: Regression Test Result |
| 21-Oct-2026 18:23:10 | Artifact transfer failed with http code 401. Agent will try to recover. |
| 21-Oct-2026 18:23:10 | Unable to publish artifact [Regression Test Result]: |
| 21-Oct-2026 18:23:10 | The artifact is required, build will now fail. |
| 21-Oct-2026 18:23:10 | The artifact hasn't been successfully published after 76.59 ms |
| 21-Oct-2026 18:23:10 | Finalising the build... |
| 21-Oct-2026 18:23:10 | Stopping timer. |
| 21-Oct-2026 18:23:10 | Build PIPESPECS-TESTPIPEMAINCASAMASTER-ML228PY312TEST-148 completed. |
| 21-Oct-2026 22:33:17 | tests/regression/fast/vla_fast_test.py::test_13A_537__calibration__PPR__regression |
| 21-Oct-2026 22:33:17 | tests/regression/fast/alma_if_fast_test.py::test_2022_1_00207_S__uid___A001_X2d20_X373d__PPR__regression |
| 21-Oct-2026 22:33:17 | tests/regression/fast/alma_if_fast_test.py::test_uid___A002_Xef72bb_X9d29__renorm_restore_procedure_hifa_image__regression |
| 21-Oct-2026 22:33:17 | tests/regression/fast/alma_sd_fast_test.py::test_uid___A002_X85c183_X36f_SPW15_23__PPR__regression |
| 21-Oct-2026 22:33:17 | tests/regression/fast/nobeyama_sd_fast_test.py::test_mg2_20170525142607_180419__PPR__regression |
| 21-Oct-2026 22:33:17 | tests/regression/fast/alma_if_fast_test.py::test_uid___A002_Xee1eb6_Xc58d__procedure_hifa_calsurvey__regression |
| 21-Oct-2026 22:33:17 | tests/regression/fast/alma_if_fast_test.py::test_E2E6_1_00010_S__uid___A002_Xd0a588_X2239__procedure_hifa_image__regression |
| 21-Oct-2026 22:33:17 | tests/regression/fast/alma_if_fast_test.py::test_uid___A002_Xc46ab2_X15ae_repSPW_spw16_17_small__PPR__regression |
| 21-Oct-2026 22:33:17 | tests/regression/fast/alma_if_fast_test.py::test_2023_1_00228_S__uid___A002_X1199f9e_X7c24__procedure_hifa_calimage_diffgain__regression |
| 21-Oct-2026 22:33:17 | tests/regression/fast/alma_if_fast_test.py::test_uid___A002_Xc845c0_X7366__cycle5_restore_procedure_hifa_image__regression |
| 21-Oct-2026 22:33:17 | tests/regression/fast/alma_if_fast_test.py::test_uid___A002_Xc46ab2_X15ae__selfcal_restore_procedure_hifa_image__regression |
| 21-Oct-2026 22:33:17 | [gw8] PASSED tests/regression/fast/alma_sd_fast_test.py::test_uid___A002_X85c183_X36f_SPW15_23__PPR__regression |
| 21-Oct-2026 22:33:17 | tests/regression/fast/nobeyama_sd_fast_test.py::test_mg2_20170525142607_180419__procedure_hsdn_calimage__regression |
| 21-Oct-2026 22:33:17 | [gw1] PASSED tests/regression/fast/nobeyama_sd_fast_test.py::test_mg2_20170525142607_180419__PPR__regression |
| 21-Oct-2026 22:33:17 | tests/regression/fast/vla_fast_test.py::test_13A_537__procedure_hifv__regression |
| 21-Oct-2026 22:33:17 | [gw5] PASSED tests/regression/fast/alma_if_fast_test.py::test_uid___A002_Xc46ab2_X15ae_repSPW_spw16_17_small__PPR__regression |
| 21-Oct-2026 22:33:17 | [gw4] PASSED tests/regression/fast/vla_fast_test.py::test_13A_537__calibration__PPR__regression |
| 21-Oct-2026 22:33:17 | tests/regression/fast/vla_fast_test.py::test_13A_537__restore__PPR__regression |
| 21-Oct-2026 22:33:17 | [gw4] PASSED tests/regression/fast/vla_fast_test.py::test_13A_537__restore__PPR__regression |
| 21-Oct-2026 22:33:17 | [gw8] PASSED tests/regression/fast/nobeyama_sd_fast_test.py::test_mg2_20170525142607_180419__procedure_hsdn_calimage__regression |
| 21-Oct-2026 22:33:17 | [gw2] PASSED tests/regression/fast/alma_if_fast_test.py::test_uid___A002_Xc46ab2_X15ae__selfcal_restore_procedure_hifa_image__regression |
| 21-Oct-2026 22:33:17 | [gw1] PASSED tests/regression/fast/vla_fast_test.py::test_13A_537__procedure_hifv__regression |
| 21-Oct-2026 22:33:17 | [gw10] PASSED tests/regression/fast/alma_if_fast_test.py::test_uid___A002_Xef72bb_X9d29__renorm_restore_procedure_hifa_image__regression |
| 21-Oct-2026 22:33:17 | [gw11] FAILED tests/regression/fast/alma_if_fast_test.py::test_E2E6_1_00010_S__uid___A002_Xd0a588_X2239__procedure_hifa_image__regression |
| 21-Oct-2026 22:33:17 | tests/regression/fast/alma_if_fast_test.py::test_csv_3899_eb2_small__procedure_hifa_calimage__regression |
| 21-Oct-2026 22:33:17 | [gw6] PASSED tests/regression/fast/alma_if_fast_test.py::test_uid___A002_Xc845c0_X7366__cycle5_restore_procedure_hifa_image__regression |
| 21-Oct-2026 22:33:17 | [gw11] FAILED tests/regression/fast/alma_if_fast_test.py::test_csv_3899_eb2_small__procedure_hifa_calimage__regression |
| 21-Oct-2026 22:33:17 | [gw3] FAILED tests/regression/fast/alma_if_fast_test.py::test_uid___A002_Xee1eb6_Xc58d__procedure_hifa_calsurvey__regression |
| 21-Oct-2026 22:33:17 | tests/regression/fast/alma_sd_fast_test.py::test_uid___A002_X85c183_X36f__procedure_hsd_calimage__regression |
| 21-Oct-2026 22:33:17 | [gw7] PASSED tests/regression/fast/vla_fast_test.py::test_13A_537__restore__cont_cube_selfcal__regression |
| 21-Oct-2026 22:33:17 | tests/regression/fast/vlass_fast_test.py::test_TSKY0001__vlass_quicklook_regression |
| 21-Oct-2026 22:33:17 | [gw7] PASSED tests/regression/fast/vlass_fast_test.py::test_TSKY0001__vlass_quicklook_regression |
| 21-Oct-2026 22:33:17 | [gw3] PASSED tests/regression/fast/alma_sd_fast_test.py::test_uid___A002_X85c183_X36f__procedure_hsd_calimage__regression |
| 21-Oct-2026 22:33:17 | [gw9] PASSED tests/regression/fast/alma_if_fast_test.py::test_2022_1_00207_S__uid___A001_X2d20_X373d__PPR__regression |
| 21-Oct-2026 22:33:17 | [gw0] FAILED tests/regression/fast/alma_if_fast_test.py::test_2023_1_00228_S__uid___A002_X1199f9e_X7c24__procedure_hifa_calimage_diffgain__regression |
| 21-Oct-2026 22:33:17 | |
| 21-Oct-2026 22:33:17 | =================================== FAILURES =================================== |
| 21-Oct-2026 22:33:17 | _ test_E2E6_1_00010_S__uid___A002_Xd0a588_X2239__procedure_hifa_image__regression _ |
| 21-Oct-2026 22:33:17 | [gw11] linux -- Python 3.12.4 /lustre/cv/sw/casa/casaci/cvpost128/bamboohome/xml-data/build-dir/PIPESPECS-TESTPIPEMAINCASAMASTER-ML228PY312TEST/casa-build-utils/pipeline/workdir/casa-6.7.7-15-pipeline-2026.3.0.35+dirty-py3.12.el8/lib/py/bin/python3 |
| 21-Oct-2026 22:33:17 | @pytest.mark.twelve |
| 21-Oct-2026 22:33:17 | def test_E2E6_1_00010_S__uid___A002_Xd0a588_X2239__procedure_hifa_image__regression(): |
| 21-Oct-2026 22:33:17 | """Run ALMA cal+image regression on a 12m moderate-size test dataset in ASDM. |
| 21-Oct-2026 22:33:17 | |
| 21-Oct-2026 22:33:17 | Recipe name: procedure_hifa_calimage |
| 21-Oct-2026 22:33:17 | Dataset: E2E6.1.00010.S: uid___A002_Xd0a588_X2239 |
| 21-Oct-2026 22:33:17 | """ |
| 21-Oct-2026 22:33:17 | ref_directory = 'pl-regressiontest/E2E6.1.00010.S' |
| 21-Oct-2026 22:33:17 | |
| 21-Oct-2026 22:33:17 | pt = PipelineTester( |
| 21-Oct-2026 22:33:17 | visname=['uid___A002_Xd0a588_X2239'], |
| 21-Oct-2026 22:33:17 | recipe='procedure_hifa_calimage.xml', |
| 21-Oct-2026 22:33:17 | input_dir=ref_directory, |
| 21-Oct-2026 22:33:17 | expectedoutput_dir=ref_directory, |
| 21-Oct-2026 22:33:17 | ) |
| 21-Oct-2026 22:33:17 | |
| 21-Oct-2026 22:33:17 | > pt.run() |
| 21-Oct-2026 22:33:17 | |
| 21-Oct-2026 22:33:17 | tests/regression/fast/alma_if_fast_test.py:162: |
| 21-Oct-2026 22:33:17 | _ _ _ _ _ _ _ _ _ _ _ _ _ _ _ _ _ _ _ _ _ _ _ _ _ _ _ _ _ _ _ _ _ _ _ _ _ _ _ _ |
| 21-Oct-2026 22:33:17 | tests/testing_utils.py:381: in run |
| 21-Oct-2026 22:33:17 | self.__compare_results(new_file, default_relative_tolerance) |
| 21-Oct-2026 22:33:17 | _ _ _ _ _ _ _ _ _ _ _ _ _ _ _ _ _ _ _ _ _ _ _ _ _ _ _ _ _ _ _ _ _ _ _ _ _ _ _ _ |
| 21-Oct-2026 22:33:17 | |
| 21-Oct-2026 22:33:17 | self = <tests.testing_utils.PipelineTester object at 0x7f0f3d9802c0> |
| 21-Oct-2026 22:33:17 | new_file = 'uid___A002_Xd0a588_X2239.NEW.results.txt' |
| 21-Oct-2026 22:33:17 | relative_tolerance = 1e-07 |
| 21-Oct-2026 22:33:17 | |
| 21-Oct-2026 22:33:17 | def __compare_results(self, new_file: str, relative_tolerance: float) -> None: |
| 21-Oct-2026 22:33:17 | """ |
| 21-Oct-2026 22:33:17 | Compare results between new one loaded from file and old one. |
| 21-Oct-2026 22:33:17 | |
| 21-Oct-2026 22:33:17 | Args: |
| 21-Oct-2026 22:33:17 | new_file : file path of new results |
| 21-Oct-2026 22:33:17 | relative_tolerance : relative tolerance of output value |
| 21-Oct-2026 22:33:17 | """ |
| 21-Oct-2026 22:33:17 | with open(self.expectedoutput_file) as expected_fd, open(new_file) as new_fd: |
| 21-Oct-2026 22:33:17 | expected_results = expected_fd.readlines() |
| 21-Oct-2026 22:33:17 | new_results = new_fd.readlines() |
| 21-Oct-2026 22:33:17 | errors = [] |
| 21-Oct-2026 22:33:17 | worst_diff = (0, 0) |
| 21-Oct-2026 22:33:17 | worst_percent_diff = (0, 0) |
| 21-Oct-2026 22:33:17 | for old, new in zip(expected_results, new_results): |
| 21-Oct-2026 22:33:17 | try: |
| 21-Oct-2026 22:33:17 | oldkey, oldval, tol = self.__sanitize_results_string(old) |
| 21-Oct-2026 22:33:17 | newkey, newval, _ = self.__sanitize_results_string(new) |
| 21-Oct-2026 22:33:17 | except ValueError as e: |
| 21-Oct-2026 22:33:17 | errorstr = "The results: {0} could not be parsed. Error: {1}".format(new, str(e)) |
| 21-Oct-2026 22:33:17 | errors.append(errorstr) |
| 21-Oct-2026 22:33:17 | continue |
| 21-Oct-2026 22:33:17 | |
| 21-Oct-2026 22:33:17 | assert oldkey == newkey, f"Expected key {oldkey} does not match new key {newkey}." |
| 21-Oct-2026 22:33:17 | tolerance = tol if tol else relative_tolerance |
| 21-Oct-2026 22:33:17 | if newval is not None: |
| 21-Oct-2026 22:33:17 | LOG.info('Comparing %s to %s with a rel. tolerance of %s', oldval, newval, tolerance) |
| 21-Oct-2026 22:33:17 | if oldval != pytest.approx(newval, rel=tolerance): |
| 21-Oct-2026 22:33:17 | diff = oldval-newval |
| 21-Oct-2026 22:33:17 | percent_diff = (oldval-newval)/oldval * 100 if oldval != 0 else 100 |
| 21-Oct-2026 22:33:17 | if abs(diff) > abs(worst_diff[0]): |
| 21-Oct-2026 22:33:17 | worst_diff = diff, oldkey |
| 21-Oct-2026 22:33:17 | if abs(percent_diff) > abs(worst_percent_diff[0]): |
| 21-Oct-2026 22:33:17 | worst_percent_diff = percent_diff, oldkey |
| 21-Oct-2026 22:33:17 | errorstr = f"{oldkey}\n\tvalues differ by > a relative difference of {tolerance}\n\texpected: {oldval}\n\tnew: {newval}\n\tdiff: {diff}\n\tpercent_diff: {percent_diff}%" |
| 21-Oct-2026 22:33:17 | errors.append(errorstr) |
| 21-Oct-2026 22:33:17 | elif oldval is not None: |
| 21-Oct-2026 22:33:17 | # If only the new value is None, fail |
| 21-Oct-2026 22:33:17 | errorstr = f"{oldkey}\n\tvalue is None\n\texpected: {oldval}\n\tnew: {newval}" |
| 21-Oct-2026 22:33:17 | errors.append(errorstr) |
| 21-Oct-2026 22:33:17 | else: |
| 21-Oct-2026 22:33:17 | # If old and new values are both None, this is expected, so pass |
| 21-Oct-2026 22:33:17 | LOG.info('Comparing %s and %s... both values are None.', oldval, newval) |
| 21-Oct-2026 22:33:17 | |
| 21-Oct-2026 22:33:17 | [LOG.warning(x) for x in errors] |
| 21-Oct-2026 22:33:17 | n_errors = len(errors) |
| 21-Oct-2026 22:33:17 | if n_errors > 0: |