Build: #100 failed
Job: Test ManyLinux 2.28 Python 3.12 failed
Build log
The build generated 43,113 lines of output. The output is too long and has been truncated to the last 1,000 lines. Download or view full build log.
| 11-Oct-2026 12:36:57 | ../../casa-6.7.4-12-pipeline-2026.3.0.29-py3.12.el8/lib/py/lib/python3.12/site-packages/casaplotms/private/plotms_pb2.py:729 |
| 11-Oct-2026 12:36:57 | /lustre/cv/sw/casa/casaci/cvpost128/bamboohome/xml-data/build-dir/PIPESPECS-TESTPIPEMAINCASA674-ML228PY312TEST/casa-build-utils/pipeline/workdir/casa-6.7.4-12-pipeline-2026.3.0.29-py3.12.el8/lib/py/lib/python3.12/site-packages/casaplotms/private/plotms_pb2.py:729: DeprecationWarning: Call to deprecated create function FieldDescriptor(). Note: Create unlinked descriptors is going to go away. Please use get/find descriptors from generated code or query the descriptor_pool. |
| 11-Oct-2026 12:36:57 | _descriptor.FieldDescriptor( |
| 11-Oct-2026 12:36:57 | |
| 11-Oct-2026 12:36:57 | ../../casa-6.7.4-12-pipeline-2026.3.0.29-py3.12.el8/lib/py/lib/python3.12/site-packages/casaplotms/private/plotms_pb2.py:736 |
| 11-Oct-2026 12:36:57 | /lustre/cv/sw/casa/casaci/cvpost128/bamboohome/xml-data/build-dir/PIPESPECS-TESTPIPEMAINCASA674-ML228PY312TEST/casa-build-utils/pipeline/workdir/casa-6.7.4-12-pipeline-2026.3.0.29-py3.12.el8/lib/py/lib/python3.12/site-packages/casaplotms/private/plotms_pb2.py:736: DeprecationWarning: Call to deprecated create function FieldDescriptor(). Note: Create unlinked descriptors is going to go away. Please use get/find descriptors from generated code or query the descriptor_pool. |
| 11-Oct-2026 12:36:57 | _descriptor.FieldDescriptor( |
| 11-Oct-2026 12:36:57 | |
| 11-Oct-2026 12:36:57 | ../../casa-6.7.4-12-pipeline-2026.3.0.29-py3.12.el8/lib/py/lib/python3.12/site-packages/casaplotms/private/plotms_pb2.py:743 |
| 11-Oct-2026 12:36:57 | /lustre/cv/sw/casa/casaci/cvpost128/bamboohome/xml-data/build-dir/PIPESPECS-TESTPIPEMAINCASA674-ML228PY312TEST/casa-build-utils/pipeline/workdir/casa-6.7.4-12-pipeline-2026.3.0.29-py3.12.el8/lib/py/lib/python3.12/site-packages/casaplotms/private/plotms_pb2.py:743: DeprecationWarning: Call to deprecated create function FieldDescriptor(). Note: Create unlinked descriptors is going to go away. Please use get/find descriptors from generated code or query the descriptor_pool. |
| 11-Oct-2026 12:36:57 | _descriptor.FieldDescriptor( |
| 11-Oct-2026 12:36:57 | |
| 11-Oct-2026 12:36:57 | ../../casa-6.7.4-12-pipeline-2026.3.0.29-py3.12.el8/lib/py/lib/python3.12/site-packages/casaplotms/private/plotms_pb2.py:750 |
| 11-Oct-2026 12:36:57 | /lustre/cv/sw/casa/casaci/cvpost128/bamboohome/xml-data/build-dir/PIPESPECS-TESTPIPEMAINCASA674-ML228PY312TEST/casa-build-utils/pipeline/workdir/casa-6.7.4-12-pipeline-2026.3.0.29-py3.12.el8/lib/py/lib/python3.12/site-packages/casaplotms/private/plotms_pb2.py:750: DeprecationWarning: Call to deprecated create function FieldDescriptor(). Note: Create unlinked descriptors is going to go away. Please use get/find descriptors from generated code or query the descriptor_pool. |
| 11-Oct-2026 12:36:57 | _descriptor.FieldDescriptor( |
| 11-Oct-2026 12:36:57 | |
| 11-Oct-2026 12:36:57 | ../../casa-6.7.4-12-pipeline-2026.3.0.29-py3.12.el8/lib/py/lib/python3.12/site-packages/casaplotms/private/plotms_pb2.py:757 |
| 11-Oct-2026 12:36:57 | /lustre/cv/sw/casa/casaci/cvpost128/bamboohome/xml-data/build-dir/PIPESPECS-TESTPIPEMAINCASA674-ML228PY312TEST/casa-build-utils/pipeline/workdir/casa-6.7.4-12-pipeline-2026.3.0.29-py3.12.el8/lib/py/lib/python3.12/site-packages/casaplotms/private/plotms_pb2.py:757: DeprecationWarning: Call to deprecated create function FieldDescriptor(). Note: Create unlinked descriptors is going to go away. Please use get/find descriptors from generated code or query the descriptor_pool. |
| 11-Oct-2026 12:36:57 | _descriptor.FieldDescriptor( |
| 11-Oct-2026 12:36:57 | |
| 11-Oct-2026 12:36:57 | ../../casa-6.7.4-12-pipeline-2026.3.0.29-py3.12.el8/lib/py/lib/python3.12/site-packages/casaplotms/private/plotms_pb2.py:764 |
| 11-Oct-2026 12:36:57 | /lustre/cv/sw/casa/casaci/cvpost128/bamboohome/xml-data/build-dir/PIPESPECS-TESTPIPEMAINCASA674-ML228PY312TEST/casa-build-utils/pipeline/workdir/casa-6.7.4-12-pipeline-2026.3.0.29-py3.12.el8/lib/py/lib/python3.12/site-packages/casaplotms/private/plotms_pb2.py:764: DeprecationWarning: Call to deprecated create function FieldDescriptor(). Note: Create unlinked descriptors is going to go away. Please use get/find descriptors from generated code or query the descriptor_pool. |
| 11-Oct-2026 12:36:57 | _descriptor.FieldDescriptor( |
| 11-Oct-2026 12:36:57 | |
| 11-Oct-2026 12:36:57 | ../../casa-6.7.4-12-pipeline-2026.3.0.29-py3.12.el8/lib/py/lib/python3.12/site-packages/casaplotms/private/plotms_pb2.py:771 |
| 11-Oct-2026 12:36:57 | /lustre/cv/sw/casa/casaci/cvpost128/bamboohome/xml-data/build-dir/PIPESPECS-TESTPIPEMAINCASA674-ML228PY312TEST/casa-build-utils/pipeline/workdir/casa-6.7.4-12-pipeline-2026.3.0.29-py3.12.el8/lib/py/lib/python3.12/site-packages/casaplotms/private/plotms_pb2.py:771: DeprecationWarning: Call to deprecated create function FieldDescriptor(). Note: Create unlinked descriptors is going to go away. Please use get/find descriptors from generated code or query the descriptor_pool. |
| 11-Oct-2026 12:36:57 | _descriptor.FieldDescriptor( |
| 11-Oct-2026 12:36:57 | |
| 11-Oct-2026 12:36:57 | ../../casa-6.7.4-12-pipeline-2026.3.0.29-py3.12.el8/lib/py/lib/python3.12/site-packages/casaplotms/private/plotms_pb2.py:701 |
| 11-Oct-2026 12:36:57 | /lustre/cv/sw/casa/casaci/cvpost128/bamboohome/xml-data/build-dir/PIPESPECS-TESTPIPEMAINCASA674-ML228PY312TEST/casa-build-utils/pipeline/workdir/casa-6.7.4-12-pipeline-2026.3.0.29-py3.12.el8/lib/py/lib/python3.12/site-packages/casaplotms/private/plotms_pb2.py:701: DeprecationWarning: Call to deprecated create function Descriptor(). Note: Create unlinked descriptors is going to go away. Please use get/find descriptors from generated code or query the descriptor_pool. |
| 11-Oct-2026 12:36:57 | _SETFLAGEXTENSION = _descriptor.Descriptor( |
| 11-Oct-2026 12:36:57 | |
| 11-Oct-2026 12:36:57 | ../../casa-6.7.4-12-pipeline-2026.3.0.29-py3.12.el8/lib/py/lib/python3.12/site-packages/casaplotms/private/plotms_pb2.py:802 |
| 11-Oct-2026 12:36:57 | /lustre/cv/sw/casa/casaci/cvpost128/bamboohome/xml-data/build-dir/PIPESPECS-TESTPIPEMAINCASA674-ML228PY312TEST/casa-build-utils/pipeline/workdir/casa-6.7.4-12-pipeline-2026.3.0.29-py3.12.el8/lib/py/lib/python3.12/site-packages/casaplotms/private/plotms_pb2.py:802: DeprecationWarning: Call to deprecated create function FieldDescriptor(). Note: Create unlinked descriptors is going to go away. Please use get/find descriptors from generated code or query the descriptor_pool. |
| 11-Oct-2026 12:36:57 | _descriptor.FieldDescriptor( |
| 11-Oct-2026 12:36:57 | |
| 11-Oct-2026 12:36:57 | ../../casa-6.7.4-12-pipeline-2026.3.0.29-py3.12.el8/lib/py/lib/python3.12/site-packages/casaplotms/private/plotms_pb2.py:795 |
| 11-Oct-2026 12:36:57 | /lustre/cv/sw/casa/casaci/cvpost128/bamboohome/xml-data/build-dir/PIPESPECS-TESTPIPEMAINCASA674-ML228PY312TEST/casa-build-utils/pipeline/workdir/casa-6.7.4-12-pipeline-2026.3.0.29-py3.12.el8/lib/py/lib/python3.12/site-packages/casaplotms/private/plotms_pb2.py:795: DeprecationWarning: Call to deprecated create function Descriptor(). Note: Create unlinked descriptors is going to go away. Please use get/find descriptors from generated code or query the descriptor_pool. |
| 11-Oct-2026 12:36:57 | _EXPORTRANGE = _descriptor.Descriptor( |
| 11-Oct-2026 12:36:57 | |
| 11-Oct-2026 12:36:57 | ../../casa-6.7.4-12-pipeline-2026.3.0.29-py3.12.el8/lib/py/lib/python3.12/site-packages/casaplotms/private/plotms_pb2.py:833 |
| 11-Oct-2026 12:36:57 | /lustre/cv/sw/casa/casaci/cvpost128/bamboohome/xml-data/build-dir/PIPESPECS-TESTPIPEMAINCASA674-ML228PY312TEST/casa-build-utils/pipeline/workdir/casa-6.7.4-12-pipeline-2026.3.0.29-py3.12.el8/lib/py/lib/python3.12/site-packages/casaplotms/private/plotms_pb2.py:833: DeprecationWarning: Call to deprecated create function FieldDescriptor(). Note: Create unlinked descriptors is going to go away. Please use get/find descriptors from generated code or query the descriptor_pool. |
| 11-Oct-2026 12:36:57 | _descriptor.FieldDescriptor( |
| 11-Oct-2026 12:36:57 | |
| 11-Oct-2026 12:36:57 | ../../casa-6.7.4-12-pipeline-2026.3.0.29-py3.12.el8/lib/py/lib/python3.12/site-packages/casaplotms/private/plotms_pb2.py:840 |
| 11-Oct-2026 12:36:57 | /lustre/cv/sw/casa/casaci/cvpost128/bamboohome/xml-data/build-dir/PIPESPECS-TESTPIPEMAINCASA674-ML228PY312TEST/casa-build-utils/pipeline/workdir/casa-6.7.4-12-pipeline-2026.3.0.29-py3.12.el8/lib/py/lib/python3.12/site-packages/casaplotms/private/plotms_pb2.py:840: DeprecationWarning: Call to deprecated create function FieldDescriptor(). Note: Create unlinked descriptors is going to go away. Please use get/find descriptors from generated code or query the descriptor_pool. |
| 11-Oct-2026 12:36:57 | _descriptor.FieldDescriptor( |
| 11-Oct-2026 12:36:57 | |
| 11-Oct-2026 12:36:57 | ../../casa-6.7.4-12-pipeline-2026.3.0.29-py3.12.el8/lib/py/lib/python3.12/site-packages/casaplotms/private/plotms_pb2.py:847 |
| 11-Oct-2026 12:36:57 | /lustre/cv/sw/casa/casaci/cvpost128/bamboohome/xml-data/build-dir/PIPESPECS-TESTPIPEMAINCASA674-ML228PY312TEST/casa-build-utils/pipeline/workdir/casa-6.7.4-12-pipeline-2026.3.0.29-py3.12.el8/lib/py/lib/python3.12/site-packages/casaplotms/private/plotms_pb2.py:847: DeprecationWarning: Call to deprecated create function FieldDescriptor(). Note: Create unlinked descriptors is going to go away. Please use get/find descriptors from generated code or query the descriptor_pool. |
| 11-Oct-2026 12:36:57 | _descriptor.FieldDescriptor( |
| 11-Oct-2026 12:36:57 | |
| 11-Oct-2026 12:36:57 | ../../casa-6.7.4-12-pipeline-2026.3.0.29-py3.12.el8/lib/py/lib/python3.12/site-packages/casaplotms/private/plotms_pb2.py:854 |
| 11-Oct-2026 12:36:58 | /lustre/cv/sw/casa/casaci/cvpost128/bamboohome/xml-data/build-dir/PIPESPECS-TESTPIPEMAINCASA674-ML228PY312TEST/casa-build-utils/pipeline/workdir/casa-6.7.4-12-pipeline-2026.3.0.29-py3.12.el8/lib/py/lib/python3.12/site-packages/casaplotms/private/plotms_pb2.py:854: DeprecationWarning: Call to deprecated create function FieldDescriptor(). Note: Create unlinked descriptors is going to go away. Please use get/find descriptors from generated code or query the descriptor_pool. |
| 11-Oct-2026 12:36:58 | _descriptor.FieldDescriptor( |
| 11-Oct-2026 12:36:58 | |
| 11-Oct-2026 12:36:58 | ../../casa-6.7.4-12-pipeline-2026.3.0.29-py3.12.el8/lib/py/lib/python3.12/site-packages/casaplotms/private/plotms_pb2.py:861 |
| 11-Oct-2026 12:36:58 | /lustre/cv/sw/casa/casaci/cvpost128/bamboohome/xml-data/build-dir/PIPESPECS-TESTPIPEMAINCASA674-ML228PY312TEST/casa-build-utils/pipeline/workdir/casa-6.7.4-12-pipeline-2026.3.0.29-py3.12.el8/lib/py/lib/python3.12/site-packages/casaplotms/private/plotms_pb2.py:861: DeprecationWarning: Call to deprecated create function FieldDescriptor(). Note: Create unlinked descriptors is going to go away. Please use get/find descriptors from generated code or query the descriptor_pool. |
| 11-Oct-2026 12:36:58 | _descriptor.FieldDescriptor( |
| 11-Oct-2026 12:36:58 | |
| 11-Oct-2026 12:36:58 | ../../casa-6.7.4-12-pipeline-2026.3.0.29-py3.12.el8/lib/py/lib/python3.12/site-packages/casaplotms/private/plotms_pb2.py:868 |
| 11-Oct-2026 12:36:58 | /lustre/cv/sw/casa/casaci/cvpost128/bamboohome/xml-data/build-dir/PIPESPECS-TESTPIPEMAINCASA674-ML228PY312TEST/casa-build-utils/pipeline/workdir/casa-6.7.4-12-pipeline-2026.3.0.29-py3.12.el8/lib/py/lib/python3.12/site-packages/casaplotms/private/plotms_pb2.py:868: DeprecationWarning: Call to deprecated create function FieldDescriptor(). Note: Create unlinked descriptors is going to go away. Please use get/find descriptors from generated code or query the descriptor_pool. |
| 11-Oct-2026 12:36:58 | _descriptor.FieldDescriptor( |
| 11-Oct-2026 12:36:58 | |
| 11-Oct-2026 12:36:58 | ../../casa-6.7.4-12-pipeline-2026.3.0.29-py3.12.el8/lib/py/lib/python3.12/site-packages/casaplotms/private/plotms_pb2.py:875 |
| 11-Oct-2026 12:36:58 | /lustre/cv/sw/casa/casaci/cvpost128/bamboohome/xml-data/build-dir/PIPESPECS-TESTPIPEMAINCASA674-ML228PY312TEST/casa-build-utils/pipeline/workdir/casa-6.7.4-12-pipeline-2026.3.0.29-py3.12.el8/lib/py/lib/python3.12/site-packages/casaplotms/private/plotms_pb2.py:875: DeprecationWarning: Call to deprecated create function FieldDescriptor(). Note: Create unlinked descriptors is going to go away. Please use get/find descriptors from generated code or query the descriptor_pool. |
| 11-Oct-2026 12:36:58 | _descriptor.FieldDescriptor( |
| 11-Oct-2026 12:36:58 | |
| 11-Oct-2026 12:36:58 | ../../casa-6.7.4-12-pipeline-2026.3.0.29-py3.12.el8/lib/py/lib/python3.12/site-packages/casaplotms/private/plotms_pb2.py:882 |
| 11-Oct-2026 12:36:58 | /lustre/cv/sw/casa/casaci/cvpost128/bamboohome/xml-data/build-dir/PIPESPECS-TESTPIPEMAINCASA674-ML228PY312TEST/casa-build-utils/pipeline/workdir/casa-6.7.4-12-pipeline-2026.3.0.29-py3.12.el8/lib/py/lib/python3.12/site-packages/casaplotms/private/plotms_pb2.py:882: DeprecationWarning: Call to deprecated create function FieldDescriptor(). Note: Create unlinked descriptors is going to go away. Please use get/find descriptors from generated code or query the descriptor_pool. |
| 11-Oct-2026 12:36:58 | _descriptor.FieldDescriptor( |
| 11-Oct-2026 12:36:58 | |
| 11-Oct-2026 12:36:58 | ../../casa-6.7.4-12-pipeline-2026.3.0.29-py3.12.el8/lib/py/lib/python3.12/site-packages/casaplotms/private/plotms_pb2.py:889 |
| 11-Oct-2026 12:36:58 | /lustre/cv/sw/casa/casaci/cvpost128/bamboohome/xml-data/build-dir/PIPESPECS-TESTPIPEMAINCASA674-ML228PY312TEST/casa-build-utils/pipeline/workdir/casa-6.7.4-12-pipeline-2026.3.0.29-py3.12.el8/lib/py/lib/python3.12/site-packages/casaplotms/private/plotms_pb2.py:889: DeprecationWarning: Call to deprecated create function FieldDescriptor(). Note: Create unlinked descriptors is going to go away. Please use get/find descriptors from generated code or query the descriptor_pool. |
| 11-Oct-2026 12:36:58 | _descriptor.FieldDescriptor( |
| 11-Oct-2026 12:36:58 | |
| 11-Oct-2026 12:36:58 | ../../casa-6.7.4-12-pipeline-2026.3.0.29-py3.12.el8/lib/py/lib/python3.12/site-packages/casaplotms/private/plotms_pb2.py:826 |
| 11-Oct-2026 12:36:58 | /lustre/cv/sw/casa/casaci/cvpost128/bamboohome/xml-data/build-dir/PIPESPECS-TESTPIPEMAINCASA674-ML228PY312TEST/casa-build-utils/pipeline/workdir/casa-6.7.4-12-pipeline-2026.3.0.29-py3.12.el8/lib/py/lib/python3.12/site-packages/casaplotms/private/plotms_pb2.py:826: DeprecationWarning: Call to deprecated create function Descriptor(). Note: Create unlinked descriptors is going to go away. Please use get/find descriptors from generated code or query the descriptor_pool. |
| 11-Oct-2026 12:36:58 | _SETITERATE = _descriptor.Descriptor( |
| 11-Oct-2026 12:36:58 | |
| 11-Oct-2026 12:36:58 | ../../casa-6.7.4-12-pipeline-2026.3.0.29-py3.12.el8/lib/py/lib/python3.12/site-packages/casaplotms/private/plotms_pb2.py:920 |
| 11-Oct-2026 12:36:58 | /lustre/cv/sw/casa/casaci/cvpost128/bamboohome/xml-data/build-dir/PIPESPECS-TESTPIPEMAINCASA674-ML228PY312TEST/casa-build-utils/pipeline/workdir/casa-6.7.4-12-pipeline-2026.3.0.29-py3.12.el8/lib/py/lib/python3.12/site-packages/casaplotms/private/plotms_pb2.py:920: DeprecationWarning: Call to deprecated create function FieldDescriptor(). Note: Create unlinked descriptors is going to go away. Please use get/find descriptors from generated code or query the descriptor_pool. |
| 11-Oct-2026 12:36:58 | _descriptor.FieldDescriptor( |
| 11-Oct-2026 12:36:58 | |
| 11-Oct-2026 12:36:58 | ../../casa-6.7.4-12-pipeline-2026.3.0.29-py3.12.el8/lib/py/lib/python3.12/site-packages/casaplotms/private/plotms_pb2.py:927 |
| 11-Oct-2026 12:36:58 | /lustre/cv/sw/casa/casaci/cvpost128/bamboohome/xml-data/build-dir/PIPESPECS-TESTPIPEMAINCASA674-ML228PY312TEST/casa-build-utils/pipeline/workdir/casa-6.7.4-12-pipeline-2026.3.0.29-py3.12.el8/lib/py/lib/python3.12/site-packages/casaplotms/private/plotms_pb2.py:927: DeprecationWarning: Call to deprecated create function FieldDescriptor(). Note: Create unlinked descriptors is going to go away. Please use get/find descriptors from generated code or query the descriptor_pool. |
| 11-Oct-2026 12:36:58 | _descriptor.FieldDescriptor( |
| 11-Oct-2026 12:36:58 | |
| 11-Oct-2026 12:36:58 | ../../casa-6.7.4-12-pipeline-2026.3.0.29-py3.12.el8/lib/py/lib/python3.12/site-packages/casaplotms/private/plotms_pb2.py:934 |
| 11-Oct-2026 12:36:58 | /lustre/cv/sw/casa/casaci/cvpost128/bamboohome/xml-data/build-dir/PIPESPECS-TESTPIPEMAINCASA674-ML228PY312TEST/casa-build-utils/pipeline/workdir/casa-6.7.4-12-pipeline-2026.3.0.29-py3.12.el8/lib/py/lib/python3.12/site-packages/casaplotms/private/plotms_pb2.py:934: DeprecationWarning: Call to deprecated create function FieldDescriptor(). Note: Create unlinked descriptors is going to go away. Please use get/find descriptors from generated code or query the descriptor_pool. |
| 11-Oct-2026 12:36:58 | _descriptor.FieldDescriptor( |
| 11-Oct-2026 12:36:58 | |
| 11-Oct-2026 12:36:58 | ../../casa-6.7.4-12-pipeline-2026.3.0.29-py3.12.el8/lib/py/lib/python3.12/site-packages/casaplotms/private/plotms_pb2.py:913 |
| 11-Oct-2026 12:36:58 | /lustre/cv/sw/casa/casaci/cvpost128/bamboohome/xml-data/build-dir/PIPESPECS-TESTPIPEMAINCASA674-ML228PY312TEST/casa-build-utils/pipeline/workdir/casa-6.7.4-12-pipeline-2026.3.0.29-py3.12.el8/lib/py/lib/python3.12/site-packages/casaplotms/private/plotms_pb2.py:913: DeprecationWarning: Call to deprecated create function Descriptor(). Note: Create unlinked descriptors is going to go away. Please use get/find descriptors from generated code or query the descriptor_pool. |
| 11-Oct-2026 12:36:58 | _SETSTRING = _descriptor.Descriptor( |
| 11-Oct-2026 12:36:58 | |
| 11-Oct-2026 12:36:58 | ../../casa-6.7.4-12-pipeline-2026.3.0.29-py3.12.el8/lib/py/lib/python3.12/site-packages/casaplotms/private/plotms_pb2.py:965 |
| 11-Oct-2026 12:36:58 | /lustre/cv/sw/casa/casaci/cvpost128/bamboohome/xml-data/build-dir/PIPESPECS-TESTPIPEMAINCASA674-ML228PY312TEST/casa-build-utils/pipeline/workdir/casa-6.7.4-12-pipeline-2026.3.0.29-py3.12.el8/lib/py/lib/python3.12/site-packages/casaplotms/private/plotms_pb2.py:965: DeprecationWarning: Call to deprecated create function FieldDescriptor(). Note: Create unlinked descriptors is going to go away. Please use get/find descriptors from generated code or query the descriptor_pool. |
| 11-Oct-2026 12:36:58 | _descriptor.FieldDescriptor( |
| 11-Oct-2026 12:36:58 | |
| 11-Oct-2026 12:36:58 | ../../casa-6.7.4-12-pipeline-2026.3.0.29-py3.12.el8/lib/py/lib/python3.12/site-packages/casaplotms/private/plotms_pb2.py:972 |
| 11-Oct-2026 12:36:58 | /lustre/cv/sw/casa/casaci/cvpost128/bamboohome/xml-data/build-dir/PIPESPECS-TESTPIPEMAINCASA674-ML228PY312TEST/casa-build-utils/pipeline/workdir/casa-6.7.4-12-pipeline-2026.3.0.29-py3.12.el8/lib/py/lib/python3.12/site-packages/casaplotms/private/plotms_pb2.py:972: DeprecationWarning: Call to deprecated create function FieldDescriptor(). Note: Create unlinked descriptors is going to go away. Please use get/find descriptors from generated code or query the descriptor_pool. |
| 11-Oct-2026 12:36:58 | _descriptor.FieldDescriptor( |
| 11-Oct-2026 12:36:58 | |
| 11-Oct-2026 12:36:58 | ../../casa-6.7.4-12-pipeline-2026.3.0.29-py3.12.el8/lib/py/lib/python3.12/site-packages/casaplotms/private/plotms_pb2.py:979 |
| 11-Oct-2026 12:37:11 | /lustre/cv/sw/casa/casaci/cvpost128/bamboohome/xml-data/build-dir/PIPESPECS-TESTPIPEMAINCASA674-ML228PY312TEST/casa-build-utils/pipeline/workdir/casa-6.7.4-12-pipeline-2026.3.0.29-py3.12.el8/lib/py/lib/python3.12/site-packages/casaplotms/private/plotms_pb2.py:979: DeprecationWarning: Call to deprecated create function FieldDescriptor(). Note: Create unlinked descriptors is going to go away. Please use get/find descriptors from generated code or query the descriptor_pool. |
| 11-Oct-2026 12:37:11 | _descriptor.FieldDescriptor( |
| 11-Oct-2026 12:37:11 | |
| 11-Oct-2026 12:37:11 | pipeline/hifa/tasks/applycal/ampphase_vs_freq_qa_test.py::test_score_all_scans |
| 11-Oct-2026 12:37:11 | /lustre/cv/sw/casa/casaci/cvpost128/bamboohome/xml-data/build-dir/PIPESPECS-TESTPIPEMAINCASA674-ML228PY312TEST/casa-build-utils/pipeline/workdir/casa-6.7.4-12-pipeline-2026.3.0.29-py3.12.el8/lib/py/lib/python3.12/site-packages/numpy/ma/core.py:498: ComplexWarning: Casting complex values to real discards the imaginary part |
| 11-Oct-2026 12:37:11 | fill_value = np.asarray(fill_value, dtype=ndtype) |
| 11-Oct-2026 12:37:11 | |
| 11-Oct-2026 12:37:11 | -- Docs: https://docs.pytest.org/en/stable/how-to/capture-warnings.html |
| 11-Oct-2026 12:37:11 | - generated xml file: /lustre/cv/sw/casa/casaci/cvpost128/bamboohome/xml-data/build-dir/PIPESPECS-TESTPIPEMAINCASA674-ML228PY312TEST/casa-build-utils/pipeline/workdir/pipeline_unit_test_result.xml - |
| 11-Oct-2026 12:37:11 | =========================== short test summary info ============================ |
| 11-Oct-2026 12:37:11 | SKIPPED [2] h/tasks/common/atmutil_test.py:218: need_vis |
| 11-Oct-2026 12:37:11 | SKIPPED [3] h/tasks/common/atmutil_test.py:238: need_vis |
| 11-Oct-2026 12:37:11 | SKIPPED [2] h/tasks/common/atmutil_test.py:256: need_vis |
| 11-Oct-2026 12:37:11 | SKIPPED [1] infrastructure/daskhelpers_test.py:87: dask not installed |
| 11-Oct-2026 12:37:11 | SKIPPED [1] infrastructure/daskhelpers_test.py:153: dask not installed |
| 11-Oct-2026 12:37:11 | SKIPPED [1] infrastructure/daskhelpers_test.py:202: dask not installed |
| 11-Oct-2026 12:37:11 | SKIPPED [1] recipes/recipe_converter_test.py:382: Skip testing main. Its output must be carefully examined by developer. |
| 11-Oct-2026 12:37:11 | SKIPPED [1] recipes/recipe_converter_test.py:387: Skip testing generate_all. Its output must be carefully examined by developer. |
| 11-Oct-2026 12:37:11 | ========== 842 passed, 12 skipped, 104 warnings in 421.75s (0:07:01) =========== |
| 11-Oct-2026 12:37:11 | 0 |
| 11-Oct-2026 12:37:11 | Running regression tests |
| 11-Oct-2026 12:37:11 | xvfb-run /lustre/cv/sw/casa/casaci/cvpost128/bamboohome/xml-data/build-dir/PIPESPECS-TESTPIPEMAINCASA674-ML228PY312TEST/casa-build-utils/pipeline/workdir/casa-6.7.4-12-pipeline-2026.3.0.29-py3.12.el8/bin/casa --cachedir=/lustre/cv/sw/casa/casaci/pipelinercdir --cachedir=/lustre/cv/sw/casa/casaci/pipelinercdir --nogui --nologger --log2term --agg -c"import pytest; pytest.main(['-s', '-vv', '-n', '12', '--dist=worksteal','--forked', '--junitxml=/lustre/cv/sw/casa/casaci/cvpost128/bamboohome/xml-data/build-dir/PIPESPECS-TESTPIPEMAINCASA674-ML228PY312TEST/casa-build-utils/pipeline/workdir/pipeline_regression_test_result.xml', '/lustre/cv/sw/casa/casaci/cvpost128/bamboohome/xml-data/build-dir/PIPESPECS-TESTPIPEMAINCASA674-ML228PY312TEST/casa-build-utils/pipeline/workdir/pipeline/tests/regression/fast'])" |
| 11-Oct-2026 12:37:11 | Executing: xvfb-run /lustre/cv/sw/casa/casaci/cvpost128/bamboohome/xml-data/build-dir/PIPESPECS-TESTPIPEMAINCASA674-ML228PY312TEST/casa-build-utils/pipeline/workdir/casa-6.7.4-12-pipeline-2026.3.0.29-py3.12.el8/bin/casa --cachedir=/lustre/cv/sw/casa/casaci/pipelinercdir --cachedir=/lustre/cv/sw/casa/casaci/pipelinercdir --nogui --nologger --log2term --agg -c"import pytest; pytest.main(['-s', '-vv', '-n', '12', '--dist=worksteal','--forked', '--junitxml=/lustre/cv/sw/casa/casaci/cvpost128/bamboohome/xml-data/build-dir/PIPESPECS-TESTPIPEMAINCASA674-ML228PY312TEST/casa-build-utils/pipeline/workdir/pipeline_regression_test_result.xml', '/lustre/cv/sw/casa/casaci/cvpost128/bamboohome/xml-data/build-dir/PIPESPECS-TESTPIPEMAINCASA674-ML228PY312TEST/casa-build-utils/pipeline/workdir/pipeline/tests/regression/fast'])" |
| 11-Oct-2026 12:37:11 | |
| 11-Oct-2026 12:37:11 | Using user configuration file /users/casaci/.casa/config.py |
| 11-Oct-2026 12:37:11 | |
| 11-Oct-2026 12:37:11 | No event loop hook running. |
| 11-Oct-2026 12:37:11 | 2026-10-11 12:37:05 SEVERE ::casa |
| 11-Oct-2026 12:37:11 | 2026-10-11 12:37:05 SEVERE ::casa The expected casa data was not found at measurespath. CASA may still work if the data can be found in datapath. |
| 11-Oct-2026 12:37:11 | 2026-10-11 12:37:05 SEVERE ::casa The expected measures data was not found at measurespath. CASA may still work if the data can be found in datapath. |
| 11-Oct-2026 12:37:11 | 2026-10-11 12:37:05 SEVERE ::casa visit https://casadocs.readthedocs.io/en/stable/notebooks/external-data.html for more information |
| 11-Oct-2026 12:37:11 | 2026-10-11 12:37:05 SEVERE ::casa |
| 11-Oct-2026 12:37:11 | Using location of IERSeop2000 table found in datapath for measurespath /home/casa/data/master |
| 11-Oct-2026 12:37:11 | CASA 6.7.4.12 -- Common Astronomy Software Applications [6.7.4.12] |
| 11-Oct-2026 12:37:11 | 2026-10-11 12:37:09 INFO ::casa Using user configuration file /users/casaci/.casa/config.py |
| 11-Oct-2026 12:37:11 | 2026-10-11 12:37:09 INFO ::casa loaded config file : /lustre/cv/sw/casa/casaci/cvpost128/bamboohome/xml-data/build-dir/PIPESPECS-TESTPIPEMAINCASA674-ML228PY312TEST/casa-build-utils/pipeline/workdir/casa-6.7.4-12-pipeline-2026.3.0.29-py3.12.el8/lib/py/lib/python3.12/site-packages/casaconfig/config.py |
| 11-Oct-2026 12:37:11 | 2026-10-11 12:37:09 INFO ::casa loaded config file : /home/casa/casasiteconfig.py |
| 11-Oct-2026 12:37:11 | 2026-10-11 12:37:09 INFO ::casa loaded config file : /users/casaci/.casa/config.py |
| 11-Oct-2026 12:37:11 | 2026-10-11 12:37:09 INFO ::casa |
| 11-Oct-2026 12:37:11 | 2026-10-11 12:37:09 INFO ::casa config values |
| 11-Oct-2026 12:37:11 | 2026-10-11 12:37:09 INFO ::casa agg = True |
| 11-Oct-2026 12:37:11 | 2026-10-11 12:37:09 INFO ::casa cachedir = '/lustre/cv/sw/casa/casaci/pipelinercdir' |
| 11-Oct-2026 12:37:11 | 2026-10-11 12:37:09 INFO ::casa casaconfig_verbose = 1 |
| 11-Oct-2026 12:37:11 | 2026-10-11 12:37:09 INFO ::casa colors = 'Neutral' |
| 11-Oct-2026 12:37:11 | 2026-10-11 12:37:09 INFO ::casa data_auto_update = False |
| 11-Oct-2026 12:37:11 | 2026-10-11 12:37:09 INFO ::casa data_update_interval = 1 |
| 11-Oct-2026 12:37:11 | 2026-10-11 12:37:09 INFO ::casa datapath = ['/export/cvpost134-4tb/casa/casa-data/casatestdata', '/export/cvpost134-4tb/casa/casa-data/casatestdata-large', '/export/cvpost134-4tb/casa/casa-data/casa-data', '/export/cvpost135-4tb/casa/casa-data/casatestdata', '/export/cvpost135-4tb/casa/casa-data/casatestdata-large', '/home/casa/data/master', '/opt/casa/data/casatestdata', '/opt/casa/data/casatestdata-large', '/lustre/cv/sw/casa/casaci/data/casatestdata', '/lustre/cv/sw/casa/casaci/data/casatestdata-large', '/lustre/cv/sw/casa/casaci/pipeline-testdata', '/opt/pltestdata/pipeline-testdata', '/export/cvpost134-4tb/casa/casa-data/casatestdata', '/export/cvpost135-4tb/casa/casa-data/casatestdata', '/export/data_2/casatestdata-large'] |
| 11-Oct-2026 12:37:11 | 2026-10-11 12:37:09 INFO ::casa iplog = False |
| 11-Oct-2026 12:37:11 | 2026-10-11 12:37:09 INFO ::casa iplogfile = '/lustre/cv/sw/casa/casaci/cvpost128/bamboohome/xml-data/build-dir/PIPESPECS-TESTPIPEMAINCASA674-ML228PY312TEST/casa-build-utils/pipeline/workdir/pipeline/ipython-20261011-123702.log' |
| 11-Oct-2026 12:37:11 | 2026-10-11 12:37:09 INFO ::casa log2term = True |
| 11-Oct-2026 12:37:11 | 2026-10-11 12:37:09 INFO ::casa logfile = '/lustre/cv/sw/casa/casaci/cvpost128/bamboohome/xml-data/build-dir/PIPESPECS-TESTPIPEMAINCASA674-ML228PY312TEST/casa-build-utils/pipeline/workdir/pipeline/casa-20261011-123702.log' |
| 11-Oct-2026 12:37:11 | 2026-10-11 12:37:09 INFO ::casa measures_auto_update = False |
| 11-Oct-2026 12:37:11 | 2026-10-11 12:37:09 INFO ::casa measures_site = ['https://www.astron.nl/iers/', 'https://go.nrao.edu/iers/'] |
| 11-Oct-2026 12:37:11 | 2026-10-11 12:37:09 INFO ::casa measures_site_interval = 2 |
| 11-Oct-2026 12:37:11 | 2026-10-11 12:37:09 INFO ::casa measures_update_interval = 1 |
| 11-Oct-2026 12:37:11 | 2026-10-11 12:37:09 INFO ::casa measurespath = '/opt/casa/data/master' |
| 11-Oct-2026 12:37:11 | 2026-10-11 12:37:09 INFO ::casa nogui = True |
| 11-Oct-2026 12:37:11 | 2026-10-11 12:37:09 INFO ::casa nologfile = False |
| 11-Oct-2026 12:37:11 | 2026-10-11 12:37:09 INFO ::casa nologger = True |
| 11-Oct-2026 12:37:11 | 2026-10-11 12:37:09 INFO ::casa pipeline = False |
| 11-Oct-2026 12:37:11 | 2026-10-11 12:37:09 INFO ::casa startupfile = '/users/casaci/.casa/startup.py' |
| 11-Oct-2026 12:37:11 | 2026-10-11 12:37:09 INFO ::casa user_site = False |
| 11-Oct-2026 12:37:11 | 2026-10-11 12:37:09 INFO ::casa |
| 11-Oct-2026 12:37:11 | 2026-10-11 12:37:09 INFO ::casa casarundata version is unknown, this is probably a legacy version not installed by casaconfig |
| 11-Oct-2026 12:37:11 | 2026-10-11 12:37:09 INFO ::casa measures version is unknown, this is probably a legacy version not installed by casaconfig |
| 11-Oct-2026 12:37:11 | 2026-10-11 12:37:09 INFO ::casa |
| 11-Oct-2026 12:37:11 | 2026-10-11 12:37:09 INFO ::casa Checking Measures tables in data repository sub-directory /home/casa/data/master/geodetic |
| 11-Oct-2026 12:37:11 | 2026-10-11 12:37:09 INFO ::casa IERSeop2000 (version date, last date in table (UTC)): 2026/09/10/15:15, 2026/08/11/00:00:00 |
| 11-Oct-2026 12:37:11 | 2026-10-11 12:37:09 INFO ::casa IERSeop97 (version date, last date in table (UTC)): 2026/09/10/15:15, 2026/08/11/00:00:00 |
| 11-Oct-2026 12:37:11 | 2026-10-11 12:37:09 INFO ::casa IERSpredict (version date, last date in table (UTC)): 2026/10/10/15:15, 2027/01/08/00:00:00 |
| 11-Oct-2026 12:37:11 | 2026-10-11 12:37:09 INFO ::casa TAI_UTC (version date, last date in table (UTC)): 2026/10/05/15:15, 2017/01/01/00:00:00 |
| 11-Oct-2026 12:37:11 | 2026-10-11 12:37:09 INFO: Environment is not MPI enabled. Pipeline operating in single host mode |
| 11-Oct-2026 12:37:11 | 2026-10-11 12:37:09 INFO pipeline::pipeline.infrastructure.mpihelpers::casa Environment is not MPI enabled. Pipeline operating in single host mode |
| 11-Oct-2026 13:16:27 | ============================= test session starts ============================== |
| 11-Oct-2026 13:16:27 | platform linux -- Python 3.12.4, pytest-9.0.2, pluggy-1.6.0 -- /lustre/cv/sw/casa/casaci/cvpost128/bamboohome/xml-data/build-dir/PIPESPECS-TESTPIPEMAINCASA674-ML228PY312TEST/casa-build-utils/pipeline/workdir/casa-6.7.4-12-pipeline-2026.3.0.29-py3.12.el8/lib/py/bin/python3 |
| 11-Oct-2026 13:16:27 | cachedir: .pytest_cache |
| 11-Oct-2026 13:16:27 | rootdir: /lustre/cv/sw/casa/casaci/cvpost128/bamboohome/xml-data/build-dir/PIPESPECS-TESTPIPEMAINCASA674-ML228PY312TEST/casa-build-utils/pipeline/workdir/pipeline |
| 11-Oct-2026 13:16:27 | configfile: pyproject.toml |
| 11-Oct-2026 13:16:27 | plugins: forked-1.7.5, xdist-3.8.0 |
| 11-Oct-2026 13:16:27 | created: 12/12 workers |
| 11-Oct-2026 13:16:27 | 2026-10-11 12:37:13 SEVERE ::casa |
| 11-Oct-2026 13:16:27 | 2026-10-11 12:37:13 SEVERE ::casa The expected casa data was not found at measurespath. CASA may still work if the data can be found in datapath. |
| 11-Oct-2026 13:16:27 | 2026-10-11 12:37:13 SEVERE ::casa The expected measures data was not found at measurespath. CASA may still work if the data can be found in datapath. |
| 11-Oct-2026 13:16:27 | 2026-10-11 12:37:13 SEVERE ::casa visit https://casadocs.readthedocs.io/en/stable/notebooks/external-data.html for more information |
| 11-Oct-2026 13:16:27 | 2026-10-11 12:37:13 SEVERE ::casa |
| 11-Oct-2026 13:16:27 | 2026-10-11 12:37:13 SEVERE ::casa |
| 11-Oct-2026 13:16:27 | 2026-10-11 12:37:13 SEVERE ::casa The expected casa data was not found at measurespath. CASA may still work if the data can be found in datapath. |
| 11-Oct-2026 13:16:27 | 2026-10-11 12:37:13 SEVERE ::casa The expected measures data was not found at measurespath. CASA may still work if the data can be found in datapath. |
| 11-Oct-2026 13:16:27 | 2026-10-11 12:37:13 SEVERE ::casa visit https://casadocs.readthedocs.io/en/stable/notebooks/external-data.html for more information |
| 11-Oct-2026 13:16:27 | 2026-10-11 12:37:13 SEVERE ::casa |
| 11-Oct-2026 13:16:27 | 2026-10-11 12:37:13 SEVERE ::casa |
| 11-Oct-2026 13:16:27 | 2026-10-11 12:37:13 SEVERE ::casa The expected casa data was not found at measurespath. CASA may still work if the data can be found in datapath. |
| 11-Oct-2026 13:16:27 | 2026-10-11 12:37:13 SEVERE ::casa The expected measures data was not found at measurespath. CASA may still work if the data can be found in datapath. |
| 11-Oct-2026 13:16:27 | 2026-10-11 12:37:13 SEVERE ::casa visit https://casadocs.readthedocs.io/en/stable/notebooks/external-data.html for more information |
| 11-Oct-2026 13:16:27 | 2026-10-11 12:37:13 SEVERE ::casa |
| 11-Oct-2026 13:16:27 | 2026-10-11 12:37:13 SEVERE ::casa |
| 11-Oct-2026 13:16:27 | 2026-10-11 12:37:13 SEVERE ::casa The expected casa data was not found at measurespath. CASA may still work if the data can be found in datapath. |
| 11-Oct-2026 13:16:27 | 2026-10-11 12:37:13 SEVERE ::casa The expected measures data was not found at measurespath. CASA may still work if the data can be found in datapath. |
| 11-Oct-2026 13:16:27 | 2026-10-11 12:37:13 SEVERE ::casa visit https://casadocs.readthedocs.io/en/stable/notebooks/external-data.html for more information |
| 11-Oct-2026 13:16:27 | 2026-10-11 12:37:13 SEVERE ::casa |
| 11-Oct-2026 13:16:27 | 2026-10-11 12:37:13 SEVERE ::casa |
| 11-Oct-2026 13:16:27 | 2026-10-11 12:37:13 SEVERE ::casa The expected casa data was not found at measurespath. CASA may still work if the data can be found in datapath. |
| 11-Oct-2026 13:16:27 | 2026-10-11 12:37:13 SEVERE ::casa The expected measures data was not found at measurespath. CASA may still work if the data can be found in datapath. |
| 11-Oct-2026 13:16:27 | 2026-10-11 12:37:13 SEVERE ::casa visit https://casadocs.readthedocs.io/en/stable/notebooks/external-data.html for more information |
| 11-Oct-2026 13:16:27 | 2026-10-11 12:37:13 SEVERE ::casa |
| 11-Oct-2026 13:16:27 | 2026-10-11 12:37:13 SEVERE ::casa |
| 11-Oct-2026 13:16:27 | 2026-10-11 12:37:13 SEVERE ::casa The expected casa data was not found at measurespath. CASA may still work if the data can be found in datapath. |
| 11-Oct-2026 13:16:27 | 2026-10-11 12:37:13 SEVERE ::casa The expected measures data was not found at measurespath. CASA may still work if the data can be found in datapath. |
| 11-Oct-2026 13:16:27 | 2026-10-11 12:37:13 SEVERE ::casa visit https://casadocs.readthedocs.io/en/stable/notebooks/external-data.html for more information |
| 11-Oct-2026 13:16:27 | 2026-10-11 12:37:13 SEVERE ::casa |
| 11-Oct-2026 13:16:27 | 2026-10-11 12:37:13 SEVERE ::casa |
| 11-Oct-2026 13:16:27 | 2026-10-11 12:37:13 SEVERE ::casa The expected casa data was not found at measurespath. CASA may still work if the data can be found in datapath. |
| 11-Oct-2026 13:16:27 | 2026-10-11 12:37:13 SEVERE ::casa The expected measures data was not found at measurespath. CASA may still work if the data can be found in datapath. |
| 11-Oct-2026 13:16:27 | 2026-10-11 12:37:13 SEVERE ::casa visit https://casadocs.readthedocs.io/en/stable/notebooks/external-data.html for more information |
| 11-Oct-2026 13:16:27 | 2026-10-11 12:37:13 SEVERE ::casa |
| 11-Oct-2026 13:16:27 | 2026-10-11 12:37:13 SEVERE ::casa |
| 11-Oct-2026 13:16:27 | 2026-10-11 12:37:13 SEVERE ::casa The expected casa data was not found at measurespath. CASA may still work if the data can be found in datapath. |
| 11-Oct-2026 13:16:27 | 2026-10-11 12:37:13 SEVERE ::casa The expected measures data was not found at measurespath. CASA may still work if the data can be found in datapath. |
| 11-Oct-2026 13:16:27 | 2026-10-11 12:37:13 SEVERE ::casa visit https://casadocs.readthedocs.io/en/stable/notebooks/external-data.html for more information |
| 11-Oct-2026 13:16:27 | 2026-10-11 12:37:13 SEVERE ::casa |
| 11-Oct-2026 13:16:27 | 2026-10-11 12:37:13 SEVERE ::casa |
| 11-Oct-2026 13:16:27 | 2026-10-11 12:37:13 SEVERE ::casa The expected casa data was not found at measurespath. CASA may still work if the data can be found in datapath. |
| 11-Oct-2026 13:16:27 | 2026-10-11 12:37:13 SEVERE ::casa The expected measures data was not found at measurespath. CASA may still work if the data can be found in datapath. |
| 11-Oct-2026 13:16:27 | 2026-10-11 12:37:13 SEVERE ::casa visit https://casadocs.readthedocs.io/en/stable/notebooks/external-data.html for more information |
| 11-Oct-2026 13:16:27 | 2026-10-11 12:37:13 SEVERE ::casa |
| 11-Oct-2026 13:16:27 | 2026-10-11 12:37:13 SEVERE ::casa |
| 11-Oct-2026 13:16:27 | 2026-10-11 12:37:13 SEVERE ::casa The expected casa data was not found at measurespath. CASA may still work if the data can be found in datapath. |
| 11-Oct-2026 13:16:27 | 2026-10-11 12:37:13 SEVERE ::casa The expected measures data was not found at measurespath. CASA may still work if the data can be found in datapath. |
| 11-Oct-2026 13:16:27 | 2026-10-11 12:37:13 SEVERE ::casa visit https://casadocs.readthedocs.io/en/stable/notebooks/external-data.html for more information |
| 11-Oct-2026 13:16:27 | 2026-10-11 12:37:13 SEVERE ::casa |
| 11-Oct-2026 13:16:27 | 2026-10-11 12:37:14 SEVERE ::casa |
| 11-Oct-2026 13:16:27 | 2026-10-11 12:37:14 SEVERE ::casa The expected casa data was not found at measurespath. CASA may still work if the data can be found in datapath. |
| 11-Oct-2026 13:16:27 | 2026-10-11 12:37:14 SEVERE ::casa The expected measures data was not found at measurespath. CASA may still work if the data can be found in datapath. |
| 11-Oct-2026 13:16:27 | 2026-10-11 12:37:14 SEVERE ::casa visit https://casadocs.readthedocs.io/en/stable/notebooks/external-data.html for more information |
| 11-Oct-2026 13:16:27 | 2026-10-11 12:37:14 SEVERE ::casa |
| 11-Oct-2026 13:16:27 | 2026-10-11 12:37:14 SEVERE ::casa |
| 11-Oct-2026 13:16:27 | 2026-10-11 12:37:14 SEVERE ::casa The expected casa data was not found at measurespath. CASA may still work if the data can be found in datapath. |
| 11-Oct-2026 13:16:27 | 2026-10-11 12:37:14 SEVERE ::casa The expected measures data was not found at measurespath. CASA may still work if the data can be found in datapath. |
| 11-Oct-2026 13:16:27 | 2026-10-11 12:37:14 SEVERE ::casa visit https://casadocs.readthedocs.io/en/stable/notebooks/external-data.html for more information |
| 11-Oct-2026 13:16:27 | 2026-10-11 12:37:14 SEVERE ::casa |
| 11-Oct-2026 13:16:27 | 12 workers [18 items] |
| 11-Oct-2026 13:16:27 | |
| 11-Oct-2026 13:16:27 | scheduling tests via WorkStealingScheduling |
| 11-Oct-2026 13:16:27 | |
| 11-Oct-2026 13:16:27 | tests/regression/fast/nobeyama_sd_fast_test.py::test_mg2_20170525142607_180419__PPR__regression |
| 11-Oct-2026 13:16:27 | tests/regression/fast/alma_if_fast_test.py::test_2022_1_00207_S__uid___A001_X2d20_X373d__PPR__regression |
| 11-Oct-2026 13:16:27 | tests/regression/fast/alma_if_fast_test.py::test_E2E6_1_00010_S__uid___A002_Xd0a588_X2239__procedure_hifa_image__regression |
| 11-Oct-2026 13:16:27 | tests/regression/fast/alma_if_fast_test.py::test_uid___A002_Xc46ab2_X15ae__selfcal_restore_procedure_hifa_image__regression |
| 11-Oct-2026 13:16:27 | tests/regression/fast/alma_if_fast_test.py::test_uid___A002_Xee1eb6_Xc58d__procedure_hifa_calsurvey__regression |
| 11-Oct-2026 13:16:27 | tests/regression/fast/alma_if_fast_test.py::test_uid___A002_Xef72bb_X9d29__renorm_restore_procedure_hifa_image__regression |
| 11-Oct-2026 13:16:27 | tests/regression/fast/alma_if_fast_test.py::test_2023_1_00228_S__uid___A002_X1199f9e_X7c24__procedure_hifa_calimage_diffgain__regression |
| 11-Oct-2026 13:16:27 | tests/regression/fast/vla_fast_test.py::test_13A_537__calibration__PPR__regression |
| 11-Oct-2026 13:16:27 | tests/regression/fast/alma_if_fast_test.py::test_uid___A002_Xc46ab2_X15ae_repSPW_spw16_17_small__PPR__regression |
| 11-Oct-2026 13:16:27 | tests/regression/fast/alma_if_fast_test.py::test_uid___A002_Xc845c0_X7366__cycle5_restore_procedure_hifa_image__regression |
| 11-Oct-2026 13:16:27 | tests/regression/fast/vla_fast_test.py::test_13A_537__restore__cont_cube_selfcal__regression |
| 11-Oct-2026 13:16:27 | tests/regression/fast/alma_sd_fast_test.py::test_uid___A002_X85c183_X36f_SPW15_23__PPR__regression |
| 11-Oct-2026 13:16:27 | [gw11] PASSED tests/regression/fast/alma_sd_fast_test.py::test_uid___A002_X85c183_X36f_SPW15_23__PPR__regression |
| 11-Oct-2026 13:16:27 | tests/regression/fast/nobeyama_sd_fast_test.py::test_mg2_20170525142607_180419__procedure_hsdn_calimage__regression |
| 11-Oct-2026 21:56:30 | [gw6] PASSED tests/regression/fast/alma_if_fast_test.py::test_uid___A002_Xc46ab2_X15ae_repSPW_spw16_17_small__PPR__regression |
| 11-Oct-2026 21:56:30 | [gw7] PASSED tests/regression/fast/nobeyama_sd_fast_test.py::test_mg2_20170525142607_180419__PPR__regression |
| 11-Oct-2026 21:56:30 | tests/regression/fast/vla_fast_test.py::test_13A_537__procedure_hifv__regression |
| 11-Oct-2026 21:56:30 | [gw4] PASSED tests/regression/fast/alma_if_fast_test.py::test_uid___A002_Xc46ab2_X15ae__selfcal_restore_procedure_hifa_image__regression |
| 11-Oct-2026 21:56:30 | [gw8] PASSED tests/regression/fast/vla_fast_test.py::test_13A_537__calibration__PPR__regression |
| 11-Oct-2026 21:56:30 | tests/regression/fast/vla_fast_test.py::test_13A_537__restore__PPR__regression |
| 11-Oct-2026 21:56:30 | [gw8] PASSED tests/regression/fast/vla_fast_test.py::test_13A_537__restore__PPR__regression |
| 11-Oct-2026 21:56:30 | [gw11] PASSED tests/regression/fast/nobeyama_sd_fast_test.py::test_mg2_20170525142607_180419__procedure_hsdn_calimage__regression |
| 11-Oct-2026 21:56:30 | [gw7] PASSED tests/regression/fast/vla_fast_test.py::test_13A_537__procedure_hifv__regression |
| 11-Oct-2026 21:56:30 | [gw1] PASSED tests/regression/fast/alma_if_fast_test.py::test_E2E6_1_00010_S__uid___A002_Xd0a588_X2239__procedure_hifa_image__regression |
| 11-Oct-2026 21:56:30 | tests/regression/fast/alma_if_fast_test.py::test_csv_3899_eb2_small__procedure_hifa_calimage__regression |
| 11-Oct-2026 21:56:30 | [gw10] PASSED tests/regression/fast/alma_if_fast_test.py::test_uid___A002_Xef72bb_X9d29__renorm_restore_procedure_hifa_image__regression |
| 11-Oct-2026 21:56:30 | [gw9] PASSED tests/regression/fast/alma_if_fast_test.py::test_uid___A002_Xc845c0_X7366__cycle5_restore_procedure_hifa_image__regression |
| 11-Oct-2026 21:56:30 | [gw5] PASSED tests/regression/fast/alma_if_fast_test.py::test_uid___A002_Xee1eb6_Xc58d__procedure_hifa_calsurvey__regression |
| 11-Oct-2026 21:56:30 | tests/regression/fast/alma_sd_fast_test.py::test_uid___A002_X85c183_X36f__procedure_hsd_calimage__regression |
| 11-Oct-2026 21:56:30 | [gw1] FAILED tests/regression/fast/alma_if_fast_test.py::test_csv_3899_eb2_small__procedure_hifa_calimage__regression |
| 11-Oct-2026 21:56:30 | [gw5] PASSED tests/regression/fast/alma_sd_fast_test.py::test_uid___A002_X85c183_X36f__procedure_hsd_calimage__regression |
| 11-Oct-2026 21:56:30 | [gw3] PASSED tests/regression/fast/vla_fast_test.py::test_13A_537__restore__cont_cube_selfcal__regression |
| 11-Oct-2026 21:56:30 | tests/regression/fast/vlass_fast_test.py::test_TSKY0001__vlass_quicklook_regression |
| 11-Oct-2026 21:56:30 | [gw3] PASSED tests/regression/fast/vlass_fast_test.py::test_TSKY0001__vlass_quicklook_regression |
| 11-Oct-2026 21:56:30 | [gw2] PASSED tests/regression/fast/alma_if_fast_test.py::test_2022_1_00207_S__uid___A001_X2d20_X373d__PPR__regression |
| 11-Oct-2026 21:56:30 | [gw0] PASSED tests/regression/fast/alma_if_fast_test.py::test_2023_1_00228_S__uid___A002_X1199f9e_X7c24__procedure_hifa_calimage_diffgain__regression |
| 11-Oct-2026 21:56:30 | |
| 11-Oct-2026 21:56:30 | =================================== FAILURES =================================== |
| 11-Oct-2026 21:56:30 | _________ test_csv_3899_eb2_small__procedure_hifa_calimage__regression _________ |
| 11-Oct-2026 21:56:30 | [gw1] linux -- Python 3.12.4 /lustre/cv/sw/casa/casaci/cvpost128/bamboohome/xml-data/build-dir/PIPESPECS-TESTPIPEMAINCASA674-ML228PY312TEST/casa-build-utils/pipeline/workdir/casa-6.7.4-12-pipeline-2026.3.0.29-py3.12.el8/lib/py/bin/python3 |
| 11-Oct-2026 21:56:30 | @pytest.mark.twelve |
| 11-Oct-2026 21:56:30 | def test_csv_3899_eb2_small__procedure_hifa_calimage__regression(): |
| 11-Oct-2026 21:56:30 | """PIPE-2245: Run small ALMA cal+image regression to cover various heuristics |
| 11-Oct-2026 21:56:30 | |
| 11-Oct-2026 21:56:30 | Recipe name: procedure_hifa_calimage |
| 11-Oct-2026 21:56:30 | Dataset: CSV-3899-EB2-small |
| 11-Oct-2026 21:56:30 | """ |
| 11-Oct-2026 21:56:30 | ref_directory = 'pl-regressiontest/CSV-3899-EB2-small' |
| 11-Oct-2026 21:56:30 | |
| 11-Oct-2026 21:56:30 | pt = PipelineTester( |
| 11-Oct-2026 21:56:30 | visname=['uid___A002_X1181695_X1c6a4_8ant.ms'], |
| 11-Oct-2026 21:56:30 | recipe='procedure_hifa_calimage.xml', |
| 11-Oct-2026 21:56:30 | input_dir=ref_directory, |
| 11-Oct-2026 21:56:30 | expectedoutput_dir=ref_directory, |
| 11-Oct-2026 21:56:30 | ) |
| 11-Oct-2026 21:56:30 | |
| 11-Oct-2026 21:56:30 | > pt.run(omp_num_threads=1) |
| 11-Oct-2026 21:56:30 | |
| 11-Oct-2026 21:56:30 | tests/regression/fast/alma_if_fast_test.py:181: |
| 11-Oct-2026 21:56:30 | _ _ _ _ _ _ _ _ _ _ _ _ _ _ _ _ _ _ _ _ _ _ _ _ _ _ _ _ _ _ _ _ _ _ _ _ _ _ _ _ |
| 11-Oct-2026 21:56:30 | tests/testing_utils.py:381: in run |
| 11-Oct-2026 21:56:30 | self.__compare_results(new_file, default_relative_tolerance) |
| 11-Oct-2026 21:56:30 | _ _ _ _ _ _ _ _ _ _ _ _ _ _ _ _ _ _ _ _ _ _ _ _ _ _ _ _ _ _ _ _ _ _ _ _ _ _ _ _ |
| 11-Oct-2026 21:56:30 | |
| 11-Oct-2026 21:56:30 | self = <tests.testing_utils.PipelineTester object at 0x7f68d8fc4800> |
| 11-Oct-2026 21:56:30 | new_file = 'uid___A002_X1181695_X1c6a4_8ant.ms.NEW.results.txt' |
| 11-Oct-2026 21:56:30 | relative_tolerance = 1e-07 |
| 11-Oct-2026 21:56:30 | |
| 11-Oct-2026 21:56:30 | def __compare_results(self, new_file: str, relative_tolerance: float) -> None: |
| 11-Oct-2026 21:56:30 | """ |
| 11-Oct-2026 21:56:30 | Compare results between new one loaded from file and old one. |
| 11-Oct-2026 21:56:30 | |
| 11-Oct-2026 21:56:30 | Args: |
| 11-Oct-2026 21:56:30 | new_file : file path of new results |
| 11-Oct-2026 21:56:30 | relative_tolerance : relative tolerance of output value |
| 11-Oct-2026 21:56:30 | """ |
| 11-Oct-2026 21:56:30 | with open(self.expectedoutput_file) as expected_fd, open(new_file) as new_fd: |
| 11-Oct-2026 21:56:30 | expected_results = expected_fd.readlines() |
| 11-Oct-2026 21:56:30 | new_results = new_fd.readlines() |
| 11-Oct-2026 21:56:30 | errors = [] |
| 11-Oct-2026 21:56:30 | worst_diff = (0, 0) |
| 11-Oct-2026 21:56:30 | worst_percent_diff = (0, 0) |
| 11-Oct-2026 21:56:30 | for old, new in zip(expected_results, new_results): |
| 11-Oct-2026 21:56:30 | try: |
| 11-Oct-2026 21:56:30 | oldkey, oldval, tol = self.__sanitize_results_string(old) |
| 11-Oct-2026 21:56:30 | newkey, newval, _ = self.__sanitize_results_string(new) |
| 11-Oct-2026 21:56:30 | except ValueError as e: |
| 11-Oct-2026 21:56:30 | errorstr = "The results: {0} could not be parsed. Error: {1}".format(new, str(e)) |
| 11-Oct-2026 21:56:30 | errors.append(errorstr) |
| 11-Oct-2026 21:56:30 | continue |
| 11-Oct-2026 21:56:30 | |
| 11-Oct-2026 21:56:30 | assert oldkey == newkey, f"Expected key {oldkey} does not match new key {newkey}." |
| 11-Oct-2026 21:56:30 | tolerance = tol if tol else relative_tolerance |
| 11-Oct-2026 21:56:30 | if newval is not None: |
| 11-Oct-2026 21:56:30 | LOG.info('Comparing %s to %s with a rel. tolerance of %s', oldval, newval, tolerance) |
| 11-Oct-2026 21:56:30 | if oldval != pytest.approx(newval, rel=tolerance): |
| 11-Oct-2026 21:56:30 | diff = oldval-newval |
| 11-Oct-2026 21:56:30 | percent_diff = (oldval-newval)/oldval * 100 if oldval != 0 else 100 |
| 11-Oct-2026 21:56:30 | if abs(diff) > abs(worst_diff[0]): |
| 11-Oct-2026 21:56:30 | worst_diff = diff, oldkey |
| 11-Oct-2026 21:56:30 | if abs(percent_diff) > abs(worst_percent_diff[0]): |
| 11-Oct-2026 21:56:30 | worst_percent_diff = percent_diff, oldkey |
| 11-Oct-2026 21:56:30 | errorstr = f"{oldkey}\n\tvalues differ by > a relative difference of {tolerance}\n\texpected: {oldval}\n\tnew: {newval}\n\tdiff: {diff}\n\tpercent_diff: {percent_diff}%" |
| 11-Oct-2026 21:56:30 | errors.append(errorstr) |
| 11-Oct-2026 21:56:30 | elif oldval is not None: |
| 11-Oct-2026 21:56:30 | # If only the new value is None, fail |
| 11-Oct-2026 21:56:30 | errorstr = f"{oldkey}\n\tvalue is None\n\texpected: {oldval}\n\tnew: {newval}" |
| 11-Oct-2026 21:56:30 | errors.append(errorstr) |
| 11-Oct-2026 21:56:30 | else: |
| 11-Oct-2026 21:56:30 | # If old and new values are both None, this is expected, so pass |
| 11-Oct-2026 21:56:30 | LOG.info('Comparing %s and %s... both values are None.', oldval, newval) |
| 11-Oct-2026 21:56:30 | |
| 11-Oct-2026 21:56:30 | [LOG.warning(x) for x in errors] |
| 11-Oct-2026 21:56:30 | n_errors = len(errors) |
| 11-Oct-2026 21:56:30 | if n_errors > 0: |
| 11-Oct-2026 21:56:30 | summary_str = f"Worst absolute diff, {worst_diff[1]}: {worst_diff[0]}\nWorst percentage diff, {worst_percent_diff[1]}: {worst_percent_diff[0]}%" |
| 11-Oct-2026 21:56:30 | errors.append(summary_str) |
| 11-Oct-2026 21:56:30 | > pytest.fail("Failed to match {0} result value{1} within tolerance{1} :\n{2}".format( |
| 11-Oct-2026 21:56:30 | n_errors, '' if n_errors == 1 else 's', '\n'.join(errors)), pytrace=True) |
| 11-Oct-2026 21:56:30 | E Failed: Failed to match 2 result values within tolerances : |
| 11-Oct-2026 21:56:30 | E s16.hifa_gfluxscaleflag.uid___A002_X1181695_X1c6a4_8ant.qa.metric.CorrectedampflagQAHandler |
| 11-Oct-2026 21:56:30 | E values differ by > a relative difference of 1e-07 |
| 11-Oct-2026 21:56:30 | E expected: 0.0053688072299937365 |
| 11-Oct-2026 21:56:30 | E new: 0.0 |
| 11-Oct-2026 21:56:30 | E diff: 0.0053688072299937365 |
| 11-Oct-2026 21:56:30 | E percent_diff: 100.0% |
| 11-Oct-2026 21:56:30 | E s16.hifa_gfluxscaleflag.uid___A002_X1181695_X1c6a4_8ant.qa.score.CorrectedampflagQAHandler |
| 11-Oct-2026 21:56:30 | E values differ by > a relative difference of 1e-07 |
| 11-Oct-2026 21:56:30 | E expected: 0.9946311927700062 |
| 11-Oct-2026 21:56:30 | E new: 1.0 |
| 11-Oct-2026 21:56:30 | E diff: -0.005368807229993777 |
| 11-Oct-2026 21:56:30 | E percent_diff: -0.539778690736802% |
| 11-Oct-2026 21:56:30 | E Worst absolute diff, s16.hifa_gfluxscaleflag.uid___A002_X1181695_X1c6a4_8ant.qa.score.CorrectedampflagQAHandler: -0.005368807229993777 |
| 11-Oct-2026 21:56:30 | E Worst percentage diff, s16.hifa_gfluxscaleflag.uid___A002_X1181695_X1c6a4_8ant.qa.metric.CorrectedampflagQAHandler: 100.0% |
| 11-Oct-2026 21:56:30 | |
| 11-Oct-2026 21:56:30 | tests/testing_utils.py:440: Failed |
| 11-Oct-2026 21:56:30 | ------------------------------ Captured log call ------------------------------- |
| 11-Oct-2026 21:56:30 | WARNING matplotlib.axes._base:_base.py:2096 Ignoring fixed x limits to fulfill fixed data aspect with adjustable data limits. |
| 11-Oct-2026 21:56:30 | WARNING matplotlib.axes._base:_base.py:2096 Ignoring fixed x limits to fulfill fixed data aspect with adjustable data limits. |
| 11-Oct-2026 21:56:30 | WARNING matplotlib.axes._base:_base.py:2096 Ignoring fixed x limits to fulfill fixed data aspect with adjustable data limits. |
| 11-Oct-2026 21:56:30 | INFO root:logs.py:724 bpcal.bpcal: Bandpass statistics started for uid___A002_X1181695_X1c6a4_8ant.ms.hifa_bandpass.s14_0.spw16_22_24.channel.solintinf.bcal.tbl ... |
| 11-Oct-2026 21:56:30 | INFO root:logs.py:724 bpcal.bpcal: Bandpass statistics of uid___A002_X1181695_X1c6a4_8ant.ms.hifa_bandpass.s14_0.spw16_22_24.channel.solintinf.bcal.tbl calculated ... |
| 11-Oct-2026 21:56:30 | INFO root:logs.py:724 bpcal.bpcal: Bandpass statistics written in /tmp/tmpft6ynmph/uid___A002_X1181695_X1c6a4_8ant.ms.hifa_bandpass.s14_0.spw16_22_24.channel.solintinf.bcal.bpcal.stats ... |
| 11-Oct-2026 21:56:30 | INFO root:logs.py:724 bpcal.bpcal: Bandpass scores of uid___A002_X1181695_X1c6a4_8ant.ms.hifa_bandpass.s14_0.spw16_22_24.channel.solintinf.bcal.tbl calculated ... |
| 11-Oct-2026 21:56:30 | INFO root:logs.py:724 bpcal.bpcal: Bandpass calibration statistics finished for uid___A002_X1181695_X1c6a4_8ant.ms.hifa_bandpass.s14_0.spw16_22_24.channel.solintinf.bcal.tbl ... |
| 11-Oct-2026 21:56:30 | |
| 11-Oct-2026 21:56:30 | INFO root:logs.py:724 bpcal.bpcal: Bandpass statistics started for uid___A002_X1181695_X1c6a4_8ant.ms.hifa_bandpass.s14_0.spw16_22_24.channel.solintinf.bcal.tbl ... |
| 11-Oct-2026 21:56:30 | INFO root:logs.py:724 bpcal.bpcal: Bandpass statistics of uid___A002_X1181695_X1c6a4_8ant.ms.hifa_bandpass.s14_0.spw16_22_24.channel.solintinf.bcal.tbl calculated ... |
| 11-Oct-2026 21:56:30 | INFO root:logs.py:724 bpcal.bpcal: Bandpass statistics written in /tmp/tmp8hv0gj88/uid___A002_X1181695_X1c6a4_8ant.ms.hifa_bandpass.s14_0.spw16_22_24.channel.solintinf.bcal.bpcal.stats ... |
| 11-Oct-2026 21:56:30 | INFO root:logs.py:724 bpcal.bpcal: Bandpass scores of uid___A002_X1181695_X1c6a4_8ant.ms.hifa_bandpass.s14_0.spw16_22_24.channel.solintinf.bcal.tbl calculated ... |
| 11-Oct-2026 21:56:30 | INFO root:logs.py:724 bpcal.bpcal: Bandpass calibration statistics finished for uid___A002_X1181695_X1c6a4_8ant.ms.hifa_bandpass.s14_0.spw16_22_24.channel.solintinf.bcal.tbl ... |
| 11-Oct-2026 21:56:30 | |
| 11-Oct-2026 21:56:30 | WARNING matplotlib.axes._base:_base.py:2096 Ignoring fixed x limits to fulfill fixed data aspect with adjustable data limits. |
| 11-Oct-2026 21:56:30 | WARNING matplotlib.axes._base:_base.py:2096 Ignoring fixed x limits to fulfill fixed data aspect with adjustable data limits. |
| 11-Oct-2026 21:56:30 | =============================== warnings summary =============================== |
| 11-Oct-2026 21:56:30 | ../casa-6.7.4-12-pipeline-2026.3.0.29-py3.12.el8/lib/py/lib/python3.12/site-packages/casaconfig/private/get_data_info.py:195: 12 warnings |
| 11-Oct-2026 21:56:30 | /lustre/cv/sw/casa/casaci/cvpost128/bamboohome/xml-data/build-dir/PIPESPECS-TESTPIPEMAINCASA674-ML228PY312TEST/casa-build-utils/pipeline/workdir/casa-6.7.4-12-pipeline-2026.3.0.29-py3.12.el8/lib/py/lib/python3.12/site-packages/casaconfig/private/get_data_info.py:195: DeprecationWarning: read_text is deprecated. Use files() instead. Refer to https://importlib-resources.readthedocs.io/en/latest/using.html#migrating-from-legacy for migration advice. |
| 11-Oct-2026 21:56:30 | readme_lines = importlib.resources.read_text('casaconfig','release_data_readme.txt').split('\n') |
| 11-Oct-2026 21:56:30 | |
| 11-Oct-2026 21:56:30 | ../casa-6.7.4-12-pipeline-2026.3.0.29-py3.12.el8/lib/py/lib/python3.12/importlib/resources/_legacy.py:79: 12 warnings |
| 11-Oct-2026 21:56:30 | /lustre/cv/sw/casa/casaci/cvpost128/bamboohome/xml-data/build-dir/PIPESPECS-TESTPIPEMAINCASA674-ML228PY312TEST/casa-build-utils/pipeline/workdir/casa-6.7.4-12-pipeline-2026.3.0.29-py3.12.el8/lib/py/lib/python3.12/importlib/resources/_legacy.py:79: DeprecationWarning: open_text is deprecated. Use files() instead. Refer to https://importlib-resources.readthedocs.io/en/latest/using.html#migrating-from-legacy for migration advice. |
| 11-Oct-2026 21:56:30 | with open_text(package, resource, encoding, errors) as fp: |
| 11-Oct-2026 21:56:30 | |
| 11-Oct-2026 21:56:30 | ../casa-6.7.4-12-pipeline-2026.3.0.29-py3.12.el8/lib/py/lib/python3.12/site-packages/google/protobuf/internal/well_known_types.py:91: 12 warnings |
| 11-Oct-2026 21:56:30 | /lustre/cv/sw/casa/casaci/cvpost128/bamboohome/xml-data/build-dir/PIPESPECS-TESTPIPEMAINCASA674-ML228PY312TEST/casa-build-utils/pipeline/workdir/casa-6.7.4-12-pipeline-2026.3.0.29-py3.12.el8/lib/py/lib/python3.12/site-packages/google/protobuf/internal/well_known_types.py:91: DeprecationWarning: datetime.datetime.utcfromtimestamp() is deprecated and scheduled for removal in a future version. Use timezone-aware objects to represent datetimes in UTC: datetime.datetime.fromtimestamp(timestamp, datetime.UTC). |
| 11-Oct-2026 21:56:30 | _EPOCH_DATETIME_NAIVE = datetime.datetime.utcfromtimestamp(0) |
| 11-Oct-2026 21:56:30 | |
| 11-Oct-2026 21:56:30 | ../casa-6.7.4-12-pipeline-2026.3.0.29-py3.12.el8/lib/py/lib/python3.12/site-packages/casaplotms/private/plotms_pb2.py:19: 12 warnings |
| 11-Oct-2026 21:56:30 | /lustre/cv/sw/casa/casaci/cvpost128/bamboohome/xml-data/build-dir/PIPESPECS-TESTPIPEMAINCASA674-ML228PY312TEST/casa-build-utils/pipeline/workdir/casa-6.7.4-12-pipeline-2026.3.0.29-py3.12.el8/lib/py/lib/python3.12/site-packages/casaplotms/private/plotms_pb2.py:19: DeprecationWarning: Call to deprecated create function FileDescriptor(). Note: Create unlinked descriptors is going to go away. Please use get/find descriptors from generated code or query the descriptor_pool. |
| 11-Oct-2026 21:56:30 | DESCRIPTOR = _descriptor.FileDescriptor( |
| 11-Oct-2026 21:56:30 | |
| 11-Oct-2026 21:56:30 | ../casa-6.7.4-12-pipeline-2026.3.0.29-py3.12.el8/lib/py/lib/python3.12/site-packages/casaplotms/private/plotms_pb2.py:38: 12 warnings |
| 11-Oct-2026 21:56:30 | /lustre/cv/sw/casa/casaci/cvpost128/bamboohome/xml-data/build-dir/PIPESPECS-TESTPIPEMAINCASA674-ML228PY312TEST/casa-build-utils/pipeline/workdir/casa-6.7.4-12-pipeline-2026.3.0.29-py3.12.el8/lib/py/lib/python3.12/site-packages/casaplotms/private/plotms_pb2.py:38: DeprecationWarning: Call to deprecated create function FieldDescriptor(). Note: Create unlinked descriptors is going to go away. Please use get/find descriptors from generated code or query the descriptor_pool. |
| 11-Oct-2026 21:56:30 | _descriptor.FieldDescriptor( |
| 11-Oct-2026 21:56:30 | |
| 11-Oct-2026 21:56:30 | ../casa-6.7.4-12-pipeline-2026.3.0.29-py3.12.el8/lib/py/lib/python3.12/site-packages/casaplotms/private/plotms_pb2.py:31: 12 warnings |
| 11-Oct-2026 21:56:30 | /lustre/cv/sw/casa/casaci/cvpost128/bamboohome/xml-data/build-dir/PIPESPECS-TESTPIPEMAINCASA674-ML228PY312TEST/casa-build-utils/pipeline/workdir/casa-6.7.4-12-pipeline-2026.3.0.29-py3.12.el8/lib/py/lib/python3.12/site-packages/casaplotms/private/plotms_pb2.py:31: DeprecationWarning: Call to deprecated create function Descriptor(). Note: Create unlinked descriptors is going to go away. Please use get/find descriptors from generated code or query the descriptor_pool. |
| 11-Oct-2026 21:56:30 | _PID = _descriptor.Descriptor( |
| 11-Oct-2026 21:56:30 | |
| 11-Oct-2026 21:56:30 | ../casa-6.7.4-12-pipeline-2026.3.0.29-py3.12.el8/lib/py/lib/python3.12/site-packages/casaplotms/private/plotms_pb2.py:69: 12 warnings |
| 11-Oct-2026 21:56:30 | /lustre/cv/sw/casa/casaci/cvpost128/bamboohome/xml-data/build-dir/PIPESPECS-TESTPIPEMAINCASA674-ML228PY312TEST/casa-build-utils/pipeline/workdir/casa-6.7.4-12-pipeline-2026.3.0.29-py3.12.el8/lib/py/lib/python3.12/site-packages/casaplotms/private/plotms_pb2.py:69: DeprecationWarning: Call to deprecated create function FieldDescriptor(). Note: Create unlinked descriptors is going to go away. Please use get/find descriptors from generated code or query the descriptor_pool. |
| 11-Oct-2026 21:56:30 | _descriptor.FieldDescriptor( |
| 11-Oct-2026 21:56:30 | |
| 11-Oct-2026 21:56:30 | ../casa-6.7.4-12-pipeline-2026.3.0.29-py3.12.el8/lib/py/lib/python3.12/site-packages/casaplotms/private/plotms_pb2.py:62: 12 warnings |
| 11-Oct-2026 21:56:30 | /lustre/cv/sw/casa/casaci/cvpost128/bamboohome/xml-data/build-dir/PIPESPECS-TESTPIPEMAINCASA674-ML228PY312TEST/casa-build-utils/pipeline/workdir/casa-6.7.4-12-pipeline-2026.3.0.29-py3.12.el8/lib/py/lib/python3.12/site-packages/casaplotms/private/plotms_pb2.py:62: DeprecationWarning: Call to deprecated create function Descriptor(). Note: Create unlinked descriptors is going to go away. Please use get/find descriptors from generated code or query the descriptor_pool. |
| 11-Oct-2026 21:56:30 | _NUMPLOTS = _descriptor.Descriptor( |
| 11-Oct-2026 21:56:30 | |
| 11-Oct-2026 21:56:30 | ../casa-6.7.4-12-pipeline-2026.3.0.29-py3.12.el8/lib/py/lib/python3.12/site-packages/casaplotms/private/plotms_pb2.py:100: 12 warnings |
| 11-Oct-2026 21:56:30 | /lustre/cv/sw/casa/casaci/cvpost128/bamboohome/xml-data/build-dir/PIPESPECS-TESTPIPEMAINCASA674-ML228PY312TEST/casa-build-utils/pipeline/workdir/casa-6.7.4-12-pipeline-2026.3.0.29-py3.12.el8/lib/py/lib/python3.12/site-packages/casaplotms/private/plotms_pb2.py:100: DeprecationWarning: Call to deprecated create function FieldDescriptor(). Note: Create unlinked descriptors is going to go away. Please use get/find descriptors from generated code or query the descriptor_pool. |
| 11-Oct-2026 21:56:30 | _descriptor.FieldDescriptor( |
| 11-Oct-2026 21:56:30 | |
| 11-Oct-2026 21:56:30 | ../casa-6.7.4-12-pipeline-2026.3.0.29-py3.12.el8/lib/py/lib/python3.12/site-packages/casaplotms/private/plotms_pb2.py:93: 12 warnings |
| 11-Oct-2026 21:56:30 | /lustre/cv/sw/casa/casaci/cvpost128/bamboohome/xml-data/build-dir/PIPESPECS-TESTPIPEMAINCASA674-ML228PY312TEST/casa-build-utils/pipeline/workdir/casa-6.7.4-12-pipeline-2026.3.0.29-py3.12.el8/lib/py/lib/python3.12/site-packages/casaplotms/private/plotms_pb2.py:93: DeprecationWarning: Call to deprecated create function Descriptor(). Note: Create unlinked descriptors is going to go away. Please use get/find descriptors from generated code or query the descriptor_pool. |
| 11-Oct-2026 21:56:30 | _TOGGLE = _descriptor.Descriptor( |
| 11-Oct-2026 21:56:30 | |
| 11-Oct-2026 21:56:30 | ../casa-6.7.4-12-pipeline-2026.3.0.29-py3.12.el8/lib/py/lib/python3.12/site-packages/casaplotms/private/plotms_pb2.py:131: 12 warnings |
| 11-Oct-2026 21:56:30 | /lustre/cv/sw/casa/casaci/cvpost128/bamboohome/xml-data/build-dir/PIPESPECS-TESTPIPEMAINCASA674-ML228PY312TEST/casa-build-utils/pipeline/workdir/casa-6.7.4-12-pipeline-2026.3.0.29-py3.12.el8/lib/py/lib/python3.12/site-packages/casaplotms/private/plotms_pb2.py:131: DeprecationWarning: Call to deprecated create function FieldDescriptor(). Note: Create unlinked descriptors is going to go away. Please use get/find descriptors from generated code or query the descriptor_pool. |
| 11-Oct-2026 21:56:30 | _descriptor.FieldDescriptor( |
| 11-Oct-2026 21:56:30 | |
| 11-Oct-2026 21:56:30 | ../casa-6.7.4-12-pipeline-2026.3.0.29-py3.12.el8/lib/py/lib/python3.12/site-packages/casaplotms/private/plotms_pb2.py:138: 12 warnings |
| 11-Oct-2026 21:56:30 | /lustre/cv/sw/casa/casaci/cvpost128/bamboohome/xml-data/build-dir/PIPESPECS-TESTPIPEMAINCASA674-ML228PY312TEST/casa-build-utils/pipeline/workdir/casa-6.7.4-12-pipeline-2026.3.0.29-py3.12.el8/lib/py/lib/python3.12/site-packages/casaplotms/private/plotms_pb2.py:138: DeprecationWarning: Call to deprecated create function FieldDescriptor(). Note: Create unlinked descriptors is going to go away. Please use get/find descriptors from generated code or query the descriptor_pool. |
| 11-Oct-2026 21:56:30 | _descriptor.FieldDescriptor( |
| 11-Oct-2026 21:56:30 | |
| 11-Oct-2026 21:56:30 | ../casa-6.7.4-12-pipeline-2026.3.0.29-py3.12.el8/lib/py/lib/python3.12/site-packages/casaplotms/private/plotms_pb2.py:124: 12 warnings |
| 11-Oct-2026 21:56:30 | /lustre/cv/sw/casa/casaci/cvpost128/bamboohome/xml-data/build-dir/PIPESPECS-TESTPIPEMAINCASA674-ML228PY312TEST/casa-build-utils/pipeline/workdir/casa-6.7.4-12-pipeline-2026.3.0.29-py3.12.el8/lib/py/lib/python3.12/site-packages/casaplotms/private/plotms_pb2.py:124: DeprecationWarning: Call to deprecated create function Descriptor(). Note: Create unlinked descriptors is going to go away. Please use get/find descriptors from generated code or query the descriptor_pool. |
| 11-Oct-2026 21:56:30 | _GRIDSIZE = _descriptor.Descriptor( |
| 11-Oct-2026 21:56:30 | |
| 11-Oct-2026 21:56:30 | ../casa-6.7.4-12-pipeline-2026.3.0.29-py3.12.el8/lib/py/lib/python3.12/site-packages/casaplotms/private/plotms_pb2.py:169: 12 warnings |
| 11-Oct-2026 21:56:30 | /lustre/cv/sw/casa/casaci/cvpost128/bamboohome/xml-data/build-dir/PIPESPECS-TESTPIPEMAINCASA674-ML228PY312TEST/casa-build-utils/pipeline/workdir/casa-6.7.4-12-pipeline-2026.3.0.29-py3.12.el8/lib/py/lib/python3.12/site-packages/casaplotms/private/plotms_pb2.py:169: DeprecationWarning: Call to deprecated create function FieldDescriptor(). Note: Create unlinked descriptors is going to go away. Please use get/find descriptors from generated code or query the descriptor_pool. |
| 11-Oct-2026 21:56:30 | _descriptor.FieldDescriptor( |
| 11-Oct-2026 21:56:30 | |
| 11-Oct-2026 21:56:30 | ../casa-6.7.4-12-pipeline-2026.3.0.29-py3.12.el8/lib/py/lib/python3.12/site-packages/casaplotms/private/plotms_pb2.py:176: 12 warnings |
| 11-Oct-2026 21:56:30 | /lustre/cv/sw/casa/casaci/cvpost128/bamboohome/xml-data/build-dir/PIPESPECS-TESTPIPEMAINCASA674-ML228PY312TEST/casa-build-utils/pipeline/workdir/casa-6.7.4-12-pipeline-2026.3.0.29-py3.12.el8/lib/py/lib/python3.12/site-packages/casaplotms/private/plotms_pb2.py:176: DeprecationWarning: Call to deprecated create function FieldDescriptor(). Note: Create unlinked descriptors is going to go away. Please use get/find descriptors from generated code or query the descriptor_pool. |
| 11-Oct-2026 21:56:30 | _descriptor.FieldDescriptor( |
| 11-Oct-2026 21:56:30 | |
| 11-Oct-2026 21:56:30 | ../casa-6.7.4-12-pipeline-2026.3.0.29-py3.12.el8/lib/py/lib/python3.12/site-packages/casaplotms/private/plotms_pb2.py:183: 12 warnings |
| 11-Oct-2026 21:56:30 | /lustre/cv/sw/casa/casaci/cvpost128/bamboohome/xml-data/build-dir/PIPESPECS-TESTPIPEMAINCASA674-ML228PY312TEST/casa-build-utils/pipeline/workdir/casa-6.7.4-12-pipeline-2026.3.0.29-py3.12.el8/lib/py/lib/python3.12/site-packages/casaplotms/private/plotms_pb2.py:183: DeprecationWarning: Call to deprecated create function FieldDescriptor(). Note: Create unlinked descriptors is going to go away. Please use get/find descriptors from generated code or query the descriptor_pool. |
| 11-Oct-2026 21:56:30 | _descriptor.FieldDescriptor( |
| 11-Oct-2026 21:56:30 | |
| 11-Oct-2026 21:56:30 | ../casa-6.7.4-12-pipeline-2026.3.0.29-py3.12.el8/lib/py/lib/python3.12/site-packages/casaplotms/private/plotms_pb2.py:162: 12 warnings |
| 11-Oct-2026 21:56:30 | /lustre/cv/sw/casa/casaci/cvpost128/bamboohome/xml-data/build-dir/PIPESPECS-TESTPIPEMAINCASA674-ML228PY312TEST/casa-build-utils/pipeline/workdir/casa-6.7.4-12-pipeline-2026.3.0.29-py3.12.el8/lib/py/lib/python3.12/site-packages/casaplotms/private/plotms_pb2.py:162: DeprecationWarning: Call to deprecated create function Descriptor(). Note: Create unlinked descriptors is going to go away. Please use get/find descriptors from generated code or query the descriptor_pool. |
| 11-Oct-2026 21:56:30 | _SETVIS = _descriptor.Descriptor( |
| 11-Oct-2026 21:56:30 | |
| 11-Oct-2026 21:56:30 | ../casa-6.7.4-12-pipeline-2026.3.0.29-py3.12.el8/lib/py/lib/python3.12/site-packages/casaplotms/private/plotms_pb2.py:214: 12 warnings |
| 11-Oct-2026 21:56:30 | /lustre/cv/sw/casa/casaci/cvpost128/bamboohome/xml-data/build-dir/PIPESPECS-TESTPIPEMAINCASA674-ML228PY312TEST/casa-build-utils/pipeline/workdir/casa-6.7.4-12-pipeline-2026.3.0.29-py3.12.el8/lib/py/lib/python3.12/site-packages/casaplotms/private/plotms_pb2.py:214: DeprecationWarning: Call to deprecated create function FieldDescriptor(). Note: Create unlinked descriptors is going to go away. Please use get/find descriptors from generated code or query the descriptor_pool. |
| 11-Oct-2026 21:56:30 | _descriptor.FieldDescriptor( |
| 11-Oct-2026 21:56:30 | |
| 11-Oct-2026 21:56:30 | ../casa-6.7.4-12-pipeline-2026.3.0.29-py3.12.el8/lib/py/lib/python3.12/site-packages/casaplotms/private/plotms_pb2.py:221: 12 warnings |
| 11-Oct-2026 21:56:30 | /lustre/cv/sw/casa/casaci/cvpost128/bamboohome/xml-data/build-dir/PIPESPECS-TESTPIPEMAINCASA674-ML228PY312TEST/casa-build-utils/pipeline/workdir/casa-6.7.4-12-pipeline-2026.3.0.29-py3.12.el8/lib/py/lib/python3.12/site-packages/casaplotms/private/plotms_pb2.py:221: DeprecationWarning: Call to deprecated create function FieldDescriptor(). Note: Create unlinked descriptors is going to go away. Please use get/find descriptors from generated code or query the descriptor_pool. |
| 11-Oct-2026 21:56:30 | _descriptor.FieldDescriptor( |
| 11-Oct-2026 21:56:30 | |
| 11-Oct-2026 21:56:30 | ../casa-6.7.4-12-pipeline-2026.3.0.29-py3.12.el8/lib/py/lib/python3.12/site-packages/casaplotms/private/plotms_pb2.py:228: 12 warnings |
| 11-Oct-2026 21:56:30 | /lustre/cv/sw/casa/casaci/cvpost128/bamboohome/xml-data/build-dir/PIPESPECS-TESTPIPEMAINCASA674-ML228PY312TEST/casa-build-utils/pipeline/workdir/casa-6.7.4-12-pipeline-2026.3.0.29-py3.12.el8/lib/py/lib/python3.12/site-packages/casaplotms/private/plotms_pb2.py:228: DeprecationWarning: Call to deprecated create function FieldDescriptor(). Note: Create unlinked descriptors is going to go away. Please use get/find descriptors from generated code or query the descriptor_pool. |
| 11-Oct-2026 21:56:30 | _descriptor.FieldDescriptor( |
| 11-Oct-2026 21:56:30 | |
| 11-Oct-2026 21:56:30 | ../casa-6.7.4-12-pipeline-2026.3.0.29-py3.12.el8/lib/py/lib/python3.12/site-packages/casaplotms/private/plotms_pb2.py:235: 12 warnings |
| 11-Oct-2026 21:56:30 | /lustre/cv/sw/casa/casaci/cvpost128/bamboohome/xml-data/build-dir/PIPESPECS-TESTPIPEMAINCASA674-ML228PY312TEST/casa-build-utils/pipeline/workdir/casa-6.7.4-12-pipeline-2026.3.0.29-py3.12.el8/lib/py/lib/python3.12/site-packages/casaplotms/private/plotms_pb2.py:235: DeprecationWarning: Call to deprecated create function FieldDescriptor(). Note: Create unlinked descriptors is going to go away. Please use get/find descriptors from generated code or query the descriptor_pool. |
| 11-Oct-2026 21:56:30 | _descriptor.FieldDescriptor( |
| 11-Oct-2026 21:56:30 | |
| 11-Oct-2026 21:56:30 | ../casa-6.7.4-12-pipeline-2026.3.0.29-py3.12.el8/lib/py/lib/python3.12/site-packages/casaplotms/private/plotms_pb2.py:242: 12 warnings |
| 11-Oct-2026 21:56:30 | /lustre/cv/sw/casa/casaci/cvpost128/bamboohome/xml-data/build-dir/PIPESPECS-TESTPIPEMAINCASA674-ML228PY312TEST/casa-build-utils/pipeline/workdir/casa-6.7.4-12-pipeline-2026.3.0.29-py3.12.el8/lib/py/lib/python3.12/site-packages/casaplotms/private/plotms_pb2.py:242: DeprecationWarning: Call to deprecated create function FieldDescriptor(). Note: Create unlinked descriptors is going to go away. Please use get/find descriptors from generated code or query the descriptor_pool. |
| 11-Oct-2026 21:56:30 | _descriptor.FieldDescriptor( |
| 11-Oct-2026 21:56:30 | |
| 11-Oct-2026 21:56:30 | ../casa-6.7.4-12-pipeline-2026.3.0.29-py3.12.el8/lib/py/lib/python3.12/site-packages/casaplotms/private/plotms_pb2.py:249: 12 warnings |
| 11-Oct-2026 21:56:30 | /lustre/cv/sw/casa/casaci/cvpost128/bamboohome/xml-data/build-dir/PIPESPECS-TESTPIPEMAINCASA674-ML228PY312TEST/casa-build-utils/pipeline/workdir/casa-6.7.4-12-pipeline-2026.3.0.29-py3.12.el8/lib/py/lib/python3.12/site-packages/casaplotms/private/plotms_pb2.py:249: DeprecationWarning: Call to deprecated create function FieldDescriptor(). Note: Create unlinked descriptors is going to go away. Please use get/find descriptors from generated code or query the descriptor_pool. |
| 11-Oct-2026 21:56:30 | _descriptor.FieldDescriptor( |
| 11-Oct-2026 21:56:30 | |
| 11-Oct-2026 21:56:30 | ../casa-6.7.4-12-pipeline-2026.3.0.29-py3.12.el8/lib/py/lib/python3.12/site-packages/casaplotms/private/plotms_pb2.py:256: 12 warnings |
| 11-Oct-2026 21:56:30 | /lustre/cv/sw/casa/casaci/cvpost128/bamboohome/xml-data/build-dir/PIPESPECS-TESTPIPEMAINCASA674-ML228PY312TEST/casa-build-utils/pipeline/workdir/casa-6.7.4-12-pipeline-2026.3.0.29-py3.12.el8/lib/py/lib/python3.12/site-packages/casaplotms/private/plotms_pb2.py:256: DeprecationWarning: Call to deprecated create function FieldDescriptor(). Note: Create unlinked descriptors is going to go away. Please use get/find descriptors from generated code or query the descriptor_pool. |
| 11-Oct-2026 21:56:30 | _descriptor.FieldDescriptor( |
| 11-Oct-2026 21:56:30 | |
| 11-Oct-2026 21:56:30 | ../casa-6.7.4-12-pipeline-2026.3.0.29-py3.12.el8/lib/py/lib/python3.12/site-packages/casaplotms/private/plotms_pb2.py:263: 12 warnings |
| 11-Oct-2026 21:56:30 | /lustre/cv/sw/casa/casaci/cvpost128/bamboohome/xml-data/build-dir/PIPESPECS-TESTPIPEMAINCASA674-ML228PY312TEST/casa-build-utils/pipeline/workdir/casa-6.7.4-12-pipeline-2026.3.0.29-py3.12.el8/lib/py/lib/python3.12/site-packages/casaplotms/private/plotms_pb2.py:263: DeprecationWarning: Call to deprecated create function FieldDescriptor(). Note: Create unlinked descriptors is going to go away. Please use get/find descriptors from generated code or query the descriptor_pool. |
| 11-Oct-2026 21:56:30 | _descriptor.FieldDescriptor( |
| 11-Oct-2026 21:56:30 | |
| 11-Oct-2026 21:56:30 | ../casa-6.7.4-12-pipeline-2026.3.0.29-py3.12.el8/lib/py/lib/python3.12/site-packages/casaplotms/private/plotms_pb2.py:270: 12 warnings |
| 11-Oct-2026 21:56:30 | /lustre/cv/sw/casa/casaci/cvpost128/bamboohome/xml-data/build-dir/PIPESPECS-TESTPIPEMAINCASA674-ML228PY312TEST/casa-build-utils/pipeline/workdir/casa-6.7.4-12-pipeline-2026.3.0.29-py3.12.el8/lib/py/lib/python3.12/site-packages/casaplotms/private/plotms_pb2.py:270: DeprecationWarning: Call to deprecated create function FieldDescriptor(). Note: Create unlinked descriptors is going to go away. Please use get/find descriptors from generated code or query the descriptor_pool. |
| 11-Oct-2026 21:56:30 | _descriptor.FieldDescriptor( |
| 11-Oct-2026 21:56:30 | |
| 11-Oct-2026 21:56:30 | ../casa-6.7.4-12-pipeline-2026.3.0.29-py3.12.el8/lib/py/lib/python3.12/site-packages/casaplotms/private/plotms_pb2.py:277: 12 warnings |
| 11-Oct-2026 21:56:30 | /lustre/cv/sw/casa/casaci/cvpost128/bamboohome/xml-data/build-dir/PIPESPECS-TESTPIPEMAINCASA674-ML228PY312TEST/casa-build-utils/pipeline/workdir/casa-6.7.4-12-pipeline-2026.3.0.29-py3.12.el8/lib/py/lib/python3.12/site-packages/casaplotms/private/plotms_pb2.py:277: DeprecationWarning: Call to deprecated create function FieldDescriptor(). Note: Create unlinked descriptors is going to go away. Please use get/find descriptors from generated code or query the descriptor_pool. |
| 11-Oct-2026 21:56:30 | _descriptor.FieldDescriptor( |
| 11-Oct-2026 21:56:30 | |
| 11-Oct-2026 21:56:30 | ../casa-6.7.4-12-pipeline-2026.3.0.29-py3.12.el8/lib/py/lib/python3.12/site-packages/casaplotms/private/plotms_pb2.py:284: 12 warnings |
| 11-Oct-2026 21:56:30 | /lustre/cv/sw/casa/casaci/cvpost128/bamboohome/xml-data/build-dir/PIPESPECS-TESTPIPEMAINCASA674-ML228PY312TEST/casa-build-utils/pipeline/workdir/casa-6.7.4-12-pipeline-2026.3.0.29-py3.12.el8/lib/py/lib/python3.12/site-packages/casaplotms/private/plotms_pb2.py:284: DeprecationWarning: Call to deprecated create function FieldDescriptor(). Note: Create unlinked descriptors is going to go away. Please use get/find descriptors from generated code or query the descriptor_pool. |
| 11-Oct-2026 21:56:30 | _descriptor.FieldDescriptor( |
| 11-Oct-2026 21:56:30 | |
| 11-Oct-2026 21:56:30 | ../casa-6.7.4-12-pipeline-2026.3.0.29-py3.12.el8/lib/py/lib/python3.12/site-packages/casaplotms/private/plotms_pb2.py:291: 12 warnings |
| 11-Oct-2026 21:56:30 | /lustre/cv/sw/casa/casaci/cvpost128/bamboohome/xml-data/build-dir/PIPESPECS-TESTPIPEMAINCASA674-ML228PY312TEST/casa-build-utils/pipeline/workdir/casa-6.7.4-12-pipeline-2026.3.0.29-py3.12.el8/lib/py/lib/python3.12/site-packages/casaplotms/private/plotms_pb2.py:291: DeprecationWarning: Call to deprecated create function FieldDescriptor(). Note: Create unlinked descriptors is going to go away. Please use get/find descriptors from generated code or query the descriptor_pool. |
| 11-Oct-2026 21:56:30 | _descriptor.FieldDescriptor( |
| 11-Oct-2026 21:56:30 | |
| 11-Oct-2026 21:56:30 | ../casa-6.7.4-12-pipeline-2026.3.0.29-py3.12.el8/lib/py/lib/python3.12/site-packages/casaplotms/private/plotms_pb2.py:207: 12 warnings |
| 11-Oct-2026 21:56:30 | /lustre/cv/sw/casa/casaci/cvpost128/bamboohome/xml-data/build-dir/PIPESPECS-TESTPIPEMAINCASA674-ML228PY312TEST/casa-build-utils/pipeline/workdir/casa-6.7.4-12-pipeline-2026.3.0.29-py3.12.el8/lib/py/lib/python3.12/site-packages/casaplotms/private/plotms_pb2.py:207: DeprecationWarning: Call to deprecated create function Descriptor(). Note: Create unlinked descriptors is going to go away. Please use get/find descriptors from generated code or query the descriptor_pool. |
| 11-Oct-2026 21:56:30 | _SETAXES = _descriptor.Descriptor( |
| 11-Oct-2026 21:56:30 | |
| 11-Oct-2026 21:56:30 | ../casa-6.7.4-12-pipeline-2026.3.0.29-py3.12.el8/lib/py/lib/python3.12/site-packages/casaplotms/private/plotms_pb2.py:322: 12 warnings |
| 11-Oct-2026 21:56:30 | /lustre/cv/sw/casa/casaci/cvpost128/bamboohome/xml-data/build-dir/PIPESPECS-TESTPIPEMAINCASA674-ML228PY312TEST/casa-build-utils/pipeline/workdir/casa-6.7.4-12-pipeline-2026.3.0.29-py3.12.el8/lib/py/lib/python3.12/site-packages/casaplotms/private/plotms_pb2.py:322: DeprecationWarning: Call to deprecated create function FieldDescriptor(). Note: Create unlinked descriptors is going to go away. Please use get/find descriptors from generated code or query the descriptor_pool. |
| 11-Oct-2026 21:56:30 | _descriptor.FieldDescriptor( |
| 11-Oct-2026 21:56:30 | |
| 11-Oct-2026 21:56:30 | ../casa-6.7.4-12-pipeline-2026.3.0.29-py3.12.el8/lib/py/lib/python3.12/site-packages/casaplotms/private/plotms_pb2.py:329: 12 warnings |
| 11-Oct-2026 21:56:30 | /lustre/cv/sw/casa/casaci/cvpost128/bamboohome/xml-data/build-dir/PIPESPECS-TESTPIPEMAINCASA674-ML228PY312TEST/casa-build-utils/pipeline/workdir/casa-6.7.4-12-pipeline-2026.3.0.29-py3.12.el8/lib/py/lib/python3.12/site-packages/casaplotms/private/plotms_pb2.py:329: DeprecationWarning: Call to deprecated create function FieldDescriptor(). Note: Create unlinked descriptors is going to go away. Please use get/find descriptors from generated code or query the descriptor_pool. |
| 11-Oct-2026 21:56:30 | _descriptor.FieldDescriptor( |
| 11-Oct-2026 21:56:30 | |
| 11-Oct-2026 21:56:30 | ../casa-6.7.4-12-pipeline-2026.3.0.29-py3.12.el8/lib/py/lib/python3.12/site-packages/casaplotms/private/plotms_pb2.py:336: 12 warnings |
| 11-Oct-2026 21:56:30 | /lustre/cv/sw/casa/casaci/cvpost128/bamboohome/xml-data/build-dir/PIPESPECS-TESTPIPEMAINCASA674-ML228PY312TEST/casa-build-utils/pipeline/workdir/casa-6.7.4-12-pipeline-2026.3.0.29-py3.12.el8/lib/py/lib/python3.12/site-packages/casaplotms/private/plotms_pb2.py:336: DeprecationWarning: Call to deprecated create function FieldDescriptor(). Note: Create unlinked descriptors is going to go away. Please use get/find descriptors from generated code or query the descriptor_pool. |
| 11-Oct-2026 21:56:30 | _descriptor.FieldDescriptor( |
| 11-Oct-2026 21:56:30 | |
| 11-Oct-2026 21:56:30 | ../casa-6.7.4-12-pipeline-2026.3.0.29-py3.12.el8/lib/py/lib/python3.12/site-packages/casaplotms/private/plotms_pb2.py:315: 12 warnings |
| 11-Oct-2026 21:56:30 | /lustre/cv/sw/casa/casaci/cvpost128/bamboohome/xml-data/build-dir/PIPESPECS-TESTPIPEMAINCASA674-ML228PY312TEST/casa-build-utils/pipeline/workdir/casa-6.7.4-12-pipeline-2026.3.0.29-py3.12.el8/lib/py/lib/python3.12/site-packages/casaplotms/private/plotms_pb2.py:315: DeprecationWarning: Call to deprecated create function Descriptor(). Note: Create unlinked descriptors is going to go away. Please use get/find descriptors from generated code or query the descriptor_pool. |
| 11-Oct-2026 21:56:30 | _SETTOGGLE = _descriptor.Descriptor( |
| 11-Oct-2026 21:56:30 | |
| 11-Oct-2026 21:56:30 | ../casa-6.7.4-12-pipeline-2026.3.0.29-py3.12.el8/lib/py/lib/python3.12/site-packages/casaplotms/private/plotms_pb2.py:367: 12 warnings |
| 11-Oct-2026 21:56:30 | /lustre/cv/sw/casa/casaci/cvpost128/bamboohome/xml-data/build-dir/PIPESPECS-TESTPIPEMAINCASA674-ML228PY312TEST/casa-build-utils/pipeline/workdir/casa-6.7.4-12-pipeline-2026.3.0.29-py3.12.el8/lib/py/lib/python3.12/site-packages/casaplotms/private/plotms_pb2.py:367: DeprecationWarning: Call to deprecated create function FieldDescriptor(). Note: Create unlinked descriptors is going to go away. Please use get/find descriptors from generated code or query the descriptor_pool. |
| 11-Oct-2026 21:56:30 | _descriptor.FieldDescriptor( |
| 11-Oct-2026 21:56:30 | |
| 11-Oct-2026 21:56:30 | ../casa-6.7.4-12-pipeline-2026.3.0.29-py3.12.el8/lib/py/lib/python3.12/site-packages/casaplotms/private/plotms_pb2.py:374: 12 warnings |
| 11-Oct-2026 21:56:30 | /lustre/cv/sw/casa/casaci/cvpost128/bamboohome/xml-data/build-dir/PIPESPECS-TESTPIPEMAINCASA674-ML228PY312TEST/casa-build-utils/pipeline/workdir/casa-6.7.4-12-pipeline-2026.3.0.29-py3.12.el8/lib/py/lib/python3.12/site-packages/casaplotms/private/plotms_pb2.py:374: DeprecationWarning: Call to deprecated create function FieldDescriptor(). Note: Create unlinked descriptors is going to go away. Please use get/find descriptors from generated code or query the descriptor_pool. |
| 11-Oct-2026 21:56:30 | _descriptor.FieldDescriptor( |
| 11-Oct-2026 21:56:30 | |
| 11-Oct-2026 21:56:30 | ../casa-6.7.4-12-pipeline-2026.3.0.29-py3.12.el8/lib/py/lib/python3.12/site-packages/casaplotms/private/plotms_pb2.py:381: 12 warnings |
| 11-Oct-2026 21:56:30 | /lustre/cv/sw/casa/casaci/cvpost128/bamboohome/xml-data/build-dir/PIPESPECS-TESTPIPEMAINCASA674-ML228PY312TEST/casa-build-utils/pipeline/workdir/casa-6.7.4-12-pipeline-2026.3.0.29-py3.12.el8/lib/py/lib/python3.12/site-packages/casaplotms/private/plotms_pb2.py:381: DeprecationWarning: Call to deprecated create function FieldDescriptor(). Note: Create unlinked descriptors is going to go away. Please use get/find descriptors from generated code or query the descriptor_pool. |
| 11-Oct-2026 21:56:30 | _descriptor.FieldDescriptor( |
| 11-Oct-2026 21:56:30 | |
| 11-Oct-2026 21:56:30 | ../casa-6.7.4-12-pipeline-2026.3.0.29-py3.12.el8/lib/py/lib/python3.12/site-packages/casaplotms/private/plotms_pb2.py:388: 12 warnings |
| 11-Oct-2026 21:56:30 | /lustre/cv/sw/casa/casaci/cvpost128/bamboohome/xml-data/build-dir/PIPESPECS-TESTPIPEMAINCASA674-ML228PY312TEST/casa-build-utils/pipeline/workdir/casa-6.7.4-12-pipeline-2026.3.0.29-py3.12.el8/lib/py/lib/python3.12/site-packages/casaplotms/private/plotms_pb2.py:388: DeprecationWarning: Call to deprecated create function FieldDescriptor(). Note: Create unlinked descriptors is going to go away. Please use get/find descriptors from generated code or query the descriptor_pool. |
| 11-Oct-2026 21:56:30 | _descriptor.FieldDescriptor( |
| 11-Oct-2026 21:56:30 | |
| 11-Oct-2026 21:56:30 | ../casa-6.7.4-12-pipeline-2026.3.0.29-py3.12.el8/lib/py/lib/python3.12/site-packages/casaplotms/private/plotms_pb2.py:395: 12 warnings |
| 11-Oct-2026 21:56:30 | /lustre/cv/sw/casa/casaci/cvpost128/bamboohome/xml-data/build-dir/PIPESPECS-TESTPIPEMAINCASA674-ML228PY312TEST/casa-build-utils/pipeline/workdir/casa-6.7.4-12-pipeline-2026.3.0.29-py3.12.el8/lib/py/lib/python3.12/site-packages/casaplotms/private/plotms_pb2.py:395: DeprecationWarning: Call to deprecated create function FieldDescriptor(). Note: Create unlinked descriptors is going to go away. Please use get/find descriptors from generated code or query the descriptor_pool. |
| 11-Oct-2026 21:56:30 | _descriptor.FieldDescriptor( |
| 11-Oct-2026 21:56:30 | |
| 11-Oct-2026 21:56:30 | ../casa-6.7.4-12-pipeline-2026.3.0.29-py3.12.el8/lib/py/lib/python3.12/site-packages/casaplotms/private/plotms_pb2.py:402: 12 warnings |
| 11-Oct-2026 21:56:30 | /lustre/cv/sw/casa/casaci/cvpost128/bamboohome/xml-data/build-dir/PIPESPECS-TESTPIPEMAINCASA674-ML228PY312TEST/casa-build-utils/pipeline/workdir/casa-6.7.4-12-pipeline-2026.3.0.29-py3.12.el8/lib/py/lib/python3.12/site-packages/casaplotms/private/plotms_pb2.py:402: DeprecationWarning: Call to deprecated create function FieldDescriptor(). Note: Create unlinked descriptors is going to go away. Please use get/find descriptors from generated code or query the descriptor_pool. |
| 11-Oct-2026 21:56:30 | _descriptor.FieldDescriptor( |
| 11-Oct-2026 21:56:30 | |
| 11-Oct-2026 21:56:30 | ../casa-6.7.4-12-pipeline-2026.3.0.29-py3.12.el8/lib/py/lib/python3.12/site-packages/casaplotms/private/plotms_pb2.py:409: 12 warnings |
| 11-Oct-2026 21:56:30 | /lustre/cv/sw/casa/casaci/cvpost128/bamboohome/xml-data/build-dir/PIPESPECS-TESTPIPEMAINCASA674-ML228PY312TEST/casa-build-utils/pipeline/workdir/casa-6.7.4-12-pipeline-2026.3.0.29-py3.12.el8/lib/py/lib/python3.12/site-packages/casaplotms/private/plotms_pb2.py:409: DeprecationWarning: Call to deprecated create function FieldDescriptor(). Note: Create unlinked descriptors is going to go away. Please use get/find descriptors from generated code or query the descriptor_pool. |
| 11-Oct-2026 21:56:30 | _descriptor.FieldDescriptor( |
| 11-Oct-2026 21:56:30 | |
| 11-Oct-2026 21:56:30 | ../casa-6.7.4-12-pipeline-2026.3.0.29-py3.12.el8/lib/py/lib/python3.12/site-packages/casaplotms/private/plotms_pb2.py:416: 12 warnings |
| 11-Oct-2026 21:56:30 | /lustre/cv/sw/casa/casaci/cvpost128/bamboohome/xml-data/build-dir/PIPESPECS-TESTPIPEMAINCASA674-ML228PY312TEST/casa-build-utils/pipeline/workdir/casa-6.7.4-12-pipeline-2026.3.0.29-py3.12.el8/lib/py/lib/python3.12/site-packages/casaplotms/private/plotms_pb2.py:416: DeprecationWarning: Call to deprecated create function FieldDescriptor(). Note: Create unlinked descriptors is going to go away. Please use get/find descriptors from generated code or query the descriptor_pool. |
| 11-Oct-2026 21:56:30 | _descriptor.FieldDescriptor( |
| 11-Oct-2026 21:56:30 | |
| 11-Oct-2026 21:56:30 | ../casa-6.7.4-12-pipeline-2026.3.0.29-py3.12.el8/lib/py/lib/python3.12/site-packages/casaplotms/private/plotms_pb2.py:423: 12 warnings |
| 11-Oct-2026 21:56:30 | /lustre/cv/sw/casa/casaci/cvpost128/bamboohome/xml-data/build-dir/PIPESPECS-TESTPIPEMAINCASA674-ML228PY312TEST/casa-build-utils/pipeline/workdir/casa-6.7.4-12-pipeline-2026.3.0.29-py3.12.el8/lib/py/lib/python3.12/site-packages/casaplotms/private/plotms_pb2.py:423: DeprecationWarning: Call to deprecated create function FieldDescriptor(). Note: Create unlinked descriptors is going to go away. Please use get/find descriptors from generated code or query the descriptor_pool. |
| 11-Oct-2026 21:56:30 | _descriptor.FieldDescriptor( |
| 11-Oct-2026 21:56:30 | |
| 11-Oct-2026 21:56:30 | ../casa-6.7.4-12-pipeline-2026.3.0.29-py3.12.el8/lib/py/lib/python3.12/site-packages/casaplotms/private/plotms_pb2.py:430: 12 warnings |
| 11-Oct-2026 21:56:30 | /lustre/cv/sw/casa/casaci/cvpost128/bamboohome/xml-data/build-dir/PIPESPECS-TESTPIPEMAINCASA674-ML228PY312TEST/casa-build-utils/pipeline/workdir/casa-6.7.4-12-pipeline-2026.3.0.29-py3.12.el8/lib/py/lib/python3.12/site-packages/casaplotms/private/plotms_pb2.py:430: DeprecationWarning: Call to deprecated create function FieldDescriptor(). Note: Create unlinked descriptors is going to go away. Please use get/find descriptors from generated code or query the descriptor_pool. |
| 11-Oct-2026 21:56:30 | _descriptor.FieldDescriptor( |
| 11-Oct-2026 21:56:30 | |
| 11-Oct-2026 21:56:30 | ../casa-6.7.4-12-pipeline-2026.3.0.29-py3.12.el8/lib/py/lib/python3.12/site-packages/casaplotms/private/plotms_pb2.py:437: 12 warnings |
| 11-Oct-2026 21:56:30 | /lustre/cv/sw/casa/casaci/cvpost128/bamboohome/xml-data/build-dir/PIPESPECS-TESTPIPEMAINCASA674-ML228PY312TEST/casa-build-utils/pipeline/workdir/casa-6.7.4-12-pipeline-2026.3.0.29-py3.12.el8/lib/py/lib/python3.12/site-packages/casaplotms/private/plotms_pb2.py:437: DeprecationWarning: Call to deprecated create function FieldDescriptor(). Note: Create unlinked descriptors is going to go away. Please use get/find descriptors from generated code or query the descriptor_pool. |
| 11-Oct-2026 21:56:30 | _descriptor.FieldDescriptor( |
| 11-Oct-2026 21:56:30 | |
| 11-Oct-2026 21:56:30 | ../casa-6.7.4-12-pipeline-2026.3.0.29-py3.12.el8/lib/py/lib/python3.12/site-packages/casaplotms/private/plotms_pb2.py:444: 12 warnings |
| 11-Oct-2026 21:56:30 | /lustre/cv/sw/casa/casaci/cvpost128/bamboohome/xml-data/build-dir/PIPESPECS-TESTPIPEMAINCASA674-ML228PY312TEST/casa-build-utils/pipeline/workdir/casa-6.7.4-12-pipeline-2026.3.0.29-py3.12.el8/lib/py/lib/python3.12/site-packages/casaplotms/private/plotms_pb2.py:444: DeprecationWarning: Call to deprecated create function FieldDescriptor(). Note: Create unlinked descriptors is going to go away. Please use get/find descriptors from generated code or query the descriptor_pool. |
| 11-Oct-2026 21:56:30 | _descriptor.FieldDescriptor( |
| 11-Oct-2026 21:56:30 | |
| 11-Oct-2026 21:56:30 | ../casa-6.7.4-12-pipeline-2026.3.0.29-py3.12.el8/lib/py/lib/python3.12/site-packages/casaplotms/private/plotms_pb2.py:451: 12 warnings |
| 11-Oct-2026 21:56:30 | /lustre/cv/sw/casa/casaci/cvpost128/bamboohome/xml-data/build-dir/PIPESPECS-TESTPIPEMAINCASA674-ML228PY312TEST/casa-build-utils/pipeline/workdir/casa-6.7.4-12-pipeline-2026.3.0.29-py3.12.el8/lib/py/lib/python3.12/site-packages/casaplotms/private/plotms_pb2.py:451: DeprecationWarning: Call to deprecated create function FieldDescriptor(). Note: Create unlinked descriptors is going to go away. Please use get/find descriptors from generated code or query the descriptor_pool. |
| 11-Oct-2026 21:56:30 | _descriptor.FieldDescriptor( |
| 11-Oct-2026 21:56:30 | |
| 11-Oct-2026 21:56:30 | ../casa-6.7.4-12-pipeline-2026.3.0.29-py3.12.el8/lib/py/lib/python3.12/site-packages/casaplotms/private/plotms_pb2.py:458: 12 warnings |
| 11-Oct-2026 21:56:30 | /lustre/cv/sw/casa/casaci/cvpost128/bamboohome/xml-data/build-dir/PIPESPECS-TESTPIPEMAINCASA674-ML228PY312TEST/casa-build-utils/pipeline/workdir/casa-6.7.4-12-pipeline-2026.3.0.29-py3.12.el8/lib/py/lib/python3.12/site-packages/casaplotms/private/plotms_pb2.py:458: DeprecationWarning: Call to deprecated create function FieldDescriptor(). Note: Create unlinked descriptors is going to go away. Please use get/find descriptors from generated code or query the descriptor_pool. |
| 11-Oct-2026 21:56:30 | _descriptor.FieldDescriptor( |
| 11-Oct-2026 21:56:30 | |
| 11-Oct-2026 21:56:30 | ../casa-6.7.4-12-pipeline-2026.3.0.29-py3.12.el8/lib/py/lib/python3.12/site-packages/casaplotms/private/plotms_pb2.py:465: 12 warnings |
| 11-Oct-2026 21:56:30 | /lustre/cv/sw/casa/casaci/cvpost128/bamboohome/xml-data/build-dir/PIPESPECS-TESTPIPEMAINCASA674-ML228PY312TEST/casa-build-utils/pipeline/workdir/casa-6.7.4-12-pipeline-2026.3.0.29-py3.12.el8/lib/py/lib/python3.12/site-packages/casaplotms/private/plotms_pb2.py:465: DeprecationWarning: Call to deprecated create function FieldDescriptor(). Note: Create unlinked descriptors is going to go away. Please use get/find descriptors from generated code or query the descriptor_pool. |
| 11-Oct-2026 21:56:30 | _descriptor.FieldDescriptor( |
| 11-Oct-2026 21:56:30 | |
| 11-Oct-2026 21:56:30 | ../casa-6.7.4-12-pipeline-2026.3.0.29-py3.12.el8/lib/py/lib/python3.12/site-packages/casaplotms/private/plotms_pb2.py:360: 12 warnings |
| 11-Oct-2026 21:56:30 | /lustre/cv/sw/casa/casaci/cvpost128/bamboohome/xml-data/build-dir/PIPESPECS-TESTPIPEMAINCASA674-ML228PY312TEST/casa-build-utils/pipeline/workdir/casa-6.7.4-12-pipeline-2026.3.0.29-py3.12.el8/lib/py/lib/python3.12/site-packages/casaplotms/private/plotms_pb2.py:360: DeprecationWarning: Call to deprecated create function Descriptor(). Note: Create unlinked descriptors is going to go away. Please use get/find descriptors from generated code or query the descriptor_pool. |
| 11-Oct-2026 21:56:30 | _SETSELECTION = _descriptor.Descriptor( |
| 11-Oct-2026 21:56:30 | |
| 11-Oct-2026 21:56:30 | ../casa-6.7.4-12-pipeline-2026.3.0.29-py3.12.el8/lib/py/lib/python3.12/site-packages/casaplotms/private/plotms_pb2.py:496: 12 warnings |
| 11-Oct-2026 21:56:30 | /lustre/cv/sw/casa/casaci/cvpost128/bamboohome/xml-data/build-dir/PIPESPECS-TESTPIPEMAINCASA674-ML228PY312TEST/casa-build-utils/pipeline/workdir/casa-6.7.4-12-pipeline-2026.3.0.29-py3.12.el8/lib/py/lib/python3.12/site-packages/casaplotms/private/plotms_pb2.py:496: DeprecationWarning: Call to deprecated create function FieldDescriptor(). Note: Create unlinked descriptors is going to go away. Please use get/find descriptors from generated code or query the descriptor_pool. |
| 11-Oct-2026 21:56:30 | _descriptor.FieldDescriptor( |
| 11-Oct-2026 21:56:30 | |
| 11-Oct-2026 21:56:30 | ../casa-6.7.4-12-pipeline-2026.3.0.29-py3.12.el8/lib/py/lib/python3.12/site-packages/casaplotms/private/plotms_pb2.py:503: 12 warnings |
| 11-Oct-2026 21:56:30 | /lustre/cv/sw/casa/casaci/cvpost128/bamboohome/xml-data/build-dir/PIPESPECS-TESTPIPEMAINCASA674-ML228PY312TEST/casa-build-utils/pipeline/workdir/casa-6.7.4-12-pipeline-2026.3.0.29-py3.12.el8/lib/py/lib/python3.12/site-packages/casaplotms/private/plotms_pb2.py:503: DeprecationWarning: Call to deprecated create function FieldDescriptor(). Note: Create unlinked descriptors is going to go away. Please use get/find descriptors from generated code or query the descriptor_pool. |
| 11-Oct-2026 21:56:30 | _descriptor.FieldDescriptor( |
| 11-Oct-2026 21:56:30 | |
| 11-Oct-2026 21:56:30 | ../casa-6.7.4-12-pipeline-2026.3.0.29-py3.12.el8/lib/py/lib/python3.12/site-packages/casaplotms/private/plotms_pb2.py:510: 12 warnings |
| 11-Oct-2026 21:56:30 | /lustre/cv/sw/casa/casaci/cvpost128/bamboohome/xml-data/build-dir/PIPESPECS-TESTPIPEMAINCASA674-ML228PY312TEST/casa-build-utils/pipeline/workdir/casa-6.7.4-12-pipeline-2026.3.0.29-py3.12.el8/lib/py/lib/python3.12/site-packages/casaplotms/private/plotms_pb2.py:510: DeprecationWarning: Call to deprecated create function FieldDescriptor(). Note: Create unlinked descriptors is going to go away. Please use get/find descriptors from generated code or query the descriptor_pool. |
| 11-Oct-2026 21:56:30 | _descriptor.FieldDescriptor( |
| 11-Oct-2026 21:56:30 | |
| 11-Oct-2026 21:56:30 | ../casa-6.7.4-12-pipeline-2026.3.0.29-py3.12.el8/lib/py/lib/python3.12/site-packages/casaplotms/private/plotms_pb2.py:517: 12 warnings |
| 11-Oct-2026 21:56:30 | /lustre/cv/sw/casa/casaci/cvpost128/bamboohome/xml-data/build-dir/PIPESPECS-TESTPIPEMAINCASA674-ML228PY312TEST/casa-build-utils/pipeline/workdir/casa-6.7.4-12-pipeline-2026.3.0.29-py3.12.el8/lib/py/lib/python3.12/site-packages/casaplotms/private/plotms_pb2.py:517: DeprecationWarning: Call to deprecated create function FieldDescriptor(). Note: Create unlinked descriptors is going to go away. Please use get/find descriptors from generated code or query the descriptor_pool. |
| 11-Oct-2026 21:56:30 | _descriptor.FieldDescriptor( |
| 11-Oct-2026 21:56:30 | |
| 11-Oct-2026 21:56:30 | ../casa-6.7.4-12-pipeline-2026.3.0.29-py3.12.el8/lib/py/lib/python3.12/site-packages/casaplotms/private/plotms_pb2.py:524: 12 warnings |
| 11-Oct-2026 21:56:30 | /lustre/cv/sw/casa/casaci/cvpost128/bamboohome/xml-data/build-dir/PIPESPECS-TESTPIPEMAINCASA674-ML228PY312TEST/casa-build-utils/pipeline/workdir/casa-6.7.4-12-pipeline-2026.3.0.29-py3.12.el8/lib/py/lib/python3.12/site-packages/casaplotms/private/plotms_pb2.py:524: DeprecationWarning: Call to deprecated create function FieldDescriptor(). Note: Create unlinked descriptors is going to go away. Please use get/find descriptors from generated code or query the descriptor_pool. |
| 11-Oct-2026 21:56:30 | _descriptor.FieldDescriptor( |
| 11-Oct-2026 21:56:30 | |
| 11-Oct-2026 21:56:30 | ../casa-6.7.4-12-pipeline-2026.3.0.29-py3.12.el8/lib/py/lib/python3.12/site-packages/casaplotms/private/plotms_pb2.py:531: 12 warnings |
| 11-Oct-2026 21:56:30 | /lustre/cv/sw/casa/casaci/cvpost128/bamboohome/xml-data/build-dir/PIPESPECS-TESTPIPEMAINCASA674-ML228PY312TEST/casa-build-utils/pipeline/workdir/casa-6.7.4-12-pipeline-2026.3.0.29-py3.12.el8/lib/py/lib/python3.12/site-packages/casaplotms/private/plotms_pb2.py:531: DeprecationWarning: Call to deprecated create function FieldDescriptor(). Note: Create unlinked descriptors is going to go away. Please use get/find descriptors from generated code or query the descriptor_pool. |
| 11-Oct-2026 21:56:30 | _descriptor.FieldDescriptor( |
| 11-Oct-2026 21:56:30 | |
| 11-Oct-2026 21:56:30 | ../casa-6.7.4-12-pipeline-2026.3.0.29-py3.12.el8/lib/py/lib/python3.12/site-packages/casaplotms/private/plotms_pb2.py:538: 12 warnings |
| 11-Oct-2026 21:56:30 | /lustre/cv/sw/casa/casaci/cvpost128/bamboohome/xml-data/build-dir/PIPESPECS-TESTPIPEMAINCASA674-ML228PY312TEST/casa-build-utils/pipeline/workdir/casa-6.7.4-12-pipeline-2026.3.0.29-py3.12.el8/lib/py/lib/python3.12/site-packages/casaplotms/private/plotms_pb2.py:538: DeprecationWarning: Call to deprecated create function FieldDescriptor(). Note: Create unlinked descriptors is going to go away. Please use get/find descriptors from generated code or query the descriptor_pool. |
| 11-Oct-2026 21:56:30 | _descriptor.FieldDescriptor( |
| 11-Oct-2026 21:56:30 | |
| 11-Oct-2026 21:56:30 | ../casa-6.7.4-12-pipeline-2026.3.0.29-py3.12.el8/lib/py/lib/python3.12/site-packages/casaplotms/private/plotms_pb2.py:545: 12 warnings |
| 11-Oct-2026 21:56:30 | /lustre/cv/sw/casa/casaci/cvpost128/bamboohome/xml-data/build-dir/PIPESPECS-TESTPIPEMAINCASA674-ML228PY312TEST/casa-build-utils/pipeline/workdir/casa-6.7.4-12-pipeline-2026.3.0.29-py3.12.el8/lib/py/lib/python3.12/site-packages/casaplotms/private/plotms_pb2.py:545: DeprecationWarning: Call to deprecated create function FieldDescriptor(). Note: Create unlinked descriptors is going to go away. Please use get/find descriptors from generated code or query the descriptor_pool. |
| 11-Oct-2026 21:56:30 | _descriptor.FieldDescriptor( |
| 11-Oct-2026 21:56:30 | |
| 11-Oct-2026 21:56:30 | ../casa-6.7.4-12-pipeline-2026.3.0.29-py3.12.el8/lib/py/lib/python3.12/site-packages/casaplotms/private/plotms_pb2.py:552: 12 warnings |
| 11-Oct-2026 21:56:30 | /lustre/cv/sw/casa/casaci/cvpost128/bamboohome/xml-data/build-dir/PIPESPECS-TESTPIPEMAINCASA674-ML228PY312TEST/casa-build-utils/pipeline/workdir/casa-6.7.4-12-pipeline-2026.3.0.29-py3.12.el8/lib/py/lib/python3.12/site-packages/casaplotms/private/plotms_pb2.py:552: DeprecationWarning: Call to deprecated create function FieldDescriptor(). Note: Create unlinked descriptors is going to go away. Please use get/find descriptors from generated code or query the descriptor_pool. |
| 11-Oct-2026 21:56:30 | _descriptor.FieldDescriptor( |
| 11-Oct-2026 21:56:30 | |
| 11-Oct-2026 21:56:30 | ../casa-6.7.4-12-pipeline-2026.3.0.29-py3.12.el8/lib/py/lib/python3.12/site-packages/casaplotms/private/plotms_pb2.py:559: 12 warnings |
| 11-Oct-2026 21:56:30 | /lustre/cv/sw/casa/casaci/cvpost128/bamboohome/xml-data/build-dir/PIPESPECS-TESTPIPEMAINCASA674-ML228PY312TEST/casa-build-utils/pipeline/workdir/casa-6.7.4-12-pipeline-2026.3.0.29-py3.12.el8/lib/py/lib/python3.12/site-packages/casaplotms/private/plotms_pb2.py:559: DeprecationWarning: Call to deprecated create function FieldDescriptor(). Note: Create unlinked descriptors is going to go away. Please use get/find descriptors from generated code or query the descriptor_pool. |
| 11-Oct-2026 21:56:30 | _descriptor.FieldDescriptor( |
| 11-Oct-2026 21:56:30 | |
| 11-Oct-2026 21:56:30 | ../casa-6.7.4-12-pipeline-2026.3.0.29-py3.12.el8/lib/py/lib/python3.12/site-packages/casaplotms/private/plotms_pb2.py:489: 12 warnings |
| 11-Oct-2026 21:56:30 | /lustre/cv/sw/casa/casaci/cvpost128/bamboohome/xml-data/build-dir/PIPESPECS-TESTPIPEMAINCASA674-ML228PY312TEST/casa-build-utils/pipeline/workdir/casa-6.7.4-12-pipeline-2026.3.0.29-py3.12.el8/lib/py/lib/python3.12/site-packages/casaplotms/private/plotms_pb2.py:489: DeprecationWarning: Call to deprecated create function Descriptor(). Note: Create unlinked descriptors is going to go away. Please use get/find descriptors from generated code or query the descriptor_pool. |
| 11-Oct-2026 21:56:30 | _SETAVERAGING = _descriptor.Descriptor( |
| 11-Oct-2026 21:56:30 | |
| 11-Oct-2026 21:56:30 | ../casa-6.7.4-12-pipeline-2026.3.0.29-py3.12.el8/lib/py/lib/python3.12/site-packages/casaplotms/private/plotms_pb2.py:590: 12 warnings |
| 11-Oct-2026 21:56:30 | /lustre/cv/sw/casa/casaci/cvpost128/bamboohome/xml-data/build-dir/PIPESPECS-TESTPIPEMAINCASA674-ML228PY312TEST/casa-build-utils/pipeline/workdir/casa-6.7.4-12-pipeline-2026.3.0.29-py3.12.el8/lib/py/lib/python3.12/site-packages/casaplotms/private/plotms_pb2.py:590: DeprecationWarning: Call to deprecated create function FieldDescriptor(). Note: Create unlinked descriptors is going to go away. Please use get/find descriptors from generated code or query the descriptor_pool. |
| 11-Oct-2026 21:56:30 | _descriptor.FieldDescriptor( |
| 11-Oct-2026 21:56:30 | |
| 11-Oct-2026 21:56:30 | ../casa-6.7.4-12-pipeline-2026.3.0.29-py3.12.el8/lib/py/lib/python3.12/site-packages/casaplotms/private/plotms_pb2.py:597: 12 warnings |
| 11-Oct-2026 21:56:30 | /lustre/cv/sw/casa/casaci/cvpost128/bamboohome/xml-data/build-dir/PIPESPECS-TESTPIPEMAINCASA674-ML228PY312TEST/casa-build-utils/pipeline/workdir/casa-6.7.4-12-pipeline-2026.3.0.29-py3.12.el8/lib/py/lib/python3.12/site-packages/casaplotms/private/plotms_pb2.py:597: DeprecationWarning: Call to deprecated create function FieldDescriptor(). Note: Create unlinked descriptors is going to go away. Please use get/find descriptors from generated code or query the descriptor_pool. |
| 11-Oct-2026 21:56:30 | _descriptor.FieldDescriptor( |
| 11-Oct-2026 21:56:30 | |
| 11-Oct-2026 21:56:30 | ../casa-6.7.4-12-pipeline-2026.3.0.29-py3.12.el8/lib/py/lib/python3.12/site-packages/casaplotms/private/plotms_pb2.py:604: 12 warnings |
| 11-Oct-2026 21:56:30 | /lustre/cv/sw/casa/casaci/cvpost128/bamboohome/xml-data/build-dir/PIPESPECS-TESTPIPEMAINCASA674-ML228PY312TEST/casa-build-utils/pipeline/workdir/casa-6.7.4-12-pipeline-2026.3.0.29-py3.12.el8/lib/py/lib/python3.12/site-packages/casaplotms/private/plotms_pb2.py:604: DeprecationWarning: Call to deprecated create function FieldDescriptor(). Note: Create unlinked descriptors is going to go away. Please use get/find descriptors from generated code or query the descriptor_pool. |
| 11-Oct-2026 21:56:30 | _descriptor.FieldDescriptor( |
| 11-Oct-2026 21:56:30 | |
| 11-Oct-2026 21:56:30 | ../casa-6.7.4-12-pipeline-2026.3.0.29-py3.12.el8/lib/py/lib/python3.12/site-packages/casaplotms/private/plotms_pb2.py:611: 12 warnings |
| 11-Oct-2026 21:56:30 | /lustre/cv/sw/casa/casaci/cvpost128/bamboohome/xml-data/build-dir/PIPESPECS-TESTPIPEMAINCASA674-ML228PY312TEST/casa-build-utils/pipeline/workdir/casa-6.7.4-12-pipeline-2026.3.0.29-py3.12.el8/lib/py/lib/python3.12/site-packages/casaplotms/private/plotms_pb2.py:611: DeprecationWarning: Call to deprecated create function FieldDescriptor(). Note: Create unlinked descriptors is going to go away. Please use get/find descriptors from generated code or query the descriptor_pool. |
| 11-Oct-2026 21:56:30 | _descriptor.FieldDescriptor( |
| 11-Oct-2026 21:56:30 | |
| 11-Oct-2026 21:56:30 | ../casa-6.7.4-12-pipeline-2026.3.0.29-py3.12.el8/lib/py/lib/python3.12/site-packages/casaplotms/private/plotms_pb2.py:618: 12 warnings |
| 11-Oct-2026 21:56:30 | /lustre/cv/sw/casa/casaci/cvpost128/bamboohome/xml-data/build-dir/PIPESPECS-TESTPIPEMAINCASA674-ML228PY312TEST/casa-build-utils/pipeline/workdir/casa-6.7.4-12-pipeline-2026.3.0.29-py3.12.el8/lib/py/lib/python3.12/site-packages/casaplotms/private/plotms_pb2.py:618: DeprecationWarning: Call to deprecated create function FieldDescriptor(). Note: Create unlinked descriptors is going to go away. Please use get/find descriptors from generated code or query the descriptor_pool. |
| 11-Oct-2026 21:56:30 | _descriptor.FieldDescriptor( |
| 11-Oct-2026 21:56:30 | |
| 11-Oct-2026 21:56:30 | ../casa-6.7.4-12-pipeline-2026.3.0.29-py3.12.el8/lib/py/lib/python3.12/site-packages/casaplotms/private/plotms_pb2.py:625: 12 warnings |
| 11-Oct-2026 21:56:30 | /lustre/cv/sw/casa/casaci/cvpost128/bamboohome/xml-data/build-dir/PIPESPECS-TESTPIPEMAINCASA674-ML228PY312TEST/casa-build-utils/pipeline/workdir/casa-6.7.4-12-pipeline-2026.3.0.29-py3.12.el8/lib/py/lib/python3.12/site-packages/casaplotms/private/plotms_pb2.py:625: DeprecationWarning: Call to deprecated create function FieldDescriptor(). Note: Create unlinked descriptors is going to go away. Please use get/find descriptors from generated code or query the descriptor_pool. |
| 11-Oct-2026 21:56:30 | _descriptor.FieldDescriptor( |
| 11-Oct-2026 21:56:30 | |
| 11-Oct-2026 21:56:30 | ../casa-6.7.4-12-pipeline-2026.3.0.29-py3.12.el8/lib/py/lib/python3.12/site-packages/casaplotms/private/plotms_pb2.py:583: 12 warnings |
| 11-Oct-2026 21:56:30 | /lustre/cv/sw/casa/casaci/cvpost128/bamboohome/xml-data/build-dir/PIPESPECS-TESTPIPEMAINCASA674-ML228PY312TEST/casa-build-utils/pipeline/workdir/casa-6.7.4-12-pipeline-2026.3.0.29-py3.12.el8/lib/py/lib/python3.12/site-packages/casaplotms/private/plotms_pb2.py:583: DeprecationWarning: Call to deprecated create function Descriptor(). Note: Create unlinked descriptors is going to go away. Please use get/find descriptors from generated code or query the descriptor_pool. |
| 11-Oct-2026 21:56:30 | _SETTRANSFORM = _descriptor.Descriptor( |
| 11-Oct-2026 21:56:30 | |
| 11-Oct-2026 21:56:30 | ../casa-6.7.4-12-pipeline-2026.3.0.29-py3.12.el8/lib/py/lib/python3.12/site-packages/casaplotms/private/plotms_pb2.py:656: 12 warnings |
| 11-Oct-2026 21:56:30 | /lustre/cv/sw/casa/casaci/cvpost128/bamboohome/xml-data/build-dir/PIPESPECS-TESTPIPEMAINCASA674-ML228PY312TEST/casa-build-utils/pipeline/workdir/casa-6.7.4-12-pipeline-2026.3.0.29-py3.12.el8/lib/py/lib/python3.12/site-packages/casaplotms/private/plotms_pb2.py:656: DeprecationWarning: Call to deprecated create function FieldDescriptor(). Note: Create unlinked descriptors is going to go away. Please use get/find descriptors from generated code or query the descriptor_pool. |
| 11-Oct-2026 21:56:30 | _descriptor.FieldDescriptor( |
| 11-Oct-2026 21:56:30 | |
| 11-Oct-2026 21:56:30 | ../casa-6.7.4-12-pipeline-2026.3.0.29-py3.12.el8/lib/py/lib/python3.12/site-packages/casaplotms/private/plotms_pb2.py:663: 12 warnings |
| 11-Oct-2026 21:56:30 | /lustre/cv/sw/casa/casaci/cvpost128/bamboohome/xml-data/build-dir/PIPESPECS-TESTPIPEMAINCASA674-ML228PY312TEST/casa-build-utils/pipeline/workdir/casa-6.7.4-12-pipeline-2026.3.0.29-py3.12.el8/lib/py/lib/python3.12/site-packages/casaplotms/private/plotms_pb2.py:663: DeprecationWarning: Call to deprecated create function FieldDescriptor(). Note: Create unlinked descriptors is going to go away. Please use get/find descriptors from generated code or query the descriptor_pool. |
| 11-Oct-2026 21:56:30 | _descriptor.FieldDescriptor( |
| 11-Oct-2026 21:56:30 | |
| 11-Oct-2026 21:56:30 | ../casa-6.7.4-12-pipeline-2026.3.0.29-py3.12.el8/lib/py/lib/python3.12/site-packages/casaplotms/private/plotms_pb2.py:670: 12 warnings |
| 11-Oct-2026 21:56:30 | /lustre/cv/sw/casa/casaci/cvpost128/bamboohome/xml-data/build-dir/PIPESPECS-TESTPIPEMAINCASA674-ML228PY312TEST/casa-build-utils/pipeline/workdir/casa-6.7.4-12-pipeline-2026.3.0.29-py3.12.el8/lib/py/lib/python3.12/site-packages/casaplotms/private/plotms_pb2.py:670: DeprecationWarning: Call to deprecated create function FieldDescriptor(). Note: Create unlinked descriptors is going to go away. Please use get/find descriptors from generated code or query the descriptor_pool. |
| 11-Oct-2026 21:56:30 | _descriptor.FieldDescriptor( |
| 11-Oct-2026 21:56:30 | |
| 11-Oct-2026 21:56:30 | ../casa-6.7.4-12-pipeline-2026.3.0.29-py3.12.el8/lib/py/lib/python3.12/site-packages/casaplotms/private/plotms_pb2.py:677: 12 warnings |
| 11-Oct-2026 21:56:30 | /lustre/cv/sw/casa/casaci/cvpost128/bamboohome/xml-data/build-dir/PIPESPECS-TESTPIPEMAINCASA674-ML228PY312TEST/casa-build-utils/pipeline/workdir/casa-6.7.4-12-pipeline-2026.3.0.29-py3.12.el8/lib/py/lib/python3.12/site-packages/casaplotms/private/plotms_pb2.py:677: DeprecationWarning: Call to deprecated create function FieldDescriptor(). Note: Create unlinked descriptors is going to go away. Please use get/find descriptors from generated code or query the descriptor_pool. |
| 11-Oct-2026 21:56:30 | _descriptor.FieldDescriptor( |
| 11-Oct-2026 21:56:30 | |
| 11-Oct-2026 21:56:30 | ../casa-6.7.4-12-pipeline-2026.3.0.29-py3.12.el8/lib/py/lib/python3.12/site-packages/casaplotms/private/plotms_pb2.py:649: 12 warnings |
| 11-Oct-2026 21:56:30 | /lustre/cv/sw/casa/casaci/cvpost128/bamboohome/xml-data/build-dir/PIPESPECS-TESTPIPEMAINCASA674-ML228PY312TEST/casa-build-utils/pipeline/workdir/casa-6.7.4-12-pipeline-2026.3.0.29-py3.12.el8/lib/py/lib/python3.12/site-packages/casaplotms/private/plotms_pb2.py:649: DeprecationWarning: Call to deprecated create function Descriptor(). Note: Create unlinked descriptors is going to go away. Please use get/find descriptors from generated code or query the descriptor_pool. |
| 11-Oct-2026 21:56:30 | _SETCALIBRATION = _descriptor.Descriptor( |
| 11-Oct-2026 21:56:30 | |
| 11-Oct-2026 21:56:30 | ../casa-6.7.4-12-pipeline-2026.3.0.29-py3.12.el8/lib/py/lib/python3.12/site-packages/casaplotms/private/plotms_pb2.py:708: 12 warnings |
| 11-Oct-2026 21:56:30 | /lustre/cv/sw/casa/casaci/cvpost128/bamboohome/xml-data/build-dir/PIPESPECS-TESTPIPEMAINCASA674-ML228PY312TEST/casa-build-utils/pipeline/workdir/casa-6.7.4-12-pipeline-2026.3.0.29-py3.12.el8/lib/py/lib/python3.12/site-packages/casaplotms/private/plotms_pb2.py:708: DeprecationWarning: Call to deprecated create function FieldDescriptor(). Note: Create unlinked descriptors is going to go away. Please use get/find descriptors from generated code or query the descriptor_pool. |
| 11-Oct-2026 21:56:30 | _descriptor.FieldDescriptor( |
| 11-Oct-2026 21:56:30 | |
| 11-Oct-2026 21:56:30 | ../casa-6.7.4-12-pipeline-2026.3.0.29-py3.12.el8/lib/py/lib/python3.12/site-packages/casaplotms/private/plotms_pb2.py:715: 12 warnings |
| 11-Oct-2026 21:56:30 | /lustre/cv/sw/casa/casaci/cvpost128/bamboohome/xml-data/build-dir/PIPESPECS-TESTPIPEMAINCASA674-ML228PY312TEST/casa-build-utils/pipeline/workdir/casa-6.7.4-12-pipeline-2026.3.0.29-py3.12.el8/lib/py/lib/python3.12/site-packages/casaplotms/private/plotms_pb2.py:715: DeprecationWarning: Call to deprecated create function FieldDescriptor(). Note: Create unlinked descriptors is going to go away. Please use get/find descriptors from generated code or query the descriptor_pool. |
| 11-Oct-2026 21:56:30 | _descriptor.FieldDescriptor( |
| 11-Oct-2026 21:56:30 | |
| 11-Oct-2026 21:56:30 | ../casa-6.7.4-12-pipeline-2026.3.0.29-py3.12.el8/lib/py/lib/python3.12/site-packages/casaplotms/private/plotms_pb2.py:722: 12 warnings |
| 11-Oct-2026 21:56:30 | /lustre/cv/sw/casa/casaci/cvpost128/bamboohome/xml-data/build-dir/PIPESPECS-TESTPIPEMAINCASA674-ML228PY312TEST/casa-build-utils/pipeline/workdir/casa-6.7.4-12-pipeline-2026.3.0.29-py3.12.el8/lib/py/lib/python3.12/site-packages/casaplotms/private/plotms_pb2.py:722: DeprecationWarning: Call to deprecated create function FieldDescriptor(). Note: Create unlinked descriptors is going to go away. Please use get/find descriptors from generated code or query the descriptor_pool. |
| 11-Oct-2026 21:56:30 | _descriptor.FieldDescriptor( |
| 11-Oct-2026 21:56:30 | |
| 11-Oct-2026 21:56:30 | ../casa-6.7.4-12-pipeline-2026.3.0.29-py3.12.el8/lib/py/lib/python3.12/site-packages/casaplotms/private/plotms_pb2.py:729: 12 warnings |
| 11-Oct-2026 21:56:30 | /lustre/cv/sw/casa/casaci/cvpost128/bamboohome/xml-data/build-dir/PIPESPECS-TESTPIPEMAINCASA674-ML228PY312TEST/casa-build-utils/pipeline/workdir/casa-6.7.4-12-pipeline-2026.3.0.29-py3.12.el8/lib/py/lib/python3.12/site-packages/casaplotms/private/plotms_pb2.py:729: DeprecationWarning: Call to deprecated create function FieldDescriptor(). Note: Create unlinked descriptors is going to go away. Please use get/find descriptors from generated code or query the descriptor_pool. |
| 11-Oct-2026 21:56:30 | _descriptor.FieldDescriptor( |
| 11-Oct-2026 21:56:30 | |
| 11-Oct-2026 21:56:30 | ../casa-6.7.4-12-pipeline-2026.3.0.29-py3.12.el8/lib/py/lib/python3.12/site-packages/casaplotms/private/plotms_pb2.py:736: 12 warnings |
| 11-Oct-2026 21:56:30 | /lustre/cv/sw/casa/casaci/cvpost128/bamboohome/xml-data/build-dir/PIPESPECS-TESTPIPEMAINCASA674-ML228PY312TEST/casa-build-utils/pipeline/workdir/casa-6.7.4-12-pipeline-2026.3.0.29-py3.12.el8/lib/py/lib/python3.12/site-packages/casaplotms/private/plotms_pb2.py:736: DeprecationWarning: Call to deprecated create function FieldDescriptor(). Note: Create unlinked descriptors is going to go away. Please use get/find descriptors from generated code or query the descriptor_pool. |
| 11-Oct-2026 21:56:30 | _descriptor.FieldDescriptor( |
| 11-Oct-2026 21:56:30 | |
| 11-Oct-2026 21:56:30 | ../casa-6.7.4-12-pipeline-2026.3.0.29-py3.12.el8/lib/py/lib/python3.12/site-packages/casaplotms/private/plotms_pb2.py:743: 12 warnings |
| 11-Oct-2026 21:56:30 | /lustre/cv/sw/casa/casaci/cvpost128/bamboohome/xml-data/build-dir/PIPESPECS-TESTPIPEMAINCASA674-ML228PY312TEST/casa-build-utils/pipeline/workdir/casa-6.7.4-12-pipeline-2026.3.0.29-py3.12.el8/lib/py/lib/python3.12/site-packages/casaplotms/private/plotms_pb2.py:743: DeprecationWarning: Call to deprecated create function FieldDescriptor(). Note: Create unlinked descriptors is going to go away. Please use get/find descriptors from generated code or query the descriptor_pool. |
| 11-Oct-2026 21:56:30 | _descriptor.FieldDescriptor( |
| 11-Oct-2026 21:56:30 | |
| 11-Oct-2026 21:56:30 | ../casa-6.7.4-12-pipeline-2026.3.0.29-py3.12.el8/lib/py/lib/python3.12/site-packages/casaplotms/private/plotms_pb2.py:750: 12 warnings |
| 11-Oct-2026 21:56:30 | /lustre/cv/sw/casa/casaci/cvpost128/bamboohome/xml-data/build-dir/PIPESPECS-TESTPIPEMAINCASA674-ML228PY312TEST/casa-build-utils/pipeline/workdir/casa-6.7.4-12-pipeline-2026.3.0.29-py3.12.el8/lib/py/lib/python3.12/site-packages/casaplotms/private/plotms_pb2.py:750: DeprecationWarning: Call to deprecated create function FieldDescriptor(). Note: Create unlinked descriptors is going to go away. Please use get/find descriptors from generated code or query the descriptor_pool. |
| 11-Oct-2026 21:56:30 | _descriptor.FieldDescriptor( |
| 11-Oct-2026 21:56:30 | |
| 11-Oct-2026 21:56:30 | ../casa-6.7.4-12-pipeline-2026.3.0.29-py3.12.el8/lib/py/lib/python3.12/site-packages/casaplotms/private/plotms_pb2.py:757: 12 warnings |
| 11-Oct-2026 21:56:30 | /lustre/cv/sw/casa/casaci/cvpost128/bamboohome/xml-data/build-dir/PIPESPECS-TESTPIPEMAINCASA674-ML228PY312TEST/casa-build-utils/pipeline/workdir/casa-6.7.4-12-pipeline-2026.3.0.29-py3.12.el8/lib/py/lib/python3.12/site-packages/casaplotms/private/plotms_pb2.py:757: DeprecationWarning: Call to deprecated create function FieldDescriptor(). Note: Create unlinked descriptors is going to go away. Please use get/find descriptors from generated code or query the descriptor_pool. |
| 11-Oct-2026 21:56:30 | _descriptor.FieldDescriptor( |
| 11-Oct-2026 21:56:30 | |
| 11-Oct-2026 21:56:30 | ../casa-6.7.4-12-pipeline-2026.3.0.29-py3.12.el8/lib/py/lib/python3.12/site-packages/casaplotms/private/plotms_pb2.py:764: 12 warnings |
| 11-Oct-2026 21:56:30 | /lustre/cv/sw/casa/casaci/cvpost128/bamboohome/xml-data/build-dir/PIPESPECS-TESTPIPEMAINCASA674-ML228PY312TEST/casa-build-utils/pipeline/workdir/casa-6.7.4-12-pipeline-2026.3.0.29-py3.12.el8/lib/py/lib/python3.12/site-packages/casaplotms/private/plotms_pb2.py:764: DeprecationWarning: Call to deprecated create function FieldDescriptor(). Note: Create unlinked descriptors is going to go away. Please use get/find descriptors from generated code or query the descriptor_pool. |
| 11-Oct-2026 21:56:30 | _descriptor.FieldDescriptor( |
| 11-Oct-2026 21:56:30 | |
| 11-Oct-2026 21:56:30 | ../casa-6.7.4-12-pipeline-2026.3.0.29-py3.12.el8/lib/py/lib/python3.12/site-packages/casaplotms/private/plotms_pb2.py:771: 12 warnings |
| 11-Oct-2026 21:56:30 | /lustre/cv/sw/casa/casaci/cvpost128/bamboohome/xml-data/build-dir/PIPESPECS-TESTPIPEMAINCASA674-ML228PY312TEST/casa-build-utils/pipeline/workdir/casa-6.7.4-12-pipeline-2026.3.0.29-py3.12.el8/lib/py/lib/python3.12/site-packages/casaplotms/private/plotms_pb2.py:771: DeprecationWarning: Call to deprecated create function FieldDescriptor(). Note: Create unlinked descriptors is going to go away. Please use get/find descriptors from generated code or query the descriptor_pool. |
| 11-Oct-2026 21:56:30 | _descriptor.FieldDescriptor( |
| 11-Oct-2026 21:56:30 | |
| 11-Oct-2026 21:56:30 | ../casa-6.7.4-12-pipeline-2026.3.0.29-py3.12.el8/lib/py/lib/python3.12/site-packages/casaplotms/private/plotms_pb2.py:701: 12 warnings |
| 11-Oct-2026 21:56:30 | /lustre/cv/sw/casa/casaci/cvpost128/bamboohome/xml-data/build-dir/PIPESPECS-TESTPIPEMAINCASA674-ML228PY312TEST/casa-build-utils/pipeline/workdir/casa-6.7.4-12-pipeline-2026.3.0.29-py3.12.el8/lib/py/lib/python3.12/site-packages/casaplotms/private/plotms_pb2.py:701: DeprecationWarning: Call to deprecated create function Descriptor(). Note: Create unlinked descriptors is going to go away. Please use get/find descriptors from generated code or query the descriptor_pool. |
| 11-Oct-2026 21:56:30 | _SETFLAGEXTENSION = _descriptor.Descriptor( |
| 11-Oct-2026 21:56:30 | |
| 11-Oct-2026 21:56:30 | ../casa-6.7.4-12-pipeline-2026.3.0.29-py3.12.el8/lib/py/lib/python3.12/site-packages/casaplotms/private/plotms_pb2.py:802: 12 warnings |
| 11-Oct-2026 21:56:30 | /lustre/cv/sw/casa/casaci/cvpost128/bamboohome/xml-data/build-dir/PIPESPECS-TESTPIPEMAINCASA674-ML228PY312TEST/casa-build-utils/pipeline/workdir/casa-6.7.4-12-pipeline-2026.3.0.29-py3.12.el8/lib/py/lib/python3.12/site-packages/casaplotms/private/plotms_pb2.py:802: DeprecationWarning: Call to deprecated create function FieldDescriptor(). Note: Create unlinked descriptors is going to go away. Please use get/find descriptors from generated code or query the descriptor_pool. |
| 11-Oct-2026 21:56:30 | _descriptor.FieldDescriptor( |
| 11-Oct-2026 21:56:30 | |
| 11-Oct-2026 21:56:30 | ../casa-6.7.4-12-pipeline-2026.3.0.29-py3.12.el8/lib/py/lib/python3.12/site-packages/casaplotms/private/plotms_pb2.py:795: 12 warnings |
| 11-Oct-2026 21:56:30 | /lustre/cv/sw/casa/casaci/cvpost128/bamboohome/xml-data/build-dir/PIPESPECS-TESTPIPEMAINCASA674-ML228PY312TEST/casa-build-utils/pipeline/workdir/casa-6.7.4-12-pipeline-2026.3.0.29-py3.12.el8/lib/py/lib/python3.12/site-packages/casaplotms/private/plotms_pb2.py:795: DeprecationWarning: Call to deprecated create function Descriptor(). Note: Create unlinked descriptors is going to go away. Please use get/find descriptors from generated code or query the descriptor_pool. |
| 11-Oct-2026 21:56:30 | _EXPORTRANGE = _descriptor.Descriptor( |
| 11-Oct-2026 21:56:30 | |
| 11-Oct-2026 21:56:30 | ../casa-6.7.4-12-pipeline-2026.3.0.29-py3.12.el8/lib/py/lib/python3.12/site-packages/casaplotms/private/plotms_pb2.py:833: 12 warnings |
| 11-Oct-2026 21:56:30 | /lustre/cv/sw/casa/casaci/cvpost128/bamboohome/xml-data/build-dir/PIPESPECS-TESTPIPEMAINCASA674-ML228PY312TEST/casa-build-utils/pipeline/workdir/casa-6.7.4-12-pipeline-2026.3.0.29-py3.12.el8/lib/py/lib/python3.12/site-packages/casaplotms/private/plotms_pb2.py:833: DeprecationWarning: Call to deprecated create function FieldDescriptor(). Note: Create unlinked descriptors is going to go away. Please use get/find descriptors from generated code or query the descriptor_pool. |
| 11-Oct-2026 21:56:30 | _descriptor.FieldDescriptor( |
| 11-Oct-2026 21:56:30 | |
| 11-Oct-2026 21:56:30 | ../casa-6.7.4-12-pipeline-2026.3.0.29-py3.12.el8/lib/py/lib/python3.12/site-packages/casaplotms/private/plotms_pb2.py:840: 12 warnings |
| 11-Oct-2026 21:56:30 | /lustre/cv/sw/casa/casaci/cvpost128/bamboohome/xml-data/build-dir/PIPESPECS-TESTPIPEMAINCASA674-ML228PY312TEST/casa-build-utils/pipeline/workdir/casa-6.7.4-12-pipeline-2026.3.0.29-py3.12.el8/lib/py/lib/python3.12/site-packages/casaplotms/private/plotms_pb2.py:840: DeprecationWarning: Call to deprecated create function FieldDescriptor(). Note: Create unlinked descriptors is going to go away. Please use get/find descriptors from generated code or query the descriptor_pool. |
| 11-Oct-2026 21:56:30 | _descriptor.FieldDescriptor( |
| 11-Oct-2026 21:56:30 | |
| 11-Oct-2026 21:56:30 | ../casa-6.7.4-12-pipeline-2026.3.0.29-py3.12.el8/lib/py/lib/python3.12/site-packages/casaplotms/private/plotms_pb2.py:847: 12 warnings |
| 11-Oct-2026 21:56:30 | /lustre/cv/sw/casa/casaci/cvpost128/bamboohome/xml-data/build-dir/PIPESPECS-TESTPIPEMAINCASA674-ML228PY312TEST/casa-build-utils/pipeline/workdir/casa-6.7.4-12-pipeline-2026.3.0.29-py3.12.el8/lib/py/lib/python3.12/site-packages/casaplotms/private/plotms_pb2.py:847: DeprecationWarning: Call to deprecated create function FieldDescriptor(). Note: Create unlinked descriptors is going to go away. Please use get/find descriptors from generated code or query the descriptor_pool. |
| 11-Oct-2026 21:56:30 | _descriptor.FieldDescriptor( |
| 11-Oct-2026 21:56:30 | |
| 11-Oct-2026 21:56:30 | ../casa-6.7.4-12-pipeline-2026.3.0.29-py3.12.el8/lib/py/lib/python3.12/site-packages/casaplotms/private/plotms_pb2.py:854: 12 warnings |
| 11-Oct-2026 21:56:30 | /lustre/cv/sw/casa/casaci/cvpost128/bamboohome/xml-data/build-dir/PIPESPECS-TESTPIPEMAINCASA674-ML228PY312TEST/casa-build-utils/pipeline/workdir/casa-6.7.4-12-pipeline-2026.3.0.29-py3.12.el8/lib/py/lib/python3.12/site-packages/casaplotms/private/plotms_pb2.py:854: DeprecationWarning: Call to deprecated create function FieldDescriptor(). Note: Create unlinked descriptors is going to go away. Please use get/find descriptors from generated code or query the descriptor_pool. |
| 11-Oct-2026 21:56:30 | _descriptor.FieldDescriptor( |
| 11-Oct-2026 21:56:30 | |
| 11-Oct-2026 21:56:30 | ../casa-6.7.4-12-pipeline-2026.3.0.29-py3.12.el8/lib/py/lib/python3.12/site-packages/casaplotms/private/plotms_pb2.py:861: 12 warnings |
| 11-Oct-2026 21:56:30 | /lustre/cv/sw/casa/casaci/cvpost128/bamboohome/xml-data/build-dir/PIPESPECS-TESTPIPEMAINCASA674-ML228PY312TEST/casa-build-utils/pipeline/workdir/casa-6.7.4-12-pipeline-2026.3.0.29-py3.12.el8/lib/py/lib/python3.12/site-packages/casaplotms/private/plotms_pb2.py:861: DeprecationWarning: Call to deprecated create function FieldDescriptor(). Note: Create unlinked descriptors is going to go away. Please use get/find descriptors from generated code or query the descriptor_pool. |
| 11-Oct-2026 21:56:30 | _descriptor.FieldDescriptor( |
| 11-Oct-2026 21:56:30 | |
| 11-Oct-2026 21:56:30 | ../casa-6.7.4-12-pipeline-2026.3.0.29-py3.12.el8/lib/py/lib/python3.12/site-packages/casaplotms/private/plotms_pb2.py:868: 12 warnings |
| 11-Oct-2026 21:56:30 | /lustre/cv/sw/casa/casaci/cvpost128/bamboohome/xml-data/build-dir/PIPESPECS-TESTPIPEMAINCASA674-ML228PY312TEST/casa-build-utils/pipeline/workdir/casa-6.7.4-12-pipeline-2026.3.0.29-py3.12.el8/lib/py/lib/python3.12/site-packages/casaplotms/private/plotms_pb2.py:868: DeprecationWarning: Call to deprecated create function FieldDescriptor(). Note: Create unlinked descriptors is going to go away. Please use get/find descriptors from generated code or query the descriptor_pool. |
| 11-Oct-2026 21:56:30 | _descriptor.FieldDescriptor( |
| 11-Oct-2026 21:56:30 | |
| 11-Oct-2026 21:56:30 | ../casa-6.7.4-12-pipeline-2026.3.0.29-py3.12.el8/lib/py/lib/python3.12/site-packages/casaplotms/private/plotms_pb2.py:875: 12 warnings |
| 11-Oct-2026 21:56:30 | /lustre/cv/sw/casa/casaci/cvpost128/bamboohome/xml-data/build-dir/PIPESPECS-TESTPIPEMAINCASA674-ML228PY312TEST/casa-build-utils/pipeline/workdir/casa-6.7.4-12-pipeline-2026.3.0.29-py3.12.el8/lib/py/lib/python3.12/site-packages/casaplotms/private/plotms_pb2.py:875: DeprecationWarning: Call to deprecated create function FieldDescriptor(). Note: Create unlinked descriptors is going to go away. Please use get/find descriptors from generated code or query the descriptor_pool. |
| 11-Oct-2026 21:56:30 | _descriptor.FieldDescriptor( |
| 11-Oct-2026 21:56:30 | |
| 11-Oct-2026 21:56:30 | ../casa-6.7.4-12-pipeline-2026.3.0.29-py3.12.el8/lib/py/lib/python3.12/site-packages/casaplotms/private/plotms_pb2.py:882: 12 warnings |
| 11-Oct-2026 21:56:30 | /lustre/cv/sw/casa/casaci/cvpost128/bamboohome/xml-data/build-dir/PIPESPECS-TESTPIPEMAINCASA674-ML228PY312TEST/casa-build-utils/pipeline/workdir/casa-6.7.4-12-pipeline-2026.3.0.29-py3.12.el8/lib/py/lib/python3.12/site-packages/casaplotms/private/plotms_pb2.py:882: DeprecationWarning: Call to deprecated create function FieldDescriptor(). Note: Create unlinked descriptors is going to go away. Please use get/find descriptors from generated code or query the descriptor_pool. |
| 11-Oct-2026 21:56:30 | _descriptor.FieldDescriptor( |
| 11-Oct-2026 21:56:30 | |
| 11-Oct-2026 21:56:30 | ../casa-6.7.4-12-pipeline-2026.3.0.29-py3.12.el8/lib/py/lib/python3.12/site-packages/casaplotms/private/plotms_pb2.py:889: 12 warnings |
| 11-Oct-2026 21:56:30 | /lustre/cv/sw/casa/casaci/cvpost128/bamboohome/xml-data/build-dir/PIPESPECS-TESTPIPEMAINCASA674-ML228PY312TEST/casa-build-utils/pipeline/workdir/casa-6.7.4-12-pipeline-2026.3.0.29-py3.12.el8/lib/py/lib/python3.12/site-packages/casaplotms/private/plotms_pb2.py:889: DeprecationWarning: Call to deprecated create function FieldDescriptor(). Note: Create unlinked descriptors is going to go away. Please use get/find descriptors from generated code or query the descriptor_pool. |
| 11-Oct-2026 21:56:30 | _descriptor.FieldDescriptor( |
| 11-Oct-2026 21:56:30 | |
| 11-Oct-2026 21:56:30 | ../casa-6.7.4-12-pipeline-2026.3.0.29-py3.12.el8/lib/py/lib/python3.12/site-packages/casaplotms/private/plotms_pb2.py:826: 12 warnings |
| 11-Oct-2026 21:56:30 | /lustre/cv/sw/casa/casaci/cvpost128/bamboohome/xml-data/build-dir/PIPESPECS-TESTPIPEMAINCASA674-ML228PY312TEST/casa-build-utils/pipeline/workdir/casa-6.7.4-12-pipeline-2026.3.0.29-py3.12.el8/lib/py/lib/python3.12/site-packages/casaplotms/private/plotms_pb2.py:826: DeprecationWarning: Call to deprecated create function Descriptor(). Note: Create unlinked descriptors is going to go away. Please use get/find descriptors from generated code or query the descriptor_pool. |
| 11-Oct-2026 21:56:30 | _SETITERATE = _descriptor.Descriptor( |
| 11-Oct-2026 21:56:30 | |
| 11-Oct-2026 21:56:30 | ../casa-6.7.4-12-pipeline-2026.3.0.29-py3.12.el8/lib/py/lib/python3.12/site-packages/casaplotms/private/plotms_pb2.py:920: 12 warnings |
| 11-Oct-2026 21:56:30 | /lustre/cv/sw/casa/casaci/cvpost128/bamboohome/xml-data/build-dir/PIPESPECS-TESTPIPEMAINCASA674-ML228PY312TEST/casa-build-utils/pipeline/workdir/casa-6.7.4-12-pipeline-2026.3.0.29-py3.12.el8/lib/py/lib/python3.12/site-packages/casaplotms/private/plotms_pb2.py:920: DeprecationWarning: Call to deprecated create function FieldDescriptor(). Note: Create unlinked descriptors is going to go away. Please use get/find descriptors from generated code or query the descriptor_pool. |
| 11-Oct-2026 21:56:30 | _descriptor.FieldDescriptor( |
| 11-Oct-2026 21:56:30 | |
| 11-Oct-2026 21:56:30 | ../casa-6.7.4-12-pipeline-2026.3.0.29-py3.12.el8/lib/py/lib/python3.12/site-packages/casaplotms/private/plotms_pb2.py:927: 12 warnings |
| 11-Oct-2026 21:56:30 | /lustre/cv/sw/casa/casaci/cvpost128/bamboohome/xml-data/build-dir/PIPESPECS-TESTPIPEMAINCASA674-ML228PY312TEST/casa-build-utils/pipeline/workdir/casa-6.7.4-12-pipeline-2026.3.0.29-py3.12.el8/lib/py/lib/python3.12/site-packages/casaplotms/private/plotms_pb2.py:927: DeprecationWarning: Call to deprecated create function FieldDescriptor(). Note: Create unlinked descriptors is going to go away. Please use get/find descriptors from generated code or query the descriptor_pool. |
| 11-Oct-2026 21:56:30 | _descriptor.FieldDescriptor( |
| 11-Oct-2026 21:56:30 | |
| 11-Oct-2026 21:56:30 | ../casa-6.7.4-12-pipeline-2026.3.0.29-py3.12.el8/lib/py/lib/python3.12/site-packages/casaplotms/private/plotms_pb2.py:934: 12 warnings |
| 11-Oct-2026 21:56:30 | /lustre/cv/sw/casa/casaci/cvpost128/bamboohome/xml-data/build-dir/PIPESPECS-TESTPIPEMAINCASA674-ML228PY312TEST/casa-build-utils/pipeline/workdir/casa-6.7.4-12-pipeline-2026.3.0.29-py3.12.el8/lib/py/lib/python3.12/site-packages/casaplotms/private/plotms_pb2.py:934: DeprecationWarning: Call to deprecated create function FieldDescriptor(). Note: Create unlinked descriptors is going to go away. Please use get/find descriptors from generated code or query the descriptor_pool. |
| 11-Oct-2026 21:56:30 | _descriptor.FieldDescriptor( |
| 11-Oct-2026 21:56:30 | |
| 11-Oct-2026 21:56:30 | ../casa-6.7.4-12-pipeline-2026.3.0.29-py3.12.el8/lib/py/lib/python3.12/site-packages/casaplotms/private/plotms_pb2.py:913: 12 warnings |
| 11-Oct-2026 21:56:30 | /lustre/cv/sw/casa/casaci/cvpost128/bamboohome/xml-data/build-dir/PIPESPECS-TESTPIPEMAINCASA674-ML228PY312TEST/casa-build-utils/pipeline/workdir/casa-6.7.4-12-pipeline-2026.3.0.29-py3.12.el8/lib/py/lib/python3.12/site-packages/casaplotms/private/plotms_pb2.py:913: DeprecationWarning: Call to deprecated create function Descriptor(). Note: Create unlinked descriptors is going to go away. Please use get/find descriptors from generated code or query the descriptor_pool. |
| 11-Oct-2026 21:56:30 | _SETSTRING = _descriptor.Descriptor( |
| 11-Oct-2026 21:56:30 | |
| 11-Oct-2026 21:56:30 | ../casa-6.7.4-12-pipeline-2026.3.0.29-py3.12.el8/lib/py/lib/python3.12/site-packages/casaplotms/private/plotms_pb2.py:965: 12 warnings |
| 11-Oct-2026 21:56:30 | /lustre/cv/sw/casa/casaci/cvpost128/bamboohome/xml-data/build-dir/PIPESPECS-TESTPIPEMAINCASA674-ML228PY312TEST/casa-build-utils/pipeline/workdir/casa-6.7.4-12-pipeline-2026.3.0.29-py3.12.el8/lib/py/lib/python3.12/site-packages/casaplotms/private/plotms_pb2.py:965: DeprecationWarning: Call to deprecated create function FieldDescriptor(). Note: Create unlinked descriptors is going to go away. Please use get/find descriptors from generated code or query the descriptor_pool. |
| 11-Oct-2026 21:56:30 | _descriptor.FieldDescriptor( |
| 11-Oct-2026 21:56:30 | |
| 11-Oct-2026 21:56:30 | ../casa-6.7.4-12-pipeline-2026.3.0.29-py3.12.el8/lib/py/lib/python3.12/site-packages/casaplotms/private/plotms_pb2.py:972: 12 warnings |
| 11-Oct-2026 21:56:30 | /lustre/cv/sw/casa/casaci/cvpost128/bamboohome/xml-data/build-dir/PIPESPECS-TESTPIPEMAINCASA674-ML228PY312TEST/casa-build-utils/pipeline/workdir/casa-6.7.4-12-pipeline-2026.3.0.29-py3.12.el8/lib/py/lib/python3.12/site-packages/casaplotms/private/plotms_pb2.py:972: DeprecationWarning: Call to deprecated create function FieldDescriptor(). Note: Create unlinked descriptors is going to go away. Please use get/find descriptors from generated code or query the descriptor_pool. |
| 11-Oct-2026 21:56:30 | _descriptor.FieldDescriptor( |
| 11-Oct-2026 21:56:30 | |
| 11-Oct-2026 21:56:30 | ../casa-6.7.4-12-pipeline-2026.3.0.29-py3.12.el8/lib/py/lib/python3.12/site-packages/casaplotms/private/plotms_pb2.py:979: 12 warnings |
| 11-Oct-2026 21:56:30 | /lustre/cv/sw/casa/casaci/cvpost128/bamboohome/xml-data/build-dir/PIPESPECS-TESTPIPEMAINCASA674-ML228PY312TEST/casa-build-utils/pipeline/workdir/casa-6.7.4-12-pipeline-2026.3.0.29-py3.12.el8/lib/py/lib/python3.12/site-packages/casaplotms/private/plotms_pb2.py:979: DeprecationWarning: Call to deprecated create function FieldDescriptor(). Note: Create unlinked descriptors is going to go away. Please use get/find descriptors from generated code or query the descriptor_pool. |
| 11-Oct-2026 21:56:30 | _descriptor.FieldDescriptor( |
| 11-Oct-2026 21:56:30 | |
| 11-Oct-2026 21:56:30 | tests/regression/fast/alma_sd_fast_test.py::test_uid___A002_X85c183_X36f_SPW15_23__PPR__regression |
| 11-Oct-2026 21:56:30 | tests/regression/fast/nobeyama_sd_fast_test.py::test_mg2_20170525142607_180419__procedure_hsdn_calimage__regression |
| 11-Oct-2026 21:56:30 | /lustre/cv/sw/casa/casaci/cvpost128/bamboohome/xml-data/build-dir/PIPESPECS-TESTPIPEMAINCASA674-ML228PY312TEST/casa-build-utils/pipeline/workdir/casa-6.7.4-12-pipeline-2026.3.0.29-py3.12.el8/lib/py/lib/python3.12/multiprocessing/popen_fork.py:66: DeprecationWarning: This process (pid=3846763) is multi-threaded, use of fork() may lead to deadlocks in the child. |
| 11-Oct-2026 21:56:30 | self.pid = os.fork() |
| 11-Oct-2026 21:56:30 | |
| 11-Oct-2026 21:56:30 | tests/regression/fast/alma_if_fast_test.py::test_uid___A002_Xc46ab2_X15ae_repSPW_spw16_17_small__PPR__regression |
| 11-Oct-2026 21:56:30 | /lustre/cv/sw/casa/casaci/cvpost128/bamboohome/xml-data/build-dir/PIPESPECS-TESTPIPEMAINCASA674-ML228PY312TEST/casa-build-utils/pipeline/workdir/casa-6.7.4-12-pipeline-2026.3.0.29-py3.12.el8/lib/py/lib/python3.12/multiprocessing/popen_fork.py:66: DeprecationWarning: This process (pid=3846713) is multi-threaded, use of fork() may lead to deadlocks in the child. |
| 11-Oct-2026 21:56:30 | self.pid = os.fork() |
| 11-Oct-2026 21:56:30 | |
| 11-Oct-2026 21:56:30 | tests/regression/fast/nobeyama_sd_fast_test.py::test_mg2_20170525142607_180419__PPR__regression |
| 11-Oct-2026 21:56:30 | tests/regression/fast/vla_fast_test.py::test_13A_537__procedure_hifv__regression |
| 11-Oct-2026 21:56:30 | /lustre/cv/sw/casa/casaci/cvpost128/bamboohome/xml-data/build-dir/PIPESPECS-TESTPIPEMAINCASA674-ML228PY312TEST/casa-build-utils/pipeline/workdir/casa-6.7.4-12-pipeline-2026.3.0.29-py3.12.el8/lib/py/lib/python3.12/multiprocessing/popen_fork.py:66: DeprecationWarning: This process (pid=3846717) is multi-threaded, use of fork() may lead to deadlocks in the child. |
| 11-Oct-2026 21:56:30 | self.pid = os.fork() |
| 11-Oct-2026 21:56:30 | |
| 11-Oct-2026 21:56:30 | tests/regression/fast/alma_if_fast_test.py::test_uid___A002_Xc46ab2_X15ae__selfcal_restore_procedure_hifa_image__regression |
| 11-Oct-2026 21:56:30 | /lustre/cv/sw/casa/casaci/cvpost128/bamboohome/xml-data/build-dir/PIPESPECS-TESTPIPEMAINCASA674-ML228PY312TEST/casa-build-utils/pipeline/workdir/casa-6.7.4-12-pipeline-2026.3.0.29-py3.12.el8/lib/py/lib/python3.12/multiprocessing/popen_fork.py:66: DeprecationWarning: This process (pid=3846705) is multi-threaded, use of fork() may lead to deadlocks in the child. |
| 11-Oct-2026 21:56:30 | self.pid = os.fork() |
| 11-Oct-2026 21:56:30 | |
| 11-Oct-2026 21:56:30 | tests/regression/fast/vla_fast_test.py::test_13A_537__calibration__PPR__regression |
| 11-Oct-2026 21:56:30 | tests/regression/fast/vla_fast_test.py::test_13A_537__restore__PPR__regression |
| 11-Oct-2026 21:56:30 | /lustre/cv/sw/casa/casaci/cvpost128/bamboohome/xml-data/build-dir/PIPESPECS-TESTPIPEMAINCASA674-ML228PY312TEST/casa-build-utils/pipeline/workdir/casa-6.7.4-12-pipeline-2026.3.0.29-py3.12.el8/lib/py/lib/python3.12/multiprocessing/popen_fork.py:66: DeprecationWarning: This process (pid=3846721) is multi-threaded, use of fork() may lead to deadlocks in the child. |
| 11-Oct-2026 21:56:30 | self.pid = os.fork() |
| 11-Oct-2026 21:56:30 | |
| 11-Oct-2026 21:56:30 | tests/regression/fast/alma_if_fast_test.py::test_E2E6_1_00010_S__uid___A002_Xd0a588_X2239__procedure_hifa_image__regression |
| 11-Oct-2026 21:56:30 | tests/regression/fast/alma_if_fast_test.py::test_csv_3899_eb2_small__procedure_hifa_calimage__regression |
| 11-Oct-2026 21:56:30 | /lustre/cv/sw/casa/casaci/cvpost128/bamboohome/xml-data/build-dir/PIPESPECS-TESTPIPEMAINCASA674-ML228PY312TEST/casa-build-utils/pipeline/workdir/casa-6.7.4-12-pipeline-2026.3.0.29-py3.12.el8/lib/py/lib/python3.12/multiprocessing/popen_fork.py:66: DeprecationWarning: This process (pid=3846691) is multi-threaded, use of fork() may lead to deadlocks in the child. |
| 11-Oct-2026 21:56:30 | self.pid = os.fork() |
| 11-Oct-2026 21:56:30 | |
| 11-Oct-2026 21:56:30 | tests/regression/fast/alma_if_fast_test.py::test_uid___A002_Xef72bb_X9d29__renorm_restore_procedure_hifa_image__regression |
| 11-Oct-2026 21:56:30 | /lustre/cv/sw/casa/casaci/cvpost128/bamboohome/xml-data/build-dir/PIPESPECS-TESTPIPEMAINCASA674-ML228PY312TEST/casa-build-utils/pipeline/workdir/casa-6.7.4-12-pipeline-2026.3.0.29-py3.12.el8/lib/py/lib/python3.12/multiprocessing/popen_fork.py:66: DeprecationWarning: This process (pid=3846754) is multi-threaded, use of fork() may lead to deadlocks in the child. |
| 11-Oct-2026 21:56:30 | self.pid = os.fork() |
| 11-Oct-2026 21:56:30 | |
| 11-Oct-2026 21:56:30 | tests/regression/fast/alma_if_fast_test.py::test_uid___A002_Xc845c0_X7366__cycle5_restore_procedure_hifa_image__regression |
| 11-Oct-2026 21:56:30 | /lustre/cv/sw/casa/casaci/cvpost128/bamboohome/xml-data/build-dir/PIPESPECS-TESTPIPEMAINCASA674-ML228PY312TEST/casa-build-utils/pipeline/workdir/casa-6.7.4-12-pipeline-2026.3.0.29-py3.12.el8/lib/py/lib/python3.12/multiprocessing/popen_fork.py:66: DeprecationWarning: This process (pid=3846745) is multi-threaded, use of fork() may lead to deadlocks in the child. |
| 11-Oct-2026 21:56:30 | self.pid = os.fork() |
| 11-Oct-2026 21:56:30 | |
| 11-Oct-2026 21:56:30 | tests/regression/fast/alma_if_fast_test.py::test_uid___A002_Xee1eb6_Xc58d__procedure_hifa_calsurvey__regression |
| 11-Oct-2026 21:56:30 | tests/regression/fast/alma_sd_fast_test.py::test_uid___A002_X85c183_X36f__procedure_hsd_calimage__regression |
| 11-Oct-2026 21:56:30 | /lustre/cv/sw/casa/casaci/cvpost128/bamboohome/xml-data/build-dir/PIPESPECS-TESTPIPEMAINCASA674-ML228PY312TEST/casa-build-utils/pipeline/workdir/casa-6.7.4-12-pipeline-2026.3.0.29-py3.12.el8/lib/py/lib/python3.12/multiprocessing/popen_fork.py:66: DeprecationWarning: This process (pid=3846709) is multi-threaded, use of fork() may lead to deadlocks in the child. |
| 11-Oct-2026 21:56:30 | self.pid = os.fork() |
| 11-Oct-2026 21:56:30 | |
| 11-Oct-2026 21:56:30 | tests/regression/fast/vla_fast_test.py::test_13A_537__restore__cont_cube_selfcal__regression |
| 11-Oct-2026 21:56:30 | tests/regression/fast/vlass_fast_test.py::test_TSKY0001__vlass_quicklook_regression |
| 11-Oct-2026 21:56:30 | /lustre/cv/sw/casa/casaci/cvpost128/bamboohome/xml-data/build-dir/PIPESPECS-TESTPIPEMAINCASA674-ML228PY312TEST/casa-build-utils/pipeline/workdir/casa-6.7.4-12-pipeline-2026.3.0.29-py3.12.el8/lib/py/lib/python3.12/multiprocessing/popen_fork.py:66: DeprecationWarning: This process (pid=3846699) is multi-threaded, use of fork() may lead to deadlocks in the child. |
| 11-Oct-2026 21:56:30 | self.pid = os.fork() |
| 11-Oct-2026 21:56:30 | |
| 11-Oct-2026 21:56:30 | tests/regression/fast/alma_if_fast_test.py::test_2022_1_00207_S__uid___A001_X2d20_X373d__PPR__regression |
| 11-Oct-2026 21:56:30 | /lustre/cv/sw/casa/casaci/cvpost128/bamboohome/xml-data/build-dir/PIPESPECS-TESTPIPEMAINCASA674-ML228PY312TEST/casa-build-utils/pipeline/workdir/casa-6.7.4-12-pipeline-2026.3.0.29-py3.12.el8/lib/py/lib/python3.12/multiprocessing/popen_fork.py:66: DeprecationWarning: This process (pid=3846695) is multi-threaded, use of fork() may lead to deadlocks in the child. |
| 11-Oct-2026 21:56:30 | self.pid = os.fork() |
| 11-Oct-2026 21:56:30 | |
| 11-Oct-2026 21:56:30 | tests/regression/fast/alma_if_fast_test.py::test_2023_1_00228_S__uid___A002_X1199f9e_X7c24__procedure_hifa_calimage_diffgain__regression |
| 11-Oct-2026 21:56:32 | /lustre/cv/sw/casa/casaci/cvpost128/bamboohome/xml-data/build-dir/PIPESPECS-TESTPIPEMAINCASA674-ML228PY312TEST/casa-build-utils/pipeline/workdir/casa-6.7.4-12-pipeline-2026.3.0.29-py3.12.el8/lib/py/lib/python3.12/multiprocessing/popen_fork.py:66: DeprecationWarning: This process (pid=3846687) is multi-threaded, use of fork() may lead to deadlocks in the child. |
| 11-Oct-2026 21:56:32 | self.pid = os.fork() |
| 11-Oct-2026 21:56:32 | |
| 11-Oct-2026 21:56:32 | -- Docs: https://docs.pytest.org/en/stable/how-to/capture-warnings.html |
| 11-Oct-2026 21:56:32 | - generated xml file: /lustre/cv/sw/casa/casaci/cvpost128/bamboohome/xml-data/build-dir/PIPESPECS-TESTPIPEMAINCASA674-ML228PY312TEST/casa-build-utils/pipeline/workdir/pipeline_regression_test_result.xml - |
| 11-Oct-2026 21:56:32 | =========================== short test summary info ============================ |
| 11-Oct-2026 21:56:32 | FAILED tests/regression/fast/alma_if_fast_test.py::test_csv_3899_eb2_small__procedure_hifa_calimage__regression - @pytest.mark.twelve |
| 11-Oct-2026 21:56:32 | def test_csv_3899_eb2_small__procedure_hifa_calimage__regression(): |
| 11-Oct-2026 21:56:32 | """PIPE-2245: Run small ALMA cal+image regression to cover various heuristics |
| 11-Oct-2026 21:56:32 | |
| 11-Oct-2026 21:56:32 | Recipe name: procedure_hifa_calimage |
| 11-Oct-2026 21:56:32 | Dataset: CSV-3899-EB2-small |
| 11-Oct-2026 21:56:32 | """ |
| 11-Oct-2026 21:56:32 | ref_directory = 'pl-regressiontest/CSV-3899-EB2-small' |
| 11-Oct-2026 21:56:32 | |
| 11-Oct-2026 21:56:32 | pt = PipelineTester( |
| 11-Oct-2026 21:56:32 | visname=['uid___A002_X1181695_X1c6a4_8ant.ms'], |
| 11-Oct-2026 21:56:32 | recipe='procedure_hifa_calimage.xml', |
| 11-Oct-2026 21:56:32 | input_dir=ref_directory, |
| 11-Oct-2026 21:56:32 | expectedoutput_dir=ref_directory, |
| 11-Oct-2026 21:56:32 | ) |
| 11-Oct-2026 21:56:32 | |
| 11-Oct-2026 21:56:32 | > pt.run(omp_num_threads=1) |
| 11-Oct-2026 21:56:32 | |
| 11-Oct-2026 21:56:32 | tests/regression/fast/alma_if_fast_test.py:181: |
| 11-Oct-2026 21:56:32 | _ _ _ _ _ _ _ _ _ _ _ _ _ _ _ _ _ _ _ _ _ _ _ _ _ _ _ _ _ _ _ _ _ _ _ _ _ _ _ _ |
| 11-Oct-2026 21:56:32 | tests/testing_utils.py:381: in run |
| 11-Oct-2026 21:56:32 | self.__compare_results(new_file, default_relative_tolerance) |
| 11-Oct-2026 21:56:32 | _ _ _ _ _ _ _ _ _ _ _ _ _ _ _ _ _ _ _ _ _ _ _ _ _ _ _ _ _ _ _ _ _ _ _ _ _ _ _ _ |
| 11-Oct-2026 21:56:32 | |
| 11-Oct-2026 21:56:32 | self = <tests.testing_utils.PipelineTester object at 0x7f68d8fc4800> |
| 11-Oct-2026 21:56:32 | new_file = 'uid___A002_X1181695_X1c6a4_8ant.ms.NEW.results.txt' |
| 11-Oct-2026 21:56:32 | relative_tolerance = 1e-07 |
| 11-Oct-2026 21:56:32 | |
| 11-Oct-2026 21:56:32 | def __compare_results(self, new_file: str, relative_tolerance: float) -> None: |
| 11-Oct-2026 21:56:32 | """ |
| 11-Oct-2026 21:56:32 | Compare results between new one loaded from file and old one. |
| 11-Oct-2026 21:56:32 | |
| 11-Oct-2026 21:56:32 | Args: |
| 11-Oct-2026 21:56:32 | new_file : file path of new results |
| 11-Oct-2026 21:56:32 | relative_tolerance : relative tolerance of output value |
| 11-Oct-2026 21:56:32 | """ |
| 11-Oct-2026 21:56:32 | with open(self.expectedoutput_file) as expected_fd, open(new_file) as new_fd: |
| 11-Oct-2026 21:56:32 | expected_results = expected_fd.readlines() |
| 11-Oct-2026 21:56:32 | new_results = new_fd.readlines() |
| 11-Oct-2026 21:56:32 | errors = [] |
| 11-Oct-2026 21:56:32 | worst_diff = (0, 0) |
| 11-Oct-2026 21:56:32 | worst_percent_diff = (0, 0) |
| 11-Oct-2026 21:56:32 | for old, new in zip(expected_results, new_results): |
| 11-Oct-2026 21:56:32 | try: |
| 11-Oct-2026 21:56:32 | oldkey, oldval, tol = self.__sanitize_results_string(old) |
| 11-Oct-2026 21:56:32 | newkey, newval, _ = self.__sanitize_results_string(new) |
| 11-Oct-2026 21:56:32 | except ValueError as e: |
| 11-Oct-2026 21:56:32 | errorstr = "The results: {0} could not be parsed. Error: {1}".format(new, str(e)) |
| 11-Oct-2026 21:56:32 | errors.append(errorstr) |
| 11-Oct-2026 21:56:32 | continue |
| 11-Oct-2026 21:56:32 | |
| 11-Oct-2026 21:56:32 | assert oldkey == newkey, f"Expected key {oldkey} does not match new key {newkey}." |
| 11-Oct-2026 21:56:32 | tolerance = tol if tol else relative_tolerance |
| 11-Oct-2026 21:56:32 | if newval is not None: |
| 11-Oct-2026 21:56:32 | LOG.info('Comparing %s to %s with a rel. tolerance of %s', oldval, newval, tolerance) |
| 11-Oct-2026 21:56:32 | if oldval != pytest.approx(newval, rel=tolerance): |
| 11-Oct-2026 21:56:32 | diff = oldval-newval |
| 11-Oct-2026 21:56:32 | percent_diff = (oldval-newval)/oldval * 100 if oldval != 0 else 100 |
| 11-Oct-2026 21:56:32 | if abs(diff) > abs(worst_diff[0]): |
| 11-Oct-2026 21:56:32 | worst_diff = diff, oldkey |
| 11-Oct-2026 21:56:32 | if abs(percent_diff) > abs(worst_percent_diff[0]): |
| 11-Oct-2026 21:56:32 | worst_percent_diff = percent_diff, oldkey |
| 11-Oct-2026 21:56:32 | errorstr = f"{oldkey}\n\tvalues differ by > a relative difference of {tolerance}\n\texpected: {oldval}\n\tnew: {newval}\n\tdiff: {diff}\n\tpercent_diff: {percent_diff}%" |
| 11-Oct-2026 21:56:32 | errors.append(errorstr) |
| 11-Oct-2026 21:56:32 | elif oldval is not None: |
| 11-Oct-2026 21:56:32 | # If only the new value is None, fail |
| 11-Oct-2026 21:56:32 | errorstr = f"{oldkey}\n\tvalue is None\n\texpected: {oldval}\n\tnew: {newval}" |
| 11-Oct-2026 21:56:32 | errors.append(errorstr) |
| 11-Oct-2026 21:56:32 | else: |
| 11-Oct-2026 21:56:32 | # If old and new values are both None, this is expected, so pass |
| 11-Oct-2026 21:56:32 | LOG.info('Comparing %s and %s... both values are None.', oldval, newval) |
| 11-Oct-2026 21:56:32 | |
| 11-Oct-2026 21:56:32 | [LOG.warning(x) for x in errors] |
| 11-Oct-2026 21:56:32 | n_errors = len(errors) |
| 11-Oct-2026 21:56:32 | if n_errors > 0: |
| 11-Oct-2026 21:56:32 | summary_str = f"Worst absolute diff, {worst_diff[1]}: {worst_diff[0]}\nWorst percentage diff, {worst_percent_diff[1]}: {worst_percent_diff[0]}%" |
| 11-Oct-2026 21:56:32 | errors.append(summary_str) |
| 11-Oct-2026 21:56:32 | > pytest.fail("Failed to match {0} result value{1} within tolerance{1} :\n{2}".format( |
| 11-Oct-2026 21:56:32 | n_errors, '' if n_errors == 1 else 's', '\n'.join(errors)), pytrace=True) |
| 11-Oct-2026 21:56:32 | E Failed: Failed to match 2 result values within tolerances : |
| 11-Oct-2026 21:56:32 | E s16.hifa_gfluxscaleflag.uid___A002_X1181695_X1c6a4_8ant.qa.metric.CorrectedampflagQAHandler |
| 11-Oct-2026 21:56:32 | E values differ by > a relative difference of 1e-07 |
| 11-Oct-2026 21:56:32 | E expected: 0.0053688072299937365 |
| 11-Oct-2026 21:56:32 | E new: 0.0 |
| 11-Oct-2026 21:56:32 | E diff: 0.0053688072299937365 |
| 11-Oct-2026 21:56:32 | E percent_diff: 100.0% |
| 11-Oct-2026 21:56:32 | E s16.hifa_gfluxscaleflag.uid___A002_X1181695_X1c6a4_8ant.qa.score.CorrectedampflagQAHandler |
| 11-Oct-2026 21:56:32 | E values differ by > a relative difference of 1e-07 |
| 11-Oct-2026 21:56:32 | E expected: 0.9946311927700062 |
| 11-Oct-2026 21:56:32 | E new: 1.0 |
| 11-Oct-2026 21:56:32 | E diff: -0.005368807229993777 |
| 11-Oct-2026 21:56:32 | E percent_diff: -0.539778690736802% |
| 11-Oct-2026 21:56:32 | E Worst absolute diff, s16.hifa_gfluxscaleflag.uid___A002_X1181695_X1c6a4_8ant.qa.score.CorrectedampflagQAHandler: -0.005368807229993777 |
| 11-Oct-2026 21:56:32 | E Worst percentage diff, s16.hifa_gfluxscaleflag.uid___A002_X1181695_X1c6a4_8ant.qa.metric.CorrectedampflagQAHandler: 100.0% |
| 11-Oct-2026 21:56:32 | |
| 11-Oct-2026 21:56:32 | tests/testing_utils.py:440: Failed |
| 11-Oct-2026 21:56:32 | ========== 1 failed, 17 passed, 1254 warnings in 33558.64s (9:19:18) =========== |
| 11-Oct-2026 21:56:32 | 2026-10-11 21:56:31 INFO pipeline.infrastructure.mpihelpers::SynthesisUtilMethods::getResource synthesis.imager.memprofile.enable is enabled, initializing output file for imager profiling information (memory and run time): casa.synthesis.imager.memprofile.3846645.cvpost128.20261011_215631.txt |
| 11-Oct-2026 21:56:32 | 0 |
| 11-Oct-2026 21:56:32 | Finished task 'Test' with result: Success |
| 11-Oct-2026 21:56:32 | Starting task 'JUnit Parser' of type 'com.atlassian.bamboo.plugins.testresultparser:task.testresultparser.junit' |
| 11-Oct-2026 21:56:32 | Parsing test results under /lustre/cv/sw/casa/casaci/cvpost128/bamboohome/xml-data/build-dir/PIPESPECS-TESTPIPEMAINCASA674-ML228PY312TEST... |
| 11-Oct-2026 21:57:48 | Failing task since 1 failing test cases were found. |
| 11-Oct-2026 21:57:48 | Finished task 'JUnit Parser' with result: Failed |
| 11-Oct-2026 21:57:48 | Running post build plugin 'Docker Container Cleanup' |
| 11-Oct-2026 21:57:48 | Running post build plugin 'NCover Results Collector' |
| 11-Oct-2026 21:57:48 | Running post build plugin 'Build Results Label Collector' |
| 11-Oct-2026 21:57:49 | Running post build plugin 'Clover Results Collector' |
| 11-Oct-2026 21:57:49 | Running post build plugin 'npm Cache Cleanup' |
| 11-Oct-2026 21:57:49 | Running post build plugin 'Artifact Copier' |
| 11-Oct-2026 21:57:49 | Publishing an artifact: Unit Test Result xml |
| 11-Oct-2026 21:57:49 | Finished publishing of artifact Required shared artifact Http Compression On : [Unit Test Result xml], patterns: [pipeline_regression_test_result.xml] anchored at: [casa-build-utils/pipeline/workdir/] in 93.92 ms |
| 11-Oct-2026 21:57:49 | Publishing an artifact: Regression Test Result |
| 11-Oct-2026 21:57:49 | Finished publishing of artifact Required shared artifact Http Compression On : [Regression Test Result], patterns: [pipeline_unit_test_result.xml] anchored at: [casa-build-utils/pipeline/workdir/] in 31.06 ms |
| 11-Oct-2026 21:57:49 | Finalising the build... |
| 11-Oct-2026 21:57:49 | Stopping timer. |
| 11-Oct-2026 21:57:49 | Build PIPESPECS-TESTPIPEMAINCASA674-ML228PY312TEST-100 completed. |
| 11-Oct-2026 17:57:49 | Running on server: post build plugin 'Build Hanging Detection Configuration' |
| 11-Oct-2026 17:57:49 | Running on server: post build plugin 'NCover Results Collector' |
| 11-Oct-2026 17:57:49 | Running on server: post build plugin 'Build Labeller' |
| 11-Oct-2026 17:57:49 | Running on server: post build plugin 'Clover Delta Calculator' |
| 11-Oct-2026 17:57:49 | Running on server: post build plugin 'Maven Dependencies Postprocessor' |
| 11-Oct-2026 17:57:49 | All post build plugins have finished |
| 11-Oct-2026 17:57:49 | Generating build results summary... |
| 11-Oct-2026 17:57:49 | Saving build results to disk... |
| 11-Oct-2026 17:57:49 | Store variable context... |
| 11-Oct-2026 17:57:49 | Finished building PIPESPECS-TESTPIPEMAINCASA674-ML228PY312TEST-100. |