Build: #9 failed
Job: Test ManyLinux 2.28 Python 3.12 failed
Build log
The build generated 42,994 lines of output. The output is too long and has been truncated to the last 1,000 lines. Download or view full build log.
| 14-Oct-2026 10:54:31 | ../../casa-6.7.4-12-pipeline-2026.2.1.55-py3.12.el8/lib/py/lib/python3.12/site-packages/casaplotms/private/plotms_pb2.py:729 |
| 14-Oct-2026 10:54:31 | /lustre/cv/sw/casa/casaci/cvpost128/bamboohome/xml-data/build-dir/PIPESPECS-TESTPIPE202621CASA674-ML228PY312TEST/casa-build-utils/pipeline/workdir/casa-6.7.4-12-pipeline-2026.2.1.55-py3.12.el8/lib/py/lib/python3.12/site-packages/casaplotms/private/plotms_pb2.py:729: DeprecationWarning: Call to deprecated create function FieldDescriptor(). Note: Create unlinked descriptors is going to go away. Please use get/find descriptors from generated code or query the descriptor_pool. |
| 14-Oct-2026 10:54:31 | _descriptor.FieldDescriptor( |
| 14-Oct-2026 10:54:31 | |
| 14-Oct-2026 10:54:31 | ../../casa-6.7.4-12-pipeline-2026.2.1.55-py3.12.el8/lib/py/lib/python3.12/site-packages/casaplotms/private/plotms_pb2.py:736 |
| 14-Oct-2026 10:54:31 | /lustre/cv/sw/casa/casaci/cvpost128/bamboohome/xml-data/build-dir/PIPESPECS-TESTPIPE202621CASA674-ML228PY312TEST/casa-build-utils/pipeline/workdir/casa-6.7.4-12-pipeline-2026.2.1.55-py3.12.el8/lib/py/lib/python3.12/site-packages/casaplotms/private/plotms_pb2.py:736: DeprecationWarning: Call to deprecated create function FieldDescriptor(). Note: Create unlinked descriptors is going to go away. Please use get/find descriptors from generated code or query the descriptor_pool. |
| 14-Oct-2026 10:54:31 | _descriptor.FieldDescriptor( |
| 14-Oct-2026 10:54:31 | |
| 14-Oct-2026 10:54:31 | ../../casa-6.7.4-12-pipeline-2026.2.1.55-py3.12.el8/lib/py/lib/python3.12/site-packages/casaplotms/private/plotms_pb2.py:743 |
| 14-Oct-2026 10:54:31 | /lustre/cv/sw/casa/casaci/cvpost128/bamboohome/xml-data/build-dir/PIPESPECS-TESTPIPE202621CASA674-ML228PY312TEST/casa-build-utils/pipeline/workdir/casa-6.7.4-12-pipeline-2026.2.1.55-py3.12.el8/lib/py/lib/python3.12/site-packages/casaplotms/private/plotms_pb2.py:743: DeprecationWarning: Call to deprecated create function FieldDescriptor(). Note: Create unlinked descriptors is going to go away. Please use get/find descriptors from generated code or query the descriptor_pool. |
| 14-Oct-2026 10:54:31 | _descriptor.FieldDescriptor( |
| 14-Oct-2026 10:54:31 | |
| 14-Oct-2026 10:54:31 | ../../casa-6.7.4-12-pipeline-2026.2.1.55-py3.12.el8/lib/py/lib/python3.12/site-packages/casaplotms/private/plotms_pb2.py:750 |
| 14-Oct-2026 10:54:31 | /lustre/cv/sw/casa/casaci/cvpost128/bamboohome/xml-data/build-dir/PIPESPECS-TESTPIPE202621CASA674-ML228PY312TEST/casa-build-utils/pipeline/workdir/casa-6.7.4-12-pipeline-2026.2.1.55-py3.12.el8/lib/py/lib/python3.12/site-packages/casaplotms/private/plotms_pb2.py:750: DeprecationWarning: Call to deprecated create function FieldDescriptor(). Note: Create unlinked descriptors is going to go away. Please use get/find descriptors from generated code or query the descriptor_pool. |
| 14-Oct-2026 10:54:31 | _descriptor.FieldDescriptor( |
| 14-Oct-2026 10:54:31 | |
| 14-Oct-2026 10:54:31 | ../../casa-6.7.4-12-pipeline-2026.2.1.55-py3.12.el8/lib/py/lib/python3.12/site-packages/casaplotms/private/plotms_pb2.py:757 |
| 14-Oct-2026 10:54:31 | /lustre/cv/sw/casa/casaci/cvpost128/bamboohome/xml-data/build-dir/PIPESPECS-TESTPIPE202621CASA674-ML228PY312TEST/casa-build-utils/pipeline/workdir/casa-6.7.4-12-pipeline-2026.2.1.55-py3.12.el8/lib/py/lib/python3.12/site-packages/casaplotms/private/plotms_pb2.py:757: DeprecationWarning: Call to deprecated create function FieldDescriptor(). Note: Create unlinked descriptors is going to go away. Please use get/find descriptors from generated code or query the descriptor_pool. |
| 14-Oct-2026 10:54:31 | _descriptor.FieldDescriptor( |
| 14-Oct-2026 10:54:31 | |
| 14-Oct-2026 10:54:31 | ../../casa-6.7.4-12-pipeline-2026.2.1.55-py3.12.el8/lib/py/lib/python3.12/site-packages/casaplotms/private/plotms_pb2.py:764 |
| 14-Oct-2026 10:54:31 | /lustre/cv/sw/casa/casaci/cvpost128/bamboohome/xml-data/build-dir/PIPESPECS-TESTPIPE202621CASA674-ML228PY312TEST/casa-build-utils/pipeline/workdir/casa-6.7.4-12-pipeline-2026.2.1.55-py3.12.el8/lib/py/lib/python3.12/site-packages/casaplotms/private/plotms_pb2.py:764: DeprecationWarning: Call to deprecated create function FieldDescriptor(). Note: Create unlinked descriptors is going to go away. Please use get/find descriptors from generated code or query the descriptor_pool. |
| 14-Oct-2026 10:54:31 | _descriptor.FieldDescriptor( |
| 14-Oct-2026 10:54:31 | |
| 14-Oct-2026 10:54:31 | ../../casa-6.7.4-12-pipeline-2026.2.1.55-py3.12.el8/lib/py/lib/python3.12/site-packages/casaplotms/private/plotms_pb2.py:771 |
| 14-Oct-2026 10:54:31 | /lustre/cv/sw/casa/casaci/cvpost128/bamboohome/xml-data/build-dir/PIPESPECS-TESTPIPE202621CASA674-ML228PY312TEST/casa-build-utils/pipeline/workdir/casa-6.7.4-12-pipeline-2026.2.1.55-py3.12.el8/lib/py/lib/python3.12/site-packages/casaplotms/private/plotms_pb2.py:771: DeprecationWarning: Call to deprecated create function FieldDescriptor(). Note: Create unlinked descriptors is going to go away. Please use get/find descriptors from generated code or query the descriptor_pool. |
| 14-Oct-2026 10:54:31 | _descriptor.FieldDescriptor( |
| 14-Oct-2026 10:54:31 | |
| 14-Oct-2026 10:54:31 | ../../casa-6.7.4-12-pipeline-2026.2.1.55-py3.12.el8/lib/py/lib/python3.12/site-packages/casaplotms/private/plotms_pb2.py:701 |
| 14-Oct-2026 10:54:31 | /lustre/cv/sw/casa/casaci/cvpost128/bamboohome/xml-data/build-dir/PIPESPECS-TESTPIPE202621CASA674-ML228PY312TEST/casa-build-utils/pipeline/workdir/casa-6.7.4-12-pipeline-2026.2.1.55-py3.12.el8/lib/py/lib/python3.12/site-packages/casaplotms/private/plotms_pb2.py:701: DeprecationWarning: Call to deprecated create function Descriptor(). Note: Create unlinked descriptors is going to go away. Please use get/find descriptors from generated code or query the descriptor_pool. |
| 14-Oct-2026 10:54:31 | _SETFLAGEXTENSION = _descriptor.Descriptor( |
| 14-Oct-2026 10:54:31 | |
| 14-Oct-2026 10:54:31 | ../../casa-6.7.4-12-pipeline-2026.2.1.55-py3.12.el8/lib/py/lib/python3.12/site-packages/casaplotms/private/plotms_pb2.py:802 |
| 14-Oct-2026 10:54:31 | /lustre/cv/sw/casa/casaci/cvpost128/bamboohome/xml-data/build-dir/PIPESPECS-TESTPIPE202621CASA674-ML228PY312TEST/casa-build-utils/pipeline/workdir/casa-6.7.4-12-pipeline-2026.2.1.55-py3.12.el8/lib/py/lib/python3.12/site-packages/casaplotms/private/plotms_pb2.py:802: DeprecationWarning: Call to deprecated create function FieldDescriptor(). Note: Create unlinked descriptors is going to go away. Please use get/find descriptors from generated code or query the descriptor_pool. |
| 14-Oct-2026 10:54:31 | _descriptor.FieldDescriptor( |
| 14-Oct-2026 10:54:31 | |
| 14-Oct-2026 10:54:31 | ../../casa-6.7.4-12-pipeline-2026.2.1.55-py3.12.el8/lib/py/lib/python3.12/site-packages/casaplotms/private/plotms_pb2.py:795 |
| 14-Oct-2026 10:54:31 | /lustre/cv/sw/casa/casaci/cvpost128/bamboohome/xml-data/build-dir/PIPESPECS-TESTPIPE202621CASA674-ML228PY312TEST/casa-build-utils/pipeline/workdir/casa-6.7.4-12-pipeline-2026.2.1.55-py3.12.el8/lib/py/lib/python3.12/site-packages/casaplotms/private/plotms_pb2.py:795: DeprecationWarning: Call to deprecated create function Descriptor(). Note: Create unlinked descriptors is going to go away. Please use get/find descriptors from generated code or query the descriptor_pool. |
| 14-Oct-2026 10:54:31 | _EXPORTRANGE = _descriptor.Descriptor( |
| 14-Oct-2026 10:54:31 | |
| 14-Oct-2026 10:54:31 | ../../casa-6.7.4-12-pipeline-2026.2.1.55-py3.12.el8/lib/py/lib/python3.12/site-packages/casaplotms/private/plotms_pb2.py:833 |
| 14-Oct-2026 10:54:31 | /lustre/cv/sw/casa/casaci/cvpost128/bamboohome/xml-data/build-dir/PIPESPECS-TESTPIPE202621CASA674-ML228PY312TEST/casa-build-utils/pipeline/workdir/casa-6.7.4-12-pipeline-2026.2.1.55-py3.12.el8/lib/py/lib/python3.12/site-packages/casaplotms/private/plotms_pb2.py:833: DeprecationWarning: Call to deprecated create function FieldDescriptor(). Note: Create unlinked descriptors is going to go away. Please use get/find descriptors from generated code or query the descriptor_pool. |
| 14-Oct-2026 10:54:31 | _descriptor.FieldDescriptor( |
| 14-Oct-2026 10:54:31 | |
| 14-Oct-2026 10:54:31 | ../../casa-6.7.4-12-pipeline-2026.2.1.55-py3.12.el8/lib/py/lib/python3.12/site-packages/casaplotms/private/plotms_pb2.py:840 |
| 14-Oct-2026 10:54:31 | /lustre/cv/sw/casa/casaci/cvpost128/bamboohome/xml-data/build-dir/PIPESPECS-TESTPIPE202621CASA674-ML228PY312TEST/casa-build-utils/pipeline/workdir/casa-6.7.4-12-pipeline-2026.2.1.55-py3.12.el8/lib/py/lib/python3.12/site-packages/casaplotms/private/plotms_pb2.py:840: DeprecationWarning: Call to deprecated create function FieldDescriptor(). Note: Create unlinked descriptors is going to go away. Please use get/find descriptors from generated code or query the descriptor_pool. |
| 14-Oct-2026 10:54:31 | _descriptor.FieldDescriptor( |
| 14-Oct-2026 10:54:31 | |
| 14-Oct-2026 10:54:31 | ../../casa-6.7.4-12-pipeline-2026.2.1.55-py3.12.el8/lib/py/lib/python3.12/site-packages/casaplotms/private/plotms_pb2.py:847 |
| 14-Oct-2026 10:54:31 | /lustre/cv/sw/casa/casaci/cvpost128/bamboohome/xml-data/build-dir/PIPESPECS-TESTPIPE202621CASA674-ML228PY312TEST/casa-build-utils/pipeline/workdir/casa-6.7.4-12-pipeline-2026.2.1.55-py3.12.el8/lib/py/lib/python3.12/site-packages/casaplotms/private/plotms_pb2.py:847: DeprecationWarning: Call to deprecated create function FieldDescriptor(). Note: Create unlinked descriptors is going to go away. Please use get/find descriptors from generated code or query the descriptor_pool. |
| 14-Oct-2026 10:54:31 | _descriptor.FieldDescriptor( |
| 14-Oct-2026 10:54:31 | |
| 14-Oct-2026 10:54:31 | ../../casa-6.7.4-12-pipeline-2026.2.1.55-py3.12.el8/lib/py/lib/python3.12/site-packages/casaplotms/private/plotms_pb2.py:854 |
| 14-Oct-2026 10:54:31 | /lustre/cv/sw/casa/casaci/cvpost128/bamboohome/xml-data/build-dir/PIPESPECS-TESTPIPE202621CASA674-ML228PY312TEST/casa-build-utils/pipeline/workdir/casa-6.7.4-12-pipeline-2026.2.1.55-py3.12.el8/lib/py/lib/python3.12/site-packages/casaplotms/private/plotms_pb2.py:854: DeprecationWarning: Call to deprecated create function FieldDescriptor(). Note: Create unlinked descriptors is going to go away. Please use get/find descriptors from generated code or query the descriptor_pool. |
| 14-Oct-2026 10:54:31 | _descriptor.FieldDescriptor( |
| 14-Oct-2026 10:54:31 | |
| 14-Oct-2026 10:54:31 | ../../casa-6.7.4-12-pipeline-2026.2.1.55-py3.12.el8/lib/py/lib/python3.12/site-packages/casaplotms/private/plotms_pb2.py:861 |
| 14-Oct-2026 10:54:31 | /lustre/cv/sw/casa/casaci/cvpost128/bamboohome/xml-data/build-dir/PIPESPECS-TESTPIPE202621CASA674-ML228PY312TEST/casa-build-utils/pipeline/workdir/casa-6.7.4-12-pipeline-2026.2.1.55-py3.12.el8/lib/py/lib/python3.12/site-packages/casaplotms/private/plotms_pb2.py:861: DeprecationWarning: Call to deprecated create function FieldDescriptor(). Note: Create unlinked descriptors is going to go away. Please use get/find descriptors from generated code or query the descriptor_pool. |
| 14-Oct-2026 10:54:31 | _descriptor.FieldDescriptor( |
| 14-Oct-2026 10:54:31 | |
| 14-Oct-2026 10:54:31 | ../../casa-6.7.4-12-pipeline-2026.2.1.55-py3.12.el8/lib/py/lib/python3.12/site-packages/casaplotms/private/plotms_pb2.py:868 |
| 14-Oct-2026 10:54:31 | /lustre/cv/sw/casa/casaci/cvpost128/bamboohome/xml-data/build-dir/PIPESPECS-TESTPIPE202621CASA674-ML228PY312TEST/casa-build-utils/pipeline/workdir/casa-6.7.4-12-pipeline-2026.2.1.55-py3.12.el8/lib/py/lib/python3.12/site-packages/casaplotms/private/plotms_pb2.py:868: DeprecationWarning: Call to deprecated create function FieldDescriptor(). Note: Create unlinked descriptors is going to go away. Please use get/find descriptors from generated code or query the descriptor_pool. |
| 14-Oct-2026 10:54:31 | _descriptor.FieldDescriptor( |
| 14-Oct-2026 10:54:31 | |
| 14-Oct-2026 10:54:31 | ../../casa-6.7.4-12-pipeline-2026.2.1.55-py3.12.el8/lib/py/lib/python3.12/site-packages/casaplotms/private/plotms_pb2.py:875 |
| 14-Oct-2026 10:54:31 | /lustre/cv/sw/casa/casaci/cvpost128/bamboohome/xml-data/build-dir/PIPESPECS-TESTPIPE202621CASA674-ML228PY312TEST/casa-build-utils/pipeline/workdir/casa-6.7.4-12-pipeline-2026.2.1.55-py3.12.el8/lib/py/lib/python3.12/site-packages/casaplotms/private/plotms_pb2.py:875: DeprecationWarning: Call to deprecated create function FieldDescriptor(). Note: Create unlinked descriptors is going to go away. Please use get/find descriptors from generated code or query the descriptor_pool. |
| 14-Oct-2026 10:54:31 | _descriptor.FieldDescriptor( |
| 14-Oct-2026 10:54:31 | |
| 14-Oct-2026 10:54:31 | ../../casa-6.7.4-12-pipeline-2026.2.1.55-py3.12.el8/lib/py/lib/python3.12/site-packages/casaplotms/private/plotms_pb2.py:882 |
| 14-Oct-2026 10:54:31 | /lustre/cv/sw/casa/casaci/cvpost128/bamboohome/xml-data/build-dir/PIPESPECS-TESTPIPE202621CASA674-ML228PY312TEST/casa-build-utils/pipeline/workdir/casa-6.7.4-12-pipeline-2026.2.1.55-py3.12.el8/lib/py/lib/python3.12/site-packages/casaplotms/private/plotms_pb2.py:882: DeprecationWarning: Call to deprecated create function FieldDescriptor(). Note: Create unlinked descriptors is going to go away. Please use get/find descriptors from generated code or query the descriptor_pool. |
| 14-Oct-2026 10:54:31 | _descriptor.FieldDescriptor( |
| 14-Oct-2026 10:54:31 | |
| 14-Oct-2026 10:54:31 | ../../casa-6.7.4-12-pipeline-2026.2.1.55-py3.12.el8/lib/py/lib/python3.12/site-packages/casaplotms/private/plotms_pb2.py:889 |
| 14-Oct-2026 10:54:31 | /lustre/cv/sw/casa/casaci/cvpost128/bamboohome/xml-data/build-dir/PIPESPECS-TESTPIPE202621CASA674-ML228PY312TEST/casa-build-utils/pipeline/workdir/casa-6.7.4-12-pipeline-2026.2.1.55-py3.12.el8/lib/py/lib/python3.12/site-packages/casaplotms/private/plotms_pb2.py:889: DeprecationWarning: Call to deprecated create function FieldDescriptor(). Note: Create unlinked descriptors is going to go away. Please use get/find descriptors from generated code or query the descriptor_pool. |
| 14-Oct-2026 10:54:31 | _descriptor.FieldDescriptor( |
| 14-Oct-2026 10:54:31 | |
| 14-Oct-2026 10:54:31 | ../../casa-6.7.4-12-pipeline-2026.2.1.55-py3.12.el8/lib/py/lib/python3.12/site-packages/casaplotms/private/plotms_pb2.py:826 |
| 14-Oct-2026 10:54:31 | /lustre/cv/sw/casa/casaci/cvpost128/bamboohome/xml-data/build-dir/PIPESPECS-TESTPIPE202621CASA674-ML228PY312TEST/casa-build-utils/pipeline/workdir/casa-6.7.4-12-pipeline-2026.2.1.55-py3.12.el8/lib/py/lib/python3.12/site-packages/casaplotms/private/plotms_pb2.py:826: DeprecationWarning: Call to deprecated create function Descriptor(). Note: Create unlinked descriptors is going to go away. Please use get/find descriptors from generated code or query the descriptor_pool. |
| 14-Oct-2026 10:54:31 | _SETITERATE = _descriptor.Descriptor( |
| 14-Oct-2026 10:54:31 | |
| 14-Oct-2026 10:54:31 | ../../casa-6.7.4-12-pipeline-2026.2.1.55-py3.12.el8/lib/py/lib/python3.12/site-packages/casaplotms/private/plotms_pb2.py:920 |
| 14-Oct-2026 10:54:31 | /lustre/cv/sw/casa/casaci/cvpost128/bamboohome/xml-data/build-dir/PIPESPECS-TESTPIPE202621CASA674-ML228PY312TEST/casa-build-utils/pipeline/workdir/casa-6.7.4-12-pipeline-2026.2.1.55-py3.12.el8/lib/py/lib/python3.12/site-packages/casaplotms/private/plotms_pb2.py:920: DeprecationWarning: Call to deprecated create function FieldDescriptor(). Note: Create unlinked descriptors is going to go away. Please use get/find descriptors from generated code or query the descriptor_pool. |
| 14-Oct-2026 10:54:31 | _descriptor.FieldDescriptor( |
| 14-Oct-2026 10:54:31 | |
| 14-Oct-2026 10:54:31 | ../../casa-6.7.4-12-pipeline-2026.2.1.55-py3.12.el8/lib/py/lib/python3.12/site-packages/casaplotms/private/plotms_pb2.py:927 |
| 14-Oct-2026 10:54:31 | /lustre/cv/sw/casa/casaci/cvpost128/bamboohome/xml-data/build-dir/PIPESPECS-TESTPIPE202621CASA674-ML228PY312TEST/casa-build-utils/pipeline/workdir/casa-6.7.4-12-pipeline-2026.2.1.55-py3.12.el8/lib/py/lib/python3.12/site-packages/casaplotms/private/plotms_pb2.py:927: DeprecationWarning: Call to deprecated create function FieldDescriptor(). Note: Create unlinked descriptors is going to go away. Please use get/find descriptors from generated code or query the descriptor_pool. |
| 14-Oct-2026 10:54:31 | _descriptor.FieldDescriptor( |
| 14-Oct-2026 10:54:31 | |
| 14-Oct-2026 10:54:31 | ../../casa-6.7.4-12-pipeline-2026.2.1.55-py3.12.el8/lib/py/lib/python3.12/site-packages/casaplotms/private/plotms_pb2.py:934 |
| 14-Oct-2026 10:54:31 | /lustre/cv/sw/casa/casaci/cvpost128/bamboohome/xml-data/build-dir/PIPESPECS-TESTPIPE202621CASA674-ML228PY312TEST/casa-build-utils/pipeline/workdir/casa-6.7.4-12-pipeline-2026.2.1.55-py3.12.el8/lib/py/lib/python3.12/site-packages/casaplotms/private/plotms_pb2.py:934: DeprecationWarning: Call to deprecated create function FieldDescriptor(). Note: Create unlinked descriptors is going to go away. Please use get/find descriptors from generated code or query the descriptor_pool. |
| 14-Oct-2026 10:54:31 | _descriptor.FieldDescriptor( |
| 14-Oct-2026 10:54:31 | |
| 14-Oct-2026 10:54:31 | ../../casa-6.7.4-12-pipeline-2026.2.1.55-py3.12.el8/lib/py/lib/python3.12/site-packages/casaplotms/private/plotms_pb2.py:913 |
| 14-Oct-2026 10:54:31 | /lustre/cv/sw/casa/casaci/cvpost128/bamboohome/xml-data/build-dir/PIPESPECS-TESTPIPE202621CASA674-ML228PY312TEST/casa-build-utils/pipeline/workdir/casa-6.7.4-12-pipeline-2026.2.1.55-py3.12.el8/lib/py/lib/python3.12/site-packages/casaplotms/private/plotms_pb2.py:913: DeprecationWarning: Call to deprecated create function Descriptor(). Note: Create unlinked descriptors is going to go away. Please use get/find descriptors from generated code or query the descriptor_pool. |
| 14-Oct-2026 10:54:31 | _SETSTRING = _descriptor.Descriptor( |
| 14-Oct-2026 10:54:31 | |
| 14-Oct-2026 10:54:31 | ../../casa-6.7.4-12-pipeline-2026.2.1.55-py3.12.el8/lib/py/lib/python3.12/site-packages/casaplotms/private/plotms_pb2.py:965 |
| 14-Oct-2026 10:54:31 | /lustre/cv/sw/casa/casaci/cvpost128/bamboohome/xml-data/build-dir/PIPESPECS-TESTPIPE202621CASA674-ML228PY312TEST/casa-build-utils/pipeline/workdir/casa-6.7.4-12-pipeline-2026.2.1.55-py3.12.el8/lib/py/lib/python3.12/site-packages/casaplotms/private/plotms_pb2.py:965: DeprecationWarning: Call to deprecated create function FieldDescriptor(). Note: Create unlinked descriptors is going to go away. Please use get/find descriptors from generated code or query the descriptor_pool. |
| 14-Oct-2026 10:54:31 | _descriptor.FieldDescriptor( |
| 14-Oct-2026 10:54:31 | |
| 14-Oct-2026 10:54:31 | ../../casa-6.7.4-12-pipeline-2026.2.1.55-py3.12.el8/lib/py/lib/python3.12/site-packages/casaplotms/private/plotms_pb2.py:972 |
| 14-Oct-2026 10:54:31 | /lustre/cv/sw/casa/casaci/cvpost128/bamboohome/xml-data/build-dir/PIPESPECS-TESTPIPE202621CASA674-ML228PY312TEST/casa-build-utils/pipeline/workdir/casa-6.7.4-12-pipeline-2026.2.1.55-py3.12.el8/lib/py/lib/python3.12/site-packages/casaplotms/private/plotms_pb2.py:972: DeprecationWarning: Call to deprecated create function FieldDescriptor(). Note: Create unlinked descriptors is going to go away. Please use get/find descriptors from generated code or query the descriptor_pool. |
| 14-Oct-2026 10:54:31 | _descriptor.FieldDescriptor( |
| 14-Oct-2026 10:54:31 | |
| 14-Oct-2026 10:54:31 | ../../casa-6.7.4-12-pipeline-2026.2.1.55-py3.12.el8/lib/py/lib/python3.12/site-packages/casaplotms/private/plotms_pb2.py:979 |
| 14-Oct-2026 10:54:42 | /lustre/cv/sw/casa/casaci/cvpost128/bamboohome/xml-data/build-dir/PIPESPECS-TESTPIPE202621CASA674-ML228PY312TEST/casa-build-utils/pipeline/workdir/casa-6.7.4-12-pipeline-2026.2.1.55-py3.12.el8/lib/py/lib/python3.12/site-packages/casaplotms/private/plotms_pb2.py:979: DeprecationWarning: Call to deprecated create function FieldDescriptor(). Note: Create unlinked descriptors is going to go away. Please use get/find descriptors from generated code or query the descriptor_pool. |
| 14-Oct-2026 10:54:42 | _descriptor.FieldDescriptor( |
| 14-Oct-2026 10:54:42 | |
| 14-Oct-2026 10:54:42 | pipeline/hifa/tasks/applycal/ampphase_vs_freq_qa_test.py::test_score_all_scans |
| 14-Oct-2026 10:54:42 | /lustre/cv/sw/casa/casaci/cvpost128/bamboohome/xml-data/build-dir/PIPESPECS-TESTPIPE202621CASA674-ML228PY312TEST/casa-build-utils/pipeline/workdir/casa-6.7.4-12-pipeline-2026.2.1.55-py3.12.el8/lib/py/lib/python3.12/site-packages/numpy/ma/core.py:509: ComplexWarning: Casting complex values to real discards the imaginary part |
| 14-Oct-2026 10:54:42 | fill_value = np.asarray(fill_value, dtype=ndtype) |
| 14-Oct-2026 10:54:42 | |
| 14-Oct-2026 10:54:42 | -- Docs: https://docs.pytest.org/en/stable/how-to/capture-warnings.html |
| 14-Oct-2026 10:54:42 | - generated xml file: /lustre/cv/sw/casa/casaci/cvpost128/bamboohome/xml-data/build-dir/PIPESPECS-TESTPIPE202621CASA674-ML228PY312TEST/casa-build-utils/pipeline/workdir/pipeline_unit_test_result.xml - |
| 14-Oct-2026 10:54:42 | =========================== short test summary info ============================ |
| 14-Oct-2026 10:54:42 | SKIPPED [2] h/tasks/common/atmutil_test.py:218: need_vis |
| 14-Oct-2026 10:54:42 | SKIPPED [3] h/tasks/common/atmutil_test.py:238: need_vis |
| 14-Oct-2026 10:54:42 | SKIPPED [2] h/tasks/common/atmutil_test.py:256: need_vis |
| 14-Oct-2026 10:54:42 | SKIPPED [1] infrastructure/daskhelpers_test.py:85: dask not installed |
| 14-Oct-2026 10:54:42 | SKIPPED [1] infrastructure/daskhelpers_test.py:151: dask not installed |
| 14-Oct-2026 10:54:42 | SKIPPED [1] infrastructure/daskhelpers_test.py:200: dask not installed |
| 14-Oct-2026 10:54:42 | SKIPPED [1] recipes/recipe_converter_test.py:382: Skip testing main. Its output must be carefully examined by developer. |
| 14-Oct-2026 10:54:42 | SKIPPED [1] recipes/recipe_converter_test.py:387: Skip testing generate_all. Its output must be carefully examined by developer. |
| 14-Oct-2026 10:54:42 | ========== 839 passed, 12 skipped, 104 warnings in 419.12s (0:06:59) =========== |
| 14-Oct-2026 10:54:42 | 0 |
| 14-Oct-2026 10:54:42 | Running regression tests |
| 14-Oct-2026 10:54:42 | xvfb-run /lustre/cv/sw/casa/casaci/cvpost128/bamboohome/xml-data/build-dir/PIPESPECS-TESTPIPE202621CASA674-ML228PY312TEST/casa-build-utils/pipeline/workdir/casa-6.7.4-12-pipeline-2026.2.1.55-py3.12.el8/bin/casa --cachedir=/lustre/cv/sw/casa/casaci/pipelinercdir --cachedir=/lustre/cv/sw/casa/casaci/pipelinercdir --nogui --nologger --log2term --agg -c"import pytest; pytest.main(['-s', '-vv', '-n', '12', '--dist=worksteal','--forked', '--junitxml=/lustre/cv/sw/casa/casaci/cvpost128/bamboohome/xml-data/build-dir/PIPESPECS-TESTPIPE202621CASA674-ML228PY312TEST/casa-build-utils/pipeline/workdir/pipeline_regression_test_result.xml', '/lustre/cv/sw/casa/casaci/cvpost128/bamboohome/xml-data/build-dir/PIPESPECS-TESTPIPE202621CASA674-ML228PY312TEST/casa-build-utils/pipeline/workdir/pipeline/tests/regression/fast'])" |
| 14-Oct-2026 10:54:42 | Executing: xvfb-run /lustre/cv/sw/casa/casaci/cvpost128/bamboohome/xml-data/build-dir/PIPESPECS-TESTPIPE202621CASA674-ML228PY312TEST/casa-build-utils/pipeline/workdir/casa-6.7.4-12-pipeline-2026.2.1.55-py3.12.el8/bin/casa --cachedir=/lustre/cv/sw/casa/casaci/pipelinercdir --cachedir=/lustre/cv/sw/casa/casaci/pipelinercdir --nogui --nologger --log2term --agg -c"import pytest; pytest.main(['-s', '-vv', '-n', '12', '--dist=worksteal','--forked', '--junitxml=/lustre/cv/sw/casa/casaci/cvpost128/bamboohome/xml-data/build-dir/PIPESPECS-TESTPIPE202621CASA674-ML228PY312TEST/casa-build-utils/pipeline/workdir/pipeline_regression_test_result.xml', '/lustre/cv/sw/casa/casaci/cvpost128/bamboohome/xml-data/build-dir/PIPESPECS-TESTPIPE202621CASA674-ML228PY312TEST/casa-build-utils/pipeline/workdir/pipeline/tests/regression/fast'])" |
| 14-Oct-2026 10:54:42 | |
| 14-Oct-2026 10:54:42 | Using user configuration file /users/casaci/.casa/config.py |
| 14-Oct-2026 10:54:42 | |
| 14-Oct-2026 10:54:42 | No event loop hook running. |
| 14-Oct-2026 10:54:42 | 2026-10-14 10:54:38 SEVERE ::casa |
| 14-Oct-2026 10:54:42 | 2026-10-14 10:54:38 SEVERE ::casa The expected casa data was not found at measurespath. CASA may still work if the data can be found in datapath. |
| 14-Oct-2026 10:54:42 | 2026-10-14 10:54:38 SEVERE ::casa The expected measures data was not found at measurespath. CASA may still work if the data can be found in datapath. |
| 14-Oct-2026 10:54:42 | 2026-10-14 10:54:38 SEVERE ::casa visit https://casadocs.readthedocs.io/en/stable/notebooks/external-data.html for more information |
| 14-Oct-2026 10:54:42 | 2026-10-14 10:54:38 SEVERE ::casa |
| 14-Oct-2026 10:54:42 | Using location of IERSeop2000 table found in datapath for measurespath /home/casa/data/master |
| 14-Oct-2026 10:54:42 | CASA 6.7.4.12 -- Common Astronomy Software Applications [6.7.4.12] |
| 14-Oct-2026 10:54:42 | 2026-10-14 10:54:42 INFO ::casa Using user configuration file /users/casaci/.casa/config.py |
| 14-Oct-2026 10:54:42 | 2026-10-14 10:54:42 INFO ::casa loaded config file : /lustre/cv/sw/casa/casaci/cvpost128/bamboohome/xml-data/build-dir/PIPESPECS-TESTPIPE202621CASA674-ML228PY312TEST/casa-build-utils/pipeline/workdir/casa-6.7.4-12-pipeline-2026.2.1.55-py3.12.el8/lib/py/lib/python3.12/site-packages/casaconfig/config.py |
| 14-Oct-2026 10:54:42 | 2026-10-14 10:54:42 INFO ::casa loaded config file : /home/casa/casasiteconfig.py |
| 14-Oct-2026 10:54:42 | 2026-10-14 10:54:42 INFO ::casa loaded config file : /users/casaci/.casa/config.py |
| 14-Oct-2026 10:54:42 | 2026-10-14 10:54:42 INFO ::casa |
| 14-Oct-2026 10:54:42 | 2026-10-14 10:54:42 INFO ::casa config values |
| 14-Oct-2026 10:54:42 | 2026-10-14 10:54:42 INFO ::casa agg = True |
| 14-Oct-2026 10:54:42 | 2026-10-14 10:54:42 INFO ::casa cachedir = '/lustre/cv/sw/casa/casaci/pipelinercdir' |
| 14-Oct-2026 10:54:42 | 2026-10-14 10:54:42 INFO ::casa casaconfig_verbose = 1 |
| 14-Oct-2026 10:54:42 | 2026-10-14 10:54:42 INFO ::casa colors = 'Neutral' |
| 14-Oct-2026 10:54:42 | 2026-10-14 10:54:42 INFO ::casa data_auto_update = False |
| 14-Oct-2026 10:54:42 | 2026-10-14 10:54:42 INFO ::casa data_update_interval = 1 |
| 14-Oct-2026 10:54:42 | 2026-10-14 10:54:42 INFO ::casa datapath = ['/export/cvpost134-4tb/casa/casa-data/casatestdata', '/export/cvpost134-4tb/casa/casa-data/casatestdata-large', '/export/cvpost134-4tb/casa/casa-data/casa-data', '/export/cvpost135-4tb/casa/casa-data/casatestdata', '/export/cvpost135-4tb/casa/casa-data/casatestdata-large', '/home/casa/data/master', '/opt/casa/data/casatestdata', '/opt/casa/data/casatestdata-large', '/lustre/cv/sw/casa/casaci/data/casatestdata', '/lustre/cv/sw/casa/casaci/data/casatestdata-large', '/lustre/cv/sw/casa/casaci/pipeline-testdata', '/opt/pltestdata/pipeline-testdata', '/export/cvpost134-4tb/casa/casa-data/casatestdata', '/export/cvpost135-4tb/casa/casa-data/casatestdata', '/export/data_2/casatestdata-large'] |
| 14-Oct-2026 10:54:42 | 2026-10-14 10:54:42 INFO ::casa iplog = False |
| 14-Oct-2026 10:54:42 | 2026-10-14 10:54:42 INFO ::casa iplogfile = '/lustre/cv/sw/casa/casaci/cvpost128/bamboohome/xml-data/build-dir/PIPESPECS-TESTPIPE202621CASA674-ML228PY312TEST/casa-build-utils/pipeline/workdir/pipeline/ipython-20261014-105435.log' |
| 14-Oct-2026 10:54:42 | 2026-10-14 10:54:42 INFO ::casa log2term = True |
| 14-Oct-2026 10:54:42 | 2026-10-14 10:54:42 INFO ::casa logfile = '/lustre/cv/sw/casa/casaci/cvpost128/bamboohome/xml-data/build-dir/PIPESPECS-TESTPIPE202621CASA674-ML228PY312TEST/casa-build-utils/pipeline/workdir/pipeline/casa-20261014-105435.log' |
| 14-Oct-2026 10:54:42 | 2026-10-14 10:54:42 INFO ::casa measures_auto_update = False |
| 14-Oct-2026 10:54:42 | 2026-10-14 10:54:42 INFO ::casa measures_site = ['https://www.astron.nl/iers/', 'https://go.nrao.edu/iers/'] |
| 14-Oct-2026 10:54:42 | 2026-10-14 10:54:42 INFO ::casa measures_site_interval = 2 |
| 14-Oct-2026 10:54:42 | 2026-10-14 10:54:42 INFO ::casa measures_update_interval = 1 |
| 14-Oct-2026 10:54:42 | 2026-10-14 10:54:42 INFO ::casa measurespath = '/opt/casa/data/master' |
| 14-Oct-2026 10:54:42 | 2026-10-14 10:54:42 INFO ::casa nogui = True |
| 14-Oct-2026 10:54:42 | 2026-10-14 10:54:42 INFO ::casa nologfile = False |
| 14-Oct-2026 10:54:42 | 2026-10-14 10:54:42 INFO ::casa nologger = True |
| 14-Oct-2026 10:54:42 | 2026-10-14 10:54:42 INFO ::casa pipeline = False |
| 14-Oct-2026 10:54:42 | 2026-10-14 10:54:42 INFO ::casa startupfile = '/users/casaci/.casa/startup.py' |
| 14-Oct-2026 10:54:42 | 2026-10-14 10:54:42 INFO ::casa user_site = False |
| 14-Oct-2026 10:54:42 | 2026-10-14 10:54:42 INFO ::casa |
| 14-Oct-2026 10:54:42 | 2026-10-14 10:54:42 INFO ::casa casarundata version is unknown, this is probably a legacy version not installed by casaconfig |
| 14-Oct-2026 10:54:42 | 2026-10-14 10:54:42 INFO ::casa measures version is unknown, this is probably a legacy version not installed by casaconfig |
| 14-Oct-2026 10:54:42 | 2026-10-14 10:54:42 INFO ::casa |
| 14-Oct-2026 10:54:42 | 2026-10-14 10:54:42 INFO ::casa Checking Measures tables in data repository sub-directory /home/casa/data/master/geodetic |
| 14-Oct-2026 10:54:42 | 2026-10-14 10:54:42 INFO ::casa IERSeop2000 (version date, last date in table (UTC)): 2026/09/10/15:15, 2026/08/11/00:00:00 |
| 14-Oct-2026 10:54:42 | 2026-10-14 10:54:42 INFO ::casa IERSeop97 (version date, last date in table (UTC)): 2026/09/10/15:15, 2026/08/11/00:00:00 |
| 14-Oct-2026 10:54:42 | 2026-10-14 10:54:42 INFO ::casa IERSpredict (version date, last date in table (UTC)): 2026/10/13/15:15, 2027/01/11/00:00:00 |
| 14-Oct-2026 10:54:42 | 2026-10-14 10:54:42 INFO ::casa TAI_UTC (version date, last date in table (UTC)): 2026/10/05/15:15, 2017/01/01/00:00:00 |
| 14-Oct-2026 10:54:42 | 2026-10-14 10:54:42 INFO: Environment is not MPI enabled. Pipeline operating in single host mode |
| 14-Oct-2026 11:39:32 | 2026-10-14 10:54:42 INFO pipeline::pipeline.infrastructure.mpihelpers::casa Environment is not MPI enabled. Pipeline operating in single host mode |
| 14-Oct-2026 11:39:32 | ============================= test session starts ============================== |
| 14-Oct-2026 11:39:32 | platform linux -- Python 3.12.4, pytest-9.0.2, pluggy-1.6.0 -- /lustre/cv/sw/casa/casaci/cvpost128/bamboohome/xml-data/build-dir/PIPESPECS-TESTPIPE202621CASA674-ML228PY312TEST/casa-build-utils/pipeline/workdir/casa-6.7.4-12-pipeline-2026.2.1.55-py3.12.el8/lib/py/bin/python3 |
| 14-Oct-2026 11:39:32 | cachedir: .pytest_cache |
| 14-Oct-2026 11:39:32 | rootdir: /lustre/cv/sw/casa/casaci/cvpost128/bamboohome/xml-data/build-dir/PIPESPECS-TESTPIPE202621CASA674-ML228PY312TEST/casa-build-utils/pipeline/workdir/pipeline |
| 14-Oct-2026 11:39:32 | configfile: pyproject.toml |
| 14-Oct-2026 11:39:32 | plugins: xdist-3.8.0, forked-1.7.5 |
| 14-Oct-2026 11:39:32 | created: 12/12 workers |
| 14-Oct-2026 11:39:32 | 2026-10-14 10:54:46 SEVERE ::casa |
| 14-Oct-2026 11:39:32 | 2026-10-14 10:54:46 SEVERE ::casa The expected casa data was not found at measurespath. CASA may still work if the data can be found in datapath. |
| 14-Oct-2026 11:39:32 | 2026-10-14 10:54:46 SEVERE ::casa The expected measures data was not found at measurespath. CASA may still work if the data can be found in datapath. |
| 14-Oct-2026 11:39:32 | 2026-10-14 10:54:46 SEVERE ::casa visit https://casadocs.readthedocs.io/en/stable/notebooks/external-data.html for more information |
| 14-Oct-2026 11:39:32 | 2026-10-14 10:54:46 SEVERE ::casa |
| 14-Oct-2026 11:39:32 | 2026-10-14 10:54:46 SEVERE ::casa 2026-10-14 10:54:46 SEVERE ::casa |
| 14-Oct-2026 11:39:32 | 2026-10-14 10:54:46 SEVERE ::casa The expected casa data was not found at measurespath. CASA may still work if the data can be found in datapath. |
| 14-Oct-2026 11:39:32 | 2026-10-14 10:54:46 SEVERE ::casa The expected measures data was not found at measurespath. CASA may still work if the data can be found in datapath. |
| 14-Oct-2026 11:39:32 | 2026-10-14 10:54:46 SEVERE ::casa visit https://casadocs.readthedocs.io/en/stable/notebooks/external-data.html for more information |
| 14-Oct-2026 11:39:32 | 2026-10-14 10:54:46 SEVERE ::casa |
| 14-Oct-2026 11:39:32 | |
| 14-Oct-2026 11:39:32 | 2026-10-14 10:54:46 SEVERE ::casa The expected casa data was not found at measurespath. CASA may still work if the data can be found in datapath. |
| 14-Oct-2026 11:39:32 | 2026-10-14 10:54:46 SEVERE ::casa The expected measures data was not found at measurespath. CASA may still work if the data can be found in datapath. |
| 14-Oct-2026 11:39:32 | 2026-10-14 10:54:46 SEVERE ::casa visit https://casadocs.readthedocs.io/en/stable/notebooks/external-data.html for more information |
| 14-Oct-2026 11:39:32 | 2026-10-14 10:54:46 SEVERE ::casa |
| 14-Oct-2026 11:39:32 | 2026-10-14 10:54:46 SEVERE ::casa |
| 14-Oct-2026 11:39:32 | 2026-10-14 10:54:46 SEVERE ::casa The expected casa data was not found at measurespath. CASA may still work if the data can be found in datapath. |
| 14-Oct-2026 11:39:32 | 2026-10-14 10:54:46 SEVERE ::casa The expected measures data was not found at measurespath. CASA may still work if the data can be found in datapath. |
| 14-Oct-2026 11:39:32 | 2026-10-14 10:54:46 SEVERE ::casa visit https://casadocs.readthedocs.io/en/stable/notebooks/external-data.html for more information |
| 14-Oct-2026 11:39:32 | 2026-10-14 10:54:46 SEVERE ::casa |
| 14-Oct-2026 11:39:32 | 2026-10-14 10:54:46 SEVERE ::casa |
| 14-Oct-2026 11:39:32 | 2026-10-14 10:54:46 SEVERE ::casa The expected casa data was not found at measurespath. CASA may still work if the data can be found in datapath. |
| 14-Oct-2026 11:39:32 | 2026-10-14 10:54:46 SEVERE ::casa The expected measures data was not found at measurespath. CASA may still work if the data can be found in datapath. |
| 14-Oct-2026 11:39:32 | 2026-10-14 10:54:46 SEVERE ::casa visit https://casadocs.readthedocs.io/en/stable/notebooks/external-data.html for more information |
| 14-Oct-2026 11:39:32 | 2026-10-14 10:54:46 SEVERE ::casa |
| 14-Oct-2026 11:39:32 | 2026-10-14 10:54:46 SEVERE ::casa |
| 14-Oct-2026 11:39:32 | 2026-10-14 10:54:46 SEVERE ::casa The expected casa data was not found at measurespath. CASA may still work if the data can be found in datapath. |
| 14-Oct-2026 11:39:32 | 2026-10-14 10:54:46 SEVERE ::casa The expected measures data was not found at measurespath. CASA may still work if the data can be found in datapath. |
| 14-Oct-2026 11:39:32 | 2026-10-14 10:54:46 SEVERE ::casa visit https://casadocs.readthedocs.io/en/stable/notebooks/external-data.html for more information |
| 14-Oct-2026 11:39:32 | 2026-10-14 10:54:46 SEVERE ::casa |
| 14-Oct-2026 11:39:32 | 2026-10-14 10:54:46 SEVERE ::casa |
| 14-Oct-2026 11:39:32 | 2026-10-14 10:54:46 SEVERE ::casa The expected casa data was not found at measurespath. CASA may still work if the data can be found in datapath. |
| 14-Oct-2026 11:39:32 | 2026-10-14 10:54:46 SEVERE ::casa The expected measures data was not found at measurespath. CASA may still work if the data can be found in datapath. |
| 14-Oct-2026 11:39:32 | 2026-10-14 10:54:46 SEVERE ::casa visit https://casadocs.readthedocs.io/en/stable/notebooks/external-data.html for more information |
| 14-Oct-2026 11:39:32 | 2026-10-14 10:54:46 SEVERE ::casa |
| 14-Oct-2026 11:39:32 | 2026-10-14 10:54:46 SEVERE ::casa |
| 14-Oct-2026 11:39:32 | 2026-10-14 10:54:46 SEVERE ::casa The expected casa data was not found at measurespath. CASA may still work if the data can be found in datapath. |
| 14-Oct-2026 11:39:32 | 2026-10-14 10:54:46 SEVERE ::casa The expected measures data was not found at measurespath. CASA may still work if the data can be found in datapath. |
| 14-Oct-2026 11:39:32 | 2026-10-14 10:54:46 SEVERE ::casa visit https://casadocs.readthedocs.io/en/stable/notebooks/external-data.html for more information |
| 14-Oct-2026 11:39:32 | 2026-10-14 10:54:46 SEVERE ::casa |
| 14-Oct-2026 11:39:32 | 2026-10-14 10:54:46 SEVERE ::casa |
| 14-Oct-2026 11:39:32 | 2026-10-14 10:54:46 SEVERE ::casa The expected casa data was not found at measurespath. CASA may still work if the data can be found in datapath. |
| 14-Oct-2026 11:39:32 | 2026-10-14 10:54:46 SEVERE ::casa The expected measures data was not found at measurespath. CASA may still work if the data can be found in datapath. |
| 14-Oct-2026 11:39:32 | 2026-10-14 10:54:46 SEVERE ::casa visit https://casadocs.readthedocs.io/en/stable/notebooks/external-data.html for more information |
| 14-Oct-2026 11:39:32 | 2026-10-14 10:54:46 SEVERE ::casa |
| 14-Oct-2026 11:39:32 | 2026-10-14 10:54:46 SEVERE ::casa |
| 14-Oct-2026 11:39:32 | 2026-10-14 10:54:46 SEVERE ::casa The expected casa data was not found at measurespath. CASA may still work if the data can be found in datapath. |
| 14-Oct-2026 11:39:32 | 2026-10-14 10:54:46 SEVERE ::casa The expected measures data was not found at measurespath. CASA may still work if the data can be found in datapath. |
| 14-Oct-2026 11:39:32 | 2026-10-14 10:54:46 SEVERE ::casa visit https://casadocs.readthedocs.io/en/stable/notebooks/external-data.html for more information |
| 14-Oct-2026 11:39:32 | 2026-10-14 10:54:46 SEVERE ::casa |
| 14-Oct-2026 11:39:32 | 2026-10-14 10:54:46 SEVERE ::casa |
| 14-Oct-2026 11:39:32 | 2026-10-14 10:54:46 SEVERE ::casa The expected casa data was not found at measurespath. CASA may still work if the data can be found in datapath. |
| 14-Oct-2026 11:39:32 | 2026-10-14 10:54:46 SEVERE ::casa The expected measures data was not found at measurespath. CASA may still work if the data can be found in datapath. |
| 14-Oct-2026 11:39:32 | 2026-10-14 10:54:46 SEVERE ::casa visit https://casadocs.readthedocs.io/en/stable/notebooks/external-data.html for more information |
| 14-Oct-2026 11:39:32 | 2026-10-14 10:54:46 SEVERE ::casa |
| 14-Oct-2026 11:39:32 | 2026-10-14 10:54:46 SEVERE ::casa |
| 14-Oct-2026 11:39:32 | 2026-10-14 10:54:46 SEVERE ::casa The expected casa data was not found at measurespath. CASA may still work if the data can be found in datapath. |
| 14-Oct-2026 11:39:32 | 2026-10-14 10:54:46 SEVERE ::casa The expected measures data was not found at measurespath. CASA may still work if the data can be found in datapath. |
| 14-Oct-2026 11:39:32 | 2026-10-14 10:54:46 SEVERE ::casa visit https://casadocs.readthedocs.io/en/stable/notebooks/external-data.html for more information |
| 14-Oct-2026 11:39:32 | 2026-10-14 10:54:46 SEVERE ::casa |
| 14-Oct-2026 11:39:32 | 12 workers [18 items] |
| 14-Oct-2026 11:39:32 | |
| 14-Oct-2026 11:39:32 | scheduling tests via WorkStealingScheduling |
| 14-Oct-2026 11:39:32 | |
| 14-Oct-2026 11:39:32 | tests/regression/fast/vla_fast_test.py::test_13A_537__calibration__PPR__regression |
| 14-Oct-2026 11:39:32 | tests/regression/fast/alma_if_fast_test.py::test_uid___A002_Xef72bb_X9d29__renorm_restore_procedure_hifa_image__regression |
| 14-Oct-2026 11:39:32 | tests/regression/fast/alma_if_fast_test.py::test_uid___A002_Xee1eb6_Xc58d__procedure_hifa_calsurvey__regression |
| 14-Oct-2026 11:39:32 | tests/regression/fast/nobeyama_sd_fast_test.py::test_mg2_20170525142607_180419__PPR__regression |
| 14-Oct-2026 11:39:32 | tests/regression/fast/alma_if_fast_test.py::test_E2E6_1_00010_S__uid___A002_Xd0a588_X2239__procedure_hifa_image__regression |
| 14-Oct-2026 11:39:32 | tests/regression/fast/vla_fast_test.py::test_13A_537__restore__cont_cube_selfcal__regression |
| 14-Oct-2026 11:39:32 | tests/regression/fast/alma_sd_fast_test.py::test_uid___A002_X85c183_X36f_SPW15_23__PPR__regression |
| 14-Oct-2026 11:39:32 | tests/regression/fast/alma_if_fast_test.py::test_uid___A002_Xc845c0_X7366__cycle5_restore_procedure_hifa_image__regression |
| 14-Oct-2026 11:39:32 | tests/regression/fast/alma_if_fast_test.py::test_2022_1_00207_S__uid___A001_X2d20_X373d__PPR__regression |
| 14-Oct-2026 11:39:32 | tests/regression/fast/alma_if_fast_test.py::test_uid___A002_Xc46ab2_X15ae__selfcal_restore_procedure_hifa_image__regression |
| 14-Oct-2026 11:39:32 | tests/regression/fast/alma_if_fast_test.py::test_2023_1_00228_S__uid___A002_X1199f9e_X7c24__procedure_hifa_calimage_diffgain__regression |
| 14-Oct-2026 11:39:32 | tests/regression/fast/alma_if_fast_test.py::test_uid___A002_Xc46ab2_X15ae_repSPW_spw16_17_small__PPR__regression |
| 14-Oct-2026 11:39:32 | [gw11] PASSED tests/regression/fast/alma_sd_fast_test.py::test_uid___A002_X85c183_X36f_SPW15_23__PPR__regression |
| 14-Oct-2026 22:06:04 | tests/regression/fast/nobeyama_sd_fast_test.py::test_mg2_20170525142607_180419__procedure_hsdn_calimage__regression |
| 14-Oct-2026 22:06:04 | [gw0] PASSED tests/regression/fast/alma_if_fast_test.py::test_uid___A002_Xc46ab2_X15ae_repSPW_spw16_17_small__PPR__regression |
| 14-Oct-2026 22:06:04 | [gw10] PASSED tests/regression/fast/nobeyama_sd_fast_test.py::test_mg2_20170525142607_180419__PPR__regression |
| 14-Oct-2026 22:06:04 | tests/regression/fast/vla_fast_test.py::test_13A_537__procedure_hifv__regression |
| 14-Oct-2026 22:06:04 | [gw9] PASSED tests/regression/fast/vla_fast_test.py::test_13A_537__calibration__PPR__regression |
| 14-Oct-2026 22:06:04 | tests/regression/fast/vla_fast_test.py::test_13A_537__restore__PPR__regression |
| 14-Oct-2026 22:06:04 | [gw7] PASSED tests/regression/fast/alma_if_fast_test.py::test_uid___A002_Xc46ab2_X15ae__selfcal_restore_procedure_hifa_image__regression |
| 14-Oct-2026 22:06:04 | [gw9] PASSED tests/regression/fast/vla_fast_test.py::test_13A_537__restore__PPR__regression |
| 14-Oct-2026 22:06:04 | [gw11] PASSED tests/regression/fast/nobeyama_sd_fast_test.py::test_mg2_20170525142607_180419__procedure_hsdn_calimage__regression |
| 14-Oct-2026 22:06:04 | [gw10] PASSED tests/regression/fast/vla_fast_test.py::test_13A_537__procedure_hifv__regression |
| 14-Oct-2026 22:06:04 | [gw2] PASSED tests/regression/fast/alma_if_fast_test.py::test_uid___A002_Xef72bb_X9d29__renorm_restore_procedure_hifa_image__regression |
| 14-Oct-2026 22:06:04 | [gw3] PASSED tests/regression/fast/alma_if_fast_test.py::test_E2E6_1_00010_S__uid___A002_Xd0a588_X2239__procedure_hifa_image__regression |
| 14-Oct-2026 22:06:04 | tests/regression/fast/alma_if_fast_test.py::test_csv_3899_eb2_small__procedure_hifa_calimage__regression |
| 14-Oct-2026 22:06:04 | [gw5] PASSED tests/regression/fast/alma_if_fast_test.py::test_uid___A002_Xc845c0_X7366__cycle5_restore_procedure_hifa_image__regression |
| 14-Oct-2026 22:06:04 | [gw3] FAILED tests/regression/fast/alma_if_fast_test.py::test_csv_3899_eb2_small__procedure_hifa_calimage__regression |
| 14-Oct-2026 22:06:04 | [gw4] PASSED tests/regression/fast/alma_if_fast_test.py::test_uid___A002_Xee1eb6_Xc58d__procedure_hifa_calsurvey__regression |
| 14-Oct-2026 22:06:04 | tests/regression/fast/alma_sd_fast_test.py::test_uid___A002_X85c183_X36f__procedure_hsd_calimage__regression |
| 14-Oct-2026 22:06:04 | [gw8] PASSED tests/regression/fast/vla_fast_test.py::test_13A_537__restore__cont_cube_selfcal__regression |
| 14-Oct-2026 22:06:04 | tests/regression/fast/vlass_fast_test.py::test_TSKY0001__vlass_quicklook_regression |
| 14-Oct-2026 22:06:04 | [gw8] PASSED tests/regression/fast/vlass_fast_test.py::test_TSKY0001__vlass_quicklook_regression |
| 14-Oct-2026 22:06:04 | [gw4] PASSED tests/regression/fast/alma_sd_fast_test.py::test_uid___A002_X85c183_X36f__procedure_hsd_calimage__regression |
| 14-Oct-2026 22:06:04 | [gw6] PASSED tests/regression/fast/alma_if_fast_test.py::test_2022_1_00207_S__uid___A001_X2d20_X373d__PPR__regression |
| 14-Oct-2026 22:06:04 | [gw1] PASSED tests/regression/fast/alma_if_fast_test.py::test_2023_1_00228_S__uid___A002_X1199f9e_X7c24__procedure_hifa_calimage_diffgain__regression |
| 14-Oct-2026 22:06:04 | |
| 14-Oct-2026 22:06:04 | =================================== FAILURES =================================== |
| 14-Oct-2026 22:06:04 | _________ test_csv_3899_eb2_small__procedure_hifa_calimage__regression _________ |
| 14-Oct-2026 22:06:04 | [gw3] linux -- Python 3.12.4 /lustre/cv/sw/casa/casaci/cvpost128/bamboohome/xml-data/build-dir/PIPESPECS-TESTPIPE202621CASA674-ML228PY312TEST/casa-build-utils/pipeline/workdir/casa-6.7.4-12-pipeline-2026.2.1.55-py3.12.el8/lib/py/bin/python3 |
| 14-Oct-2026 22:06:04 | @pytest.mark.twelve |
| 14-Oct-2026 22:06:04 | def test_csv_3899_eb2_small__procedure_hifa_calimage__regression(): |
| 14-Oct-2026 22:06:04 | """PIPE-2245: Run small ALMA cal+image regression to cover various heuristics |
| 14-Oct-2026 22:06:04 | |
| 14-Oct-2026 22:06:04 | Recipe name: procedure_hifa_calimage |
| 14-Oct-2026 22:06:04 | Dataset: CSV-3899-EB2-small |
| 14-Oct-2026 22:06:04 | """ |
| 14-Oct-2026 22:06:04 | ref_directory = 'pl-regressiontest/CSV-3899-EB2-small' |
| 14-Oct-2026 22:06:04 | |
| 14-Oct-2026 22:06:04 | pt = PipelineTester( |
| 14-Oct-2026 22:06:04 | visname=['uid___A002_X1181695_X1c6a4_8ant.ms'], |
| 14-Oct-2026 22:06:04 | recipe='procedure_hifa_calimage.xml', |
| 14-Oct-2026 22:06:04 | input_dir=ref_directory, |
| 14-Oct-2026 22:06:04 | expectedoutput_dir=ref_directory, |
| 14-Oct-2026 22:06:04 | ) |
| 14-Oct-2026 22:06:04 | |
| 14-Oct-2026 22:06:04 | > pt.run(omp_num_threads=1) |
| 14-Oct-2026 22:06:04 | |
| 14-Oct-2026 22:06:04 | tests/regression/fast/alma_if_fast_test.py:181: |
| 14-Oct-2026 22:06:04 | _ _ _ _ _ _ _ _ _ _ _ _ _ _ _ _ _ _ _ _ _ _ _ _ _ _ _ _ _ _ _ _ _ _ _ _ _ _ _ _ |
| 14-Oct-2026 22:06:04 | tests/testing_utils.py:381: in run |
| 14-Oct-2026 22:06:04 | self.__compare_results(new_file, default_relative_tolerance) |
| 14-Oct-2026 22:06:04 | _ _ _ _ _ _ _ _ _ _ _ _ _ _ _ _ _ _ _ _ _ _ _ _ _ _ _ _ _ _ _ _ _ _ _ _ _ _ _ _ |
| 14-Oct-2026 22:06:04 | |
| 14-Oct-2026 22:06:04 | self = <tests.testing_utils.PipelineTester object at 0x7fde249c6a50> |
| 14-Oct-2026 22:06:04 | new_file = 'uid___A002_X1181695_X1c6a4_8ant.ms.NEW.results.txt' |
| 14-Oct-2026 22:06:04 | relative_tolerance = 1e-07 |
| 14-Oct-2026 22:06:04 | |
| 14-Oct-2026 22:06:04 | def __compare_results(self, new_file: str, relative_tolerance: float) -> None: |
| 14-Oct-2026 22:06:04 | """ |
| 14-Oct-2026 22:06:04 | Compare results between new one loaded from file and old one. |
| 14-Oct-2026 22:06:04 | |
| 14-Oct-2026 22:06:04 | Args: |
| 14-Oct-2026 22:06:04 | new_file : file path of new results |
| 14-Oct-2026 22:06:04 | relative_tolerance : relative tolerance of output value |
| 14-Oct-2026 22:06:04 | """ |
| 14-Oct-2026 22:06:04 | with open(self.expectedoutput_file) as expected_fd, open(new_file) as new_fd: |
| 14-Oct-2026 22:06:04 | expected_results = expected_fd.readlines() |
| 14-Oct-2026 22:06:04 | new_results = new_fd.readlines() |
| 14-Oct-2026 22:06:04 | errors = [] |
| 14-Oct-2026 22:06:04 | worst_diff = (0, 0) |
| 14-Oct-2026 22:06:04 | worst_percent_diff = (0, 0) |
| 14-Oct-2026 22:06:04 | for old, new in zip(expected_results, new_results): |
| 14-Oct-2026 22:06:04 | try: |
| 14-Oct-2026 22:06:04 | oldkey, oldval, tol = self.__sanitize_results_string(old) |
| 14-Oct-2026 22:06:04 | newkey, newval, _ = self.__sanitize_results_string(new) |
| 14-Oct-2026 22:06:04 | except ValueError as e: |
| 14-Oct-2026 22:06:04 | errorstr = "The results: {0} could not be parsed. Error: {1}".format(new, str(e)) |
| 14-Oct-2026 22:06:04 | errors.append(errorstr) |
| 14-Oct-2026 22:06:04 | continue |
| 14-Oct-2026 22:06:04 | |
| 14-Oct-2026 22:06:04 | assert oldkey == newkey, f"Expected key {oldkey} does not match new key {newkey}." |
| 14-Oct-2026 22:06:04 | tolerance = tol if tol else relative_tolerance |
| 14-Oct-2026 22:06:04 | if newval is not None: |
| 14-Oct-2026 22:06:04 | LOG.info('Comparing %s to %s with a rel. tolerance of %s', oldval, newval, tolerance) |
| 14-Oct-2026 22:06:04 | if oldval != pytest.approx(newval, rel=tolerance): |
| 14-Oct-2026 22:06:04 | diff = oldval-newval |
| 14-Oct-2026 22:06:04 | percent_diff = (oldval-newval)/oldval * 100 if oldval != 0 else 100 |
| 14-Oct-2026 22:06:04 | if abs(diff) > abs(worst_diff[0]): |
| 14-Oct-2026 22:06:04 | worst_diff = diff, oldkey |
| 14-Oct-2026 22:06:04 | if abs(percent_diff) > abs(worst_percent_diff[0]): |
| 14-Oct-2026 22:06:04 | worst_percent_diff = percent_diff, oldkey |
| 14-Oct-2026 22:06:04 | errorstr = f"{oldkey}\n\tvalues differ by > a relative difference of {tolerance}\n\texpected: {oldval}\n\tnew: {newval}\n\tdiff: {diff}\n\tpercent_diff: {percent_diff}%" |
| 14-Oct-2026 22:06:04 | errors.append(errorstr) |
| 14-Oct-2026 22:06:04 | elif oldval is not None: |
| 14-Oct-2026 22:06:04 | # If only the new value is None, fail |
| 14-Oct-2026 22:06:04 | errorstr = f"{oldkey}\n\tvalue is None\n\texpected: {oldval}\n\tnew: {newval}" |
| 14-Oct-2026 22:06:04 | errors.append(errorstr) |
| 14-Oct-2026 22:06:04 | else: |
| 14-Oct-2026 22:06:04 | # If old and new values are both None, this is expected, so pass |
| 14-Oct-2026 22:06:04 | LOG.info('Comparing %s and %s... both values are None.', oldval, newval) |
| 14-Oct-2026 22:06:04 | |
| 14-Oct-2026 22:06:04 | [LOG.warning(x) for x in errors] |
| 14-Oct-2026 22:06:04 | n_errors = len(errors) |
| 14-Oct-2026 22:06:04 | if n_errors > 0: |
| 14-Oct-2026 22:06:04 | summary_str = f"Worst absolute diff, {worst_diff[1]}: {worst_diff[0]}\nWorst percentage diff, {worst_percent_diff[1]}: {worst_percent_diff[0]}%" |
| 14-Oct-2026 22:06:04 | errors.append(summary_str) |
| 14-Oct-2026 22:06:04 | > pytest.fail("Failed to match {0} result value{1} within tolerance{1} :\n{2}".format( |
| 14-Oct-2026 22:06:04 | n_errors, '' if n_errors == 1 else 's', '\n'.join(errors)), pytrace=True) |
| 14-Oct-2026 22:06:04 | E Failed: Failed to match 2 result values within tolerances : |
| 14-Oct-2026 22:06:04 | E s16.hifa_gfluxscaleflag.uid___A002_X1181695_X1c6a4_8ant.qa.metric.CorrectedampflagQAHandler |
| 14-Oct-2026 22:06:04 | E values differ by > a relative difference of 1e-07 |
| 14-Oct-2026 22:06:04 | E expected: 0.0053688072299937365 |
| 14-Oct-2026 22:06:04 | E new: 0.0 |
| 14-Oct-2026 22:06:04 | E diff: 0.0053688072299937365 |
| 14-Oct-2026 22:06:04 | E percent_diff: 100.0% |
| 14-Oct-2026 22:06:04 | E s16.hifa_gfluxscaleflag.uid___A002_X1181695_X1c6a4_8ant.qa.score.CorrectedampflagQAHandler |
| 14-Oct-2026 22:06:04 | E values differ by > a relative difference of 1e-07 |
| 14-Oct-2026 22:06:04 | E expected: 0.9946311927700062 |
| 14-Oct-2026 22:06:04 | E new: 1.0 |
| 14-Oct-2026 22:06:04 | E diff: -0.005368807229993777 |
| 14-Oct-2026 22:06:04 | E percent_diff: -0.539778690736802% |
| 14-Oct-2026 22:06:04 | E Worst absolute diff, s16.hifa_gfluxscaleflag.uid___A002_X1181695_X1c6a4_8ant.qa.score.CorrectedampflagQAHandler: -0.005368807229993777 |
| 14-Oct-2026 22:06:04 | E Worst percentage diff, s16.hifa_gfluxscaleflag.uid___A002_X1181695_X1c6a4_8ant.qa.metric.CorrectedampflagQAHandler: 100.0% |
| 14-Oct-2026 22:06:04 | |
| 14-Oct-2026 22:06:04 | tests/testing_utils.py:440: Failed |
| 14-Oct-2026 22:06:04 | ------------------------------ Captured log call ------------------------------- |
| 14-Oct-2026 22:06:04 | WARNING matplotlib.axes._base:_base.py:2096 Ignoring fixed x limits to fulfill fixed data aspect with adjustable data limits. |
| 14-Oct-2026 22:06:04 | WARNING matplotlib.axes._base:_base.py:2096 Ignoring fixed x limits to fulfill fixed data aspect with adjustable data limits. |
| 14-Oct-2026 22:06:04 | WARNING matplotlib.axes._base:_base.py:2096 Ignoring fixed x limits to fulfill fixed data aspect with adjustable data limits. |
| 14-Oct-2026 22:06:04 | INFO root:logs.py:724 bpcal.bpcal: Bandpass statistics started for uid___A002_X1181695_X1c6a4_8ant.ms.hifa_bandpass.s14_0.spw16_22_24.channel.solintinf.bcal.tbl ... |
| 14-Oct-2026 22:06:04 | INFO root:logs.py:724 bpcal.bpcal: Bandpass statistics of uid___A002_X1181695_X1c6a4_8ant.ms.hifa_bandpass.s14_0.spw16_22_24.channel.solintinf.bcal.tbl calculated ... |
| 14-Oct-2026 22:06:04 | INFO root:logs.py:724 bpcal.bpcal: Bandpass statistics written in /tmp/tmparq08043/uid___A002_X1181695_X1c6a4_8ant.ms.hifa_bandpass.s14_0.spw16_22_24.channel.solintinf.bcal.bpcal.stats ... |
| 14-Oct-2026 22:06:04 | INFO root:logs.py:724 bpcal.bpcal: Bandpass scores of uid___A002_X1181695_X1c6a4_8ant.ms.hifa_bandpass.s14_0.spw16_22_24.channel.solintinf.bcal.tbl calculated ... |
| 14-Oct-2026 22:06:04 | INFO root:logs.py:724 bpcal.bpcal: Bandpass calibration statistics finished for uid___A002_X1181695_X1c6a4_8ant.ms.hifa_bandpass.s14_0.spw16_22_24.channel.solintinf.bcal.tbl ... |
| 14-Oct-2026 22:06:04 | |
| 14-Oct-2026 22:06:04 | INFO root:logs.py:724 bpcal.bpcal: Bandpass statistics started for uid___A002_X1181695_X1c6a4_8ant.ms.hifa_bandpass.s14_0.spw16_22_24.channel.solintinf.bcal.tbl ... |
| 14-Oct-2026 22:06:04 | INFO root:logs.py:724 bpcal.bpcal: Bandpass statistics of uid___A002_X1181695_X1c6a4_8ant.ms.hifa_bandpass.s14_0.spw16_22_24.channel.solintinf.bcal.tbl calculated ... |
| 14-Oct-2026 22:06:04 | INFO root:logs.py:724 bpcal.bpcal: Bandpass statistics written in /tmp/tmpz4r0a995/uid___A002_X1181695_X1c6a4_8ant.ms.hifa_bandpass.s14_0.spw16_22_24.channel.solintinf.bcal.bpcal.stats ... |
| 14-Oct-2026 22:06:04 | INFO root:logs.py:724 bpcal.bpcal: Bandpass scores of uid___A002_X1181695_X1c6a4_8ant.ms.hifa_bandpass.s14_0.spw16_22_24.channel.solintinf.bcal.tbl calculated ... |
| 14-Oct-2026 22:06:04 | INFO root:logs.py:724 bpcal.bpcal: Bandpass calibration statistics finished for uid___A002_X1181695_X1c6a4_8ant.ms.hifa_bandpass.s14_0.spw16_22_24.channel.solintinf.bcal.tbl ... |
| 14-Oct-2026 22:06:04 | |
| 14-Oct-2026 22:06:04 | WARNING matplotlib.axes._base:_base.py:2096 Ignoring fixed x limits to fulfill fixed data aspect with adjustable data limits. |
| 14-Oct-2026 22:06:04 | WARNING matplotlib.axes._base:_base.py:2096 Ignoring fixed x limits to fulfill fixed data aspect with adjustable data limits. |
| 14-Oct-2026 22:06:04 | =============================== warnings summary =============================== |
| 14-Oct-2026 22:06:04 | ../casa-6.7.4-12-pipeline-2026.2.1.55-py3.12.el8/lib/py/lib/python3.12/site-packages/casaconfig/private/get_data_info.py:195: 12 warnings |
| 14-Oct-2026 22:06:04 | /lustre/cv/sw/casa/casaci/cvpost128/bamboohome/xml-data/build-dir/PIPESPECS-TESTPIPE202621CASA674-ML228PY312TEST/casa-build-utils/pipeline/workdir/casa-6.7.4-12-pipeline-2026.2.1.55-py3.12.el8/lib/py/lib/python3.12/site-packages/casaconfig/private/get_data_info.py:195: DeprecationWarning: read_text is deprecated. Use files() instead. Refer to https://importlib-resources.readthedocs.io/en/latest/using.html#migrating-from-legacy for migration advice. |
| 14-Oct-2026 22:06:04 | readme_lines = importlib.resources.read_text('casaconfig','release_data_readme.txt').split('\n') |
| 14-Oct-2026 22:06:04 | |
| 14-Oct-2026 22:06:04 | ../casa-6.7.4-12-pipeline-2026.2.1.55-py3.12.el8/lib/py/lib/python3.12/importlib/resources/_legacy.py:79: 12 warnings |
| 14-Oct-2026 22:06:04 | /lustre/cv/sw/casa/casaci/cvpost128/bamboohome/xml-data/build-dir/PIPESPECS-TESTPIPE202621CASA674-ML228PY312TEST/casa-build-utils/pipeline/workdir/casa-6.7.4-12-pipeline-2026.2.1.55-py3.12.el8/lib/py/lib/python3.12/importlib/resources/_legacy.py:79: DeprecationWarning: open_text is deprecated. Use files() instead. Refer to https://importlib-resources.readthedocs.io/en/latest/using.html#migrating-from-legacy for migration advice. |
| 14-Oct-2026 22:06:04 | with open_text(package, resource, encoding, errors) as fp: |
| 14-Oct-2026 22:06:04 | |
| 14-Oct-2026 22:06:04 | ../casa-6.7.4-12-pipeline-2026.2.1.55-py3.12.el8/lib/py/lib/python3.12/site-packages/google/protobuf/internal/well_known_types.py:91: 12 warnings |
| 14-Oct-2026 22:06:04 | /lustre/cv/sw/casa/casaci/cvpost128/bamboohome/xml-data/build-dir/PIPESPECS-TESTPIPE202621CASA674-ML228PY312TEST/casa-build-utils/pipeline/workdir/casa-6.7.4-12-pipeline-2026.2.1.55-py3.12.el8/lib/py/lib/python3.12/site-packages/google/protobuf/internal/well_known_types.py:91: DeprecationWarning: datetime.datetime.utcfromtimestamp() is deprecated and scheduled for removal in a future version. Use timezone-aware objects to represent datetimes in UTC: datetime.datetime.fromtimestamp(timestamp, datetime.UTC). |
| 14-Oct-2026 22:06:04 | _EPOCH_DATETIME_NAIVE = datetime.datetime.utcfromtimestamp(0) |
| 14-Oct-2026 22:06:04 | |
| 14-Oct-2026 22:06:04 | ../casa-6.7.4-12-pipeline-2026.2.1.55-py3.12.el8/lib/py/lib/python3.12/site-packages/casaplotms/private/plotms_pb2.py:19: 12 warnings |
| 14-Oct-2026 22:06:04 | /lustre/cv/sw/casa/casaci/cvpost128/bamboohome/xml-data/build-dir/PIPESPECS-TESTPIPE202621CASA674-ML228PY312TEST/casa-build-utils/pipeline/workdir/casa-6.7.4-12-pipeline-2026.2.1.55-py3.12.el8/lib/py/lib/python3.12/site-packages/casaplotms/private/plotms_pb2.py:19: DeprecationWarning: Call to deprecated create function FileDescriptor(). Note: Create unlinked descriptors is going to go away. Please use get/find descriptors from generated code or query the descriptor_pool. |
| 14-Oct-2026 22:06:04 | DESCRIPTOR = _descriptor.FileDescriptor( |
| 14-Oct-2026 22:06:04 | |
| 14-Oct-2026 22:06:04 | ../casa-6.7.4-12-pipeline-2026.2.1.55-py3.12.el8/lib/py/lib/python3.12/site-packages/casaplotms/private/plotms_pb2.py:38: 12 warnings |
| 14-Oct-2026 22:06:04 | /lustre/cv/sw/casa/casaci/cvpost128/bamboohome/xml-data/build-dir/PIPESPECS-TESTPIPE202621CASA674-ML228PY312TEST/casa-build-utils/pipeline/workdir/casa-6.7.4-12-pipeline-2026.2.1.55-py3.12.el8/lib/py/lib/python3.12/site-packages/casaplotms/private/plotms_pb2.py:38: DeprecationWarning: Call to deprecated create function FieldDescriptor(). Note: Create unlinked descriptors is going to go away. Please use get/find descriptors from generated code or query the descriptor_pool. |
| 14-Oct-2026 22:06:04 | _descriptor.FieldDescriptor( |
| 14-Oct-2026 22:06:04 | |
| 14-Oct-2026 22:06:04 | ../casa-6.7.4-12-pipeline-2026.2.1.55-py3.12.el8/lib/py/lib/python3.12/site-packages/casaplotms/private/plotms_pb2.py:31: 12 warnings |
| 14-Oct-2026 22:06:04 | /lustre/cv/sw/casa/casaci/cvpost128/bamboohome/xml-data/build-dir/PIPESPECS-TESTPIPE202621CASA674-ML228PY312TEST/casa-build-utils/pipeline/workdir/casa-6.7.4-12-pipeline-2026.2.1.55-py3.12.el8/lib/py/lib/python3.12/site-packages/casaplotms/private/plotms_pb2.py:31: DeprecationWarning: Call to deprecated create function Descriptor(). Note: Create unlinked descriptors is going to go away. Please use get/find descriptors from generated code or query the descriptor_pool. |
| 14-Oct-2026 22:06:04 | _PID = _descriptor.Descriptor( |
| 14-Oct-2026 22:06:04 | |
| 14-Oct-2026 22:06:04 | ../casa-6.7.4-12-pipeline-2026.2.1.55-py3.12.el8/lib/py/lib/python3.12/site-packages/casaplotms/private/plotms_pb2.py:69: 12 warnings |
| 14-Oct-2026 22:06:04 | /lustre/cv/sw/casa/casaci/cvpost128/bamboohome/xml-data/build-dir/PIPESPECS-TESTPIPE202621CASA674-ML228PY312TEST/casa-build-utils/pipeline/workdir/casa-6.7.4-12-pipeline-2026.2.1.55-py3.12.el8/lib/py/lib/python3.12/site-packages/casaplotms/private/plotms_pb2.py:69: DeprecationWarning: Call to deprecated create function FieldDescriptor(). Note: Create unlinked descriptors is going to go away. Please use get/find descriptors from generated code or query the descriptor_pool. |
| 14-Oct-2026 22:06:04 | _descriptor.FieldDescriptor( |
| 14-Oct-2026 22:06:04 | |
| 14-Oct-2026 22:06:04 | ../casa-6.7.4-12-pipeline-2026.2.1.55-py3.12.el8/lib/py/lib/python3.12/site-packages/casaplotms/private/plotms_pb2.py:62: 12 warnings |
| 14-Oct-2026 22:06:04 | /lustre/cv/sw/casa/casaci/cvpost128/bamboohome/xml-data/build-dir/PIPESPECS-TESTPIPE202621CASA674-ML228PY312TEST/casa-build-utils/pipeline/workdir/casa-6.7.4-12-pipeline-2026.2.1.55-py3.12.el8/lib/py/lib/python3.12/site-packages/casaplotms/private/plotms_pb2.py:62: DeprecationWarning: Call to deprecated create function Descriptor(). Note: Create unlinked descriptors is going to go away. Please use get/find descriptors from generated code or query the descriptor_pool. |
| 14-Oct-2026 22:06:04 | _NUMPLOTS = _descriptor.Descriptor( |
| 14-Oct-2026 22:06:04 | |
| 14-Oct-2026 22:06:04 | ../casa-6.7.4-12-pipeline-2026.2.1.55-py3.12.el8/lib/py/lib/python3.12/site-packages/casaplotms/private/plotms_pb2.py:100: 12 warnings |
| 14-Oct-2026 22:06:04 | /lustre/cv/sw/casa/casaci/cvpost128/bamboohome/xml-data/build-dir/PIPESPECS-TESTPIPE202621CASA674-ML228PY312TEST/casa-build-utils/pipeline/workdir/casa-6.7.4-12-pipeline-2026.2.1.55-py3.12.el8/lib/py/lib/python3.12/site-packages/casaplotms/private/plotms_pb2.py:100: DeprecationWarning: Call to deprecated create function FieldDescriptor(). Note: Create unlinked descriptors is going to go away. Please use get/find descriptors from generated code or query the descriptor_pool. |
| 14-Oct-2026 22:06:04 | _descriptor.FieldDescriptor( |
| 14-Oct-2026 22:06:04 | |
| 14-Oct-2026 22:06:04 | ../casa-6.7.4-12-pipeline-2026.2.1.55-py3.12.el8/lib/py/lib/python3.12/site-packages/casaplotms/private/plotms_pb2.py:93: 12 warnings |
| 14-Oct-2026 22:06:04 | /lustre/cv/sw/casa/casaci/cvpost128/bamboohome/xml-data/build-dir/PIPESPECS-TESTPIPE202621CASA674-ML228PY312TEST/casa-build-utils/pipeline/workdir/casa-6.7.4-12-pipeline-2026.2.1.55-py3.12.el8/lib/py/lib/python3.12/site-packages/casaplotms/private/plotms_pb2.py:93: DeprecationWarning: Call to deprecated create function Descriptor(). Note: Create unlinked descriptors is going to go away. Please use get/find descriptors from generated code or query the descriptor_pool. |
| 14-Oct-2026 22:06:04 | _TOGGLE = _descriptor.Descriptor( |
| 14-Oct-2026 22:06:04 | |
| 14-Oct-2026 22:06:04 | ../casa-6.7.4-12-pipeline-2026.2.1.55-py3.12.el8/lib/py/lib/python3.12/site-packages/casaplotms/private/plotms_pb2.py:131: 12 warnings |
| 14-Oct-2026 22:06:04 | /lustre/cv/sw/casa/casaci/cvpost128/bamboohome/xml-data/build-dir/PIPESPECS-TESTPIPE202621CASA674-ML228PY312TEST/casa-build-utils/pipeline/workdir/casa-6.7.4-12-pipeline-2026.2.1.55-py3.12.el8/lib/py/lib/python3.12/site-packages/casaplotms/private/plotms_pb2.py:131: DeprecationWarning: Call to deprecated create function FieldDescriptor(). Note: Create unlinked descriptors is going to go away. Please use get/find descriptors from generated code or query the descriptor_pool. |
| 14-Oct-2026 22:06:04 | _descriptor.FieldDescriptor( |
| 14-Oct-2026 22:06:04 | |
| 14-Oct-2026 22:06:04 | ../casa-6.7.4-12-pipeline-2026.2.1.55-py3.12.el8/lib/py/lib/python3.12/site-packages/casaplotms/private/plotms_pb2.py:138: 12 warnings |
| 14-Oct-2026 22:06:04 | /lustre/cv/sw/casa/casaci/cvpost128/bamboohome/xml-data/build-dir/PIPESPECS-TESTPIPE202621CASA674-ML228PY312TEST/casa-build-utils/pipeline/workdir/casa-6.7.4-12-pipeline-2026.2.1.55-py3.12.el8/lib/py/lib/python3.12/site-packages/casaplotms/private/plotms_pb2.py:138: DeprecationWarning: Call to deprecated create function FieldDescriptor(). Note: Create unlinked descriptors is going to go away. Please use get/find descriptors from generated code or query the descriptor_pool. |
| 14-Oct-2026 22:06:04 | _descriptor.FieldDescriptor( |
| 14-Oct-2026 22:06:04 | |
| 14-Oct-2026 22:06:04 | ../casa-6.7.4-12-pipeline-2026.2.1.55-py3.12.el8/lib/py/lib/python3.12/site-packages/casaplotms/private/plotms_pb2.py:124: 12 warnings |
| 14-Oct-2026 22:06:04 | /lustre/cv/sw/casa/casaci/cvpost128/bamboohome/xml-data/build-dir/PIPESPECS-TESTPIPE202621CASA674-ML228PY312TEST/casa-build-utils/pipeline/workdir/casa-6.7.4-12-pipeline-2026.2.1.55-py3.12.el8/lib/py/lib/python3.12/site-packages/casaplotms/private/plotms_pb2.py:124: DeprecationWarning: Call to deprecated create function Descriptor(). Note: Create unlinked descriptors is going to go away. Please use get/find descriptors from generated code or query the descriptor_pool. |
| 14-Oct-2026 22:06:04 | _GRIDSIZE = _descriptor.Descriptor( |
| 14-Oct-2026 22:06:04 | |
| 14-Oct-2026 22:06:04 | ../casa-6.7.4-12-pipeline-2026.2.1.55-py3.12.el8/lib/py/lib/python3.12/site-packages/casaplotms/private/plotms_pb2.py:169: 12 warnings |
| 14-Oct-2026 22:06:04 | /lustre/cv/sw/casa/casaci/cvpost128/bamboohome/xml-data/build-dir/PIPESPECS-TESTPIPE202621CASA674-ML228PY312TEST/casa-build-utils/pipeline/workdir/casa-6.7.4-12-pipeline-2026.2.1.55-py3.12.el8/lib/py/lib/python3.12/site-packages/casaplotms/private/plotms_pb2.py:169: DeprecationWarning: Call to deprecated create function FieldDescriptor(). Note: Create unlinked descriptors is going to go away. Please use get/find descriptors from generated code or query the descriptor_pool. |
| 14-Oct-2026 22:06:04 | _descriptor.FieldDescriptor( |
| 14-Oct-2026 22:06:04 | |
| 14-Oct-2026 22:06:04 | ../casa-6.7.4-12-pipeline-2026.2.1.55-py3.12.el8/lib/py/lib/python3.12/site-packages/casaplotms/private/plotms_pb2.py:176: 12 warnings |
| 14-Oct-2026 22:06:04 | /lustre/cv/sw/casa/casaci/cvpost128/bamboohome/xml-data/build-dir/PIPESPECS-TESTPIPE202621CASA674-ML228PY312TEST/casa-build-utils/pipeline/workdir/casa-6.7.4-12-pipeline-2026.2.1.55-py3.12.el8/lib/py/lib/python3.12/site-packages/casaplotms/private/plotms_pb2.py:176: DeprecationWarning: Call to deprecated create function FieldDescriptor(). Note: Create unlinked descriptors is going to go away. Please use get/find descriptors from generated code or query the descriptor_pool. |
| 14-Oct-2026 22:06:04 | _descriptor.FieldDescriptor( |
| 14-Oct-2026 22:06:04 | |
| 14-Oct-2026 22:06:04 | ../casa-6.7.4-12-pipeline-2026.2.1.55-py3.12.el8/lib/py/lib/python3.12/site-packages/casaplotms/private/plotms_pb2.py:183: 12 warnings |
| 14-Oct-2026 22:06:04 | /lustre/cv/sw/casa/casaci/cvpost128/bamboohome/xml-data/build-dir/PIPESPECS-TESTPIPE202621CASA674-ML228PY312TEST/casa-build-utils/pipeline/workdir/casa-6.7.4-12-pipeline-2026.2.1.55-py3.12.el8/lib/py/lib/python3.12/site-packages/casaplotms/private/plotms_pb2.py:183: DeprecationWarning: Call to deprecated create function FieldDescriptor(). Note: Create unlinked descriptors is going to go away. Please use get/find descriptors from generated code or query the descriptor_pool. |
| 14-Oct-2026 22:06:04 | _descriptor.FieldDescriptor( |
| 14-Oct-2026 22:06:04 | |
| 14-Oct-2026 22:06:04 | ../casa-6.7.4-12-pipeline-2026.2.1.55-py3.12.el8/lib/py/lib/python3.12/site-packages/casaplotms/private/plotms_pb2.py:162: 12 warnings |
| 14-Oct-2026 22:06:04 | /lustre/cv/sw/casa/casaci/cvpost128/bamboohome/xml-data/build-dir/PIPESPECS-TESTPIPE202621CASA674-ML228PY312TEST/casa-build-utils/pipeline/workdir/casa-6.7.4-12-pipeline-2026.2.1.55-py3.12.el8/lib/py/lib/python3.12/site-packages/casaplotms/private/plotms_pb2.py:162: DeprecationWarning: Call to deprecated create function Descriptor(). Note: Create unlinked descriptors is going to go away. Please use get/find descriptors from generated code or query the descriptor_pool. |
| 14-Oct-2026 22:06:04 | _SETVIS = _descriptor.Descriptor( |
| 14-Oct-2026 22:06:04 | |
| 14-Oct-2026 22:06:04 | ../casa-6.7.4-12-pipeline-2026.2.1.55-py3.12.el8/lib/py/lib/python3.12/site-packages/casaplotms/private/plotms_pb2.py:214: 12 warnings |
| 14-Oct-2026 22:06:04 | /lustre/cv/sw/casa/casaci/cvpost128/bamboohome/xml-data/build-dir/PIPESPECS-TESTPIPE202621CASA674-ML228PY312TEST/casa-build-utils/pipeline/workdir/casa-6.7.4-12-pipeline-2026.2.1.55-py3.12.el8/lib/py/lib/python3.12/site-packages/casaplotms/private/plotms_pb2.py:214: DeprecationWarning: Call to deprecated create function FieldDescriptor(). Note: Create unlinked descriptors is going to go away. Please use get/find descriptors from generated code or query the descriptor_pool. |
| 14-Oct-2026 22:06:04 | _descriptor.FieldDescriptor( |
| 14-Oct-2026 22:06:04 | |
| 14-Oct-2026 22:06:04 | ../casa-6.7.4-12-pipeline-2026.2.1.55-py3.12.el8/lib/py/lib/python3.12/site-packages/casaplotms/private/plotms_pb2.py:221: 12 warnings |
| 14-Oct-2026 22:06:04 | /lustre/cv/sw/casa/casaci/cvpost128/bamboohome/xml-data/build-dir/PIPESPECS-TESTPIPE202621CASA674-ML228PY312TEST/casa-build-utils/pipeline/workdir/casa-6.7.4-12-pipeline-2026.2.1.55-py3.12.el8/lib/py/lib/python3.12/site-packages/casaplotms/private/plotms_pb2.py:221: DeprecationWarning: Call to deprecated create function FieldDescriptor(). Note: Create unlinked descriptors is going to go away. Please use get/find descriptors from generated code or query the descriptor_pool. |
| 14-Oct-2026 22:06:04 | _descriptor.FieldDescriptor( |
| 14-Oct-2026 22:06:04 | |
| 14-Oct-2026 22:06:04 | ../casa-6.7.4-12-pipeline-2026.2.1.55-py3.12.el8/lib/py/lib/python3.12/site-packages/casaplotms/private/plotms_pb2.py:228: 12 warnings |
| 14-Oct-2026 22:06:04 | /lustre/cv/sw/casa/casaci/cvpost128/bamboohome/xml-data/build-dir/PIPESPECS-TESTPIPE202621CASA674-ML228PY312TEST/casa-build-utils/pipeline/workdir/casa-6.7.4-12-pipeline-2026.2.1.55-py3.12.el8/lib/py/lib/python3.12/site-packages/casaplotms/private/plotms_pb2.py:228: DeprecationWarning: Call to deprecated create function FieldDescriptor(). Note: Create unlinked descriptors is going to go away. Please use get/find descriptors from generated code or query the descriptor_pool. |
| 14-Oct-2026 22:06:04 | _descriptor.FieldDescriptor( |
| 14-Oct-2026 22:06:04 | |
| 14-Oct-2026 22:06:04 | ../casa-6.7.4-12-pipeline-2026.2.1.55-py3.12.el8/lib/py/lib/python3.12/site-packages/casaplotms/private/plotms_pb2.py:235: 12 warnings |
| 14-Oct-2026 22:06:04 | /lustre/cv/sw/casa/casaci/cvpost128/bamboohome/xml-data/build-dir/PIPESPECS-TESTPIPE202621CASA674-ML228PY312TEST/casa-build-utils/pipeline/workdir/casa-6.7.4-12-pipeline-2026.2.1.55-py3.12.el8/lib/py/lib/python3.12/site-packages/casaplotms/private/plotms_pb2.py:235: DeprecationWarning: Call to deprecated create function FieldDescriptor(). Note: Create unlinked descriptors is going to go away. Please use get/find descriptors from generated code or query the descriptor_pool. |
| 14-Oct-2026 22:06:04 | _descriptor.FieldDescriptor( |
| 14-Oct-2026 22:06:04 | |
| 14-Oct-2026 22:06:04 | ../casa-6.7.4-12-pipeline-2026.2.1.55-py3.12.el8/lib/py/lib/python3.12/site-packages/casaplotms/private/plotms_pb2.py:242: 12 warnings |
| 14-Oct-2026 22:06:04 | /lustre/cv/sw/casa/casaci/cvpost128/bamboohome/xml-data/build-dir/PIPESPECS-TESTPIPE202621CASA674-ML228PY312TEST/casa-build-utils/pipeline/workdir/casa-6.7.4-12-pipeline-2026.2.1.55-py3.12.el8/lib/py/lib/python3.12/site-packages/casaplotms/private/plotms_pb2.py:242: DeprecationWarning: Call to deprecated create function FieldDescriptor(). Note: Create unlinked descriptors is going to go away. Please use get/find descriptors from generated code or query the descriptor_pool. |
| 14-Oct-2026 22:06:04 | _descriptor.FieldDescriptor( |
| 14-Oct-2026 22:06:04 | |
| 14-Oct-2026 22:06:04 | ../casa-6.7.4-12-pipeline-2026.2.1.55-py3.12.el8/lib/py/lib/python3.12/site-packages/casaplotms/private/plotms_pb2.py:249: 12 warnings |
| 14-Oct-2026 22:06:04 | /lustre/cv/sw/casa/casaci/cvpost128/bamboohome/xml-data/build-dir/PIPESPECS-TESTPIPE202621CASA674-ML228PY312TEST/casa-build-utils/pipeline/workdir/casa-6.7.4-12-pipeline-2026.2.1.55-py3.12.el8/lib/py/lib/python3.12/site-packages/casaplotms/private/plotms_pb2.py:249: DeprecationWarning: Call to deprecated create function FieldDescriptor(). Note: Create unlinked descriptors is going to go away. Please use get/find descriptors from generated code or query the descriptor_pool. |
| 14-Oct-2026 22:06:04 | _descriptor.FieldDescriptor( |
| 14-Oct-2026 22:06:04 | |
| 14-Oct-2026 22:06:04 | ../casa-6.7.4-12-pipeline-2026.2.1.55-py3.12.el8/lib/py/lib/python3.12/site-packages/casaplotms/private/plotms_pb2.py:256: 12 warnings |
| 14-Oct-2026 22:06:04 | /lustre/cv/sw/casa/casaci/cvpost128/bamboohome/xml-data/build-dir/PIPESPECS-TESTPIPE202621CASA674-ML228PY312TEST/casa-build-utils/pipeline/workdir/casa-6.7.4-12-pipeline-2026.2.1.55-py3.12.el8/lib/py/lib/python3.12/site-packages/casaplotms/private/plotms_pb2.py:256: DeprecationWarning: Call to deprecated create function FieldDescriptor(). Note: Create unlinked descriptors is going to go away. Please use get/find descriptors from generated code or query the descriptor_pool. |
| 14-Oct-2026 22:06:04 | _descriptor.FieldDescriptor( |
| 14-Oct-2026 22:06:04 | |
| 14-Oct-2026 22:06:04 | ../casa-6.7.4-12-pipeline-2026.2.1.55-py3.12.el8/lib/py/lib/python3.12/site-packages/casaplotms/private/plotms_pb2.py:263: 12 warnings |
| 14-Oct-2026 22:06:04 | /lustre/cv/sw/casa/casaci/cvpost128/bamboohome/xml-data/build-dir/PIPESPECS-TESTPIPE202621CASA674-ML228PY312TEST/casa-build-utils/pipeline/workdir/casa-6.7.4-12-pipeline-2026.2.1.55-py3.12.el8/lib/py/lib/python3.12/site-packages/casaplotms/private/plotms_pb2.py:263: DeprecationWarning: Call to deprecated create function FieldDescriptor(). Note: Create unlinked descriptors is going to go away. Please use get/find descriptors from generated code or query the descriptor_pool. |
| 14-Oct-2026 22:06:04 | _descriptor.FieldDescriptor( |
| 14-Oct-2026 22:06:04 | |
| 14-Oct-2026 22:06:04 | ../casa-6.7.4-12-pipeline-2026.2.1.55-py3.12.el8/lib/py/lib/python3.12/site-packages/casaplotms/private/plotms_pb2.py:270: 12 warnings |
| 14-Oct-2026 22:06:04 | /lustre/cv/sw/casa/casaci/cvpost128/bamboohome/xml-data/build-dir/PIPESPECS-TESTPIPE202621CASA674-ML228PY312TEST/casa-build-utils/pipeline/workdir/casa-6.7.4-12-pipeline-2026.2.1.55-py3.12.el8/lib/py/lib/python3.12/site-packages/casaplotms/private/plotms_pb2.py:270: DeprecationWarning: Call to deprecated create function FieldDescriptor(). Note: Create unlinked descriptors is going to go away. Please use get/find descriptors from generated code or query the descriptor_pool. |
| 14-Oct-2026 22:06:04 | _descriptor.FieldDescriptor( |
| 14-Oct-2026 22:06:04 | |
| 14-Oct-2026 22:06:04 | ../casa-6.7.4-12-pipeline-2026.2.1.55-py3.12.el8/lib/py/lib/python3.12/site-packages/casaplotms/private/plotms_pb2.py:277: 12 warnings |
| 14-Oct-2026 22:06:04 | /lustre/cv/sw/casa/casaci/cvpost128/bamboohome/xml-data/build-dir/PIPESPECS-TESTPIPE202621CASA674-ML228PY312TEST/casa-build-utils/pipeline/workdir/casa-6.7.4-12-pipeline-2026.2.1.55-py3.12.el8/lib/py/lib/python3.12/site-packages/casaplotms/private/plotms_pb2.py:277: DeprecationWarning: Call to deprecated create function FieldDescriptor(). Note: Create unlinked descriptors is going to go away. Please use get/find descriptors from generated code or query the descriptor_pool. |
| 14-Oct-2026 22:06:04 | _descriptor.FieldDescriptor( |
| 14-Oct-2026 22:06:04 | |
| 14-Oct-2026 22:06:04 | ../casa-6.7.4-12-pipeline-2026.2.1.55-py3.12.el8/lib/py/lib/python3.12/site-packages/casaplotms/private/plotms_pb2.py:284: 12 warnings |
| 14-Oct-2026 22:06:04 | /lustre/cv/sw/casa/casaci/cvpost128/bamboohome/xml-data/build-dir/PIPESPECS-TESTPIPE202621CASA674-ML228PY312TEST/casa-build-utils/pipeline/workdir/casa-6.7.4-12-pipeline-2026.2.1.55-py3.12.el8/lib/py/lib/python3.12/site-packages/casaplotms/private/plotms_pb2.py:284: DeprecationWarning: Call to deprecated create function FieldDescriptor(). Note: Create unlinked descriptors is going to go away. Please use get/find descriptors from generated code or query the descriptor_pool. |
| 14-Oct-2026 22:06:04 | _descriptor.FieldDescriptor( |
| 14-Oct-2026 22:06:04 | |
| 14-Oct-2026 22:06:04 | ../casa-6.7.4-12-pipeline-2026.2.1.55-py3.12.el8/lib/py/lib/python3.12/site-packages/casaplotms/private/plotms_pb2.py:291: 12 warnings |
| 14-Oct-2026 22:06:04 | /lustre/cv/sw/casa/casaci/cvpost128/bamboohome/xml-data/build-dir/PIPESPECS-TESTPIPE202621CASA674-ML228PY312TEST/casa-build-utils/pipeline/workdir/casa-6.7.4-12-pipeline-2026.2.1.55-py3.12.el8/lib/py/lib/python3.12/site-packages/casaplotms/private/plotms_pb2.py:291: DeprecationWarning: Call to deprecated create function FieldDescriptor(). Note: Create unlinked descriptors is going to go away. Please use get/find descriptors from generated code or query the descriptor_pool. |
| 14-Oct-2026 22:06:04 | _descriptor.FieldDescriptor( |
| 14-Oct-2026 22:06:04 | |
| 14-Oct-2026 22:06:04 | ../casa-6.7.4-12-pipeline-2026.2.1.55-py3.12.el8/lib/py/lib/python3.12/site-packages/casaplotms/private/plotms_pb2.py:207: 12 warnings |
| 14-Oct-2026 22:06:04 | /lustre/cv/sw/casa/casaci/cvpost128/bamboohome/xml-data/build-dir/PIPESPECS-TESTPIPE202621CASA674-ML228PY312TEST/casa-build-utils/pipeline/workdir/casa-6.7.4-12-pipeline-2026.2.1.55-py3.12.el8/lib/py/lib/python3.12/site-packages/casaplotms/private/plotms_pb2.py:207: DeprecationWarning: Call to deprecated create function Descriptor(). Note: Create unlinked descriptors is going to go away. Please use get/find descriptors from generated code or query the descriptor_pool. |
| 14-Oct-2026 22:06:04 | _SETAXES = _descriptor.Descriptor( |
| 14-Oct-2026 22:06:04 | |
| 14-Oct-2026 22:06:04 | ../casa-6.7.4-12-pipeline-2026.2.1.55-py3.12.el8/lib/py/lib/python3.12/site-packages/casaplotms/private/plotms_pb2.py:322: 12 warnings |
| 14-Oct-2026 22:06:04 | /lustre/cv/sw/casa/casaci/cvpost128/bamboohome/xml-data/build-dir/PIPESPECS-TESTPIPE202621CASA674-ML228PY312TEST/casa-build-utils/pipeline/workdir/casa-6.7.4-12-pipeline-2026.2.1.55-py3.12.el8/lib/py/lib/python3.12/site-packages/casaplotms/private/plotms_pb2.py:322: DeprecationWarning: Call to deprecated create function FieldDescriptor(). Note: Create unlinked descriptors is going to go away. Please use get/find descriptors from generated code or query the descriptor_pool. |
| 14-Oct-2026 22:06:04 | _descriptor.FieldDescriptor( |
| 14-Oct-2026 22:06:04 | |
| 14-Oct-2026 22:06:04 | ../casa-6.7.4-12-pipeline-2026.2.1.55-py3.12.el8/lib/py/lib/python3.12/site-packages/casaplotms/private/plotms_pb2.py:329: 12 warnings |
| 14-Oct-2026 22:06:04 | /lustre/cv/sw/casa/casaci/cvpost128/bamboohome/xml-data/build-dir/PIPESPECS-TESTPIPE202621CASA674-ML228PY312TEST/casa-build-utils/pipeline/workdir/casa-6.7.4-12-pipeline-2026.2.1.55-py3.12.el8/lib/py/lib/python3.12/site-packages/casaplotms/private/plotms_pb2.py:329: DeprecationWarning: Call to deprecated create function FieldDescriptor(). Note: Create unlinked descriptors is going to go away. Please use get/find descriptors from generated code or query the descriptor_pool. |
| 14-Oct-2026 22:06:04 | _descriptor.FieldDescriptor( |
| 14-Oct-2026 22:06:04 | |
| 14-Oct-2026 22:06:04 | ../casa-6.7.4-12-pipeline-2026.2.1.55-py3.12.el8/lib/py/lib/python3.12/site-packages/casaplotms/private/plotms_pb2.py:336: 12 warnings |
| 14-Oct-2026 22:06:04 | /lustre/cv/sw/casa/casaci/cvpost128/bamboohome/xml-data/build-dir/PIPESPECS-TESTPIPE202621CASA674-ML228PY312TEST/casa-build-utils/pipeline/workdir/casa-6.7.4-12-pipeline-2026.2.1.55-py3.12.el8/lib/py/lib/python3.12/site-packages/casaplotms/private/plotms_pb2.py:336: DeprecationWarning: Call to deprecated create function FieldDescriptor(). Note: Create unlinked descriptors is going to go away. Please use get/find descriptors from generated code or query the descriptor_pool. |
| 14-Oct-2026 22:06:04 | _descriptor.FieldDescriptor( |
| 14-Oct-2026 22:06:04 | |
| 14-Oct-2026 22:06:04 | ../casa-6.7.4-12-pipeline-2026.2.1.55-py3.12.el8/lib/py/lib/python3.12/site-packages/casaplotms/private/plotms_pb2.py:315: 12 warnings |
| 14-Oct-2026 22:06:04 | /lustre/cv/sw/casa/casaci/cvpost128/bamboohome/xml-data/build-dir/PIPESPECS-TESTPIPE202621CASA674-ML228PY312TEST/casa-build-utils/pipeline/workdir/casa-6.7.4-12-pipeline-2026.2.1.55-py3.12.el8/lib/py/lib/python3.12/site-packages/casaplotms/private/plotms_pb2.py:315: DeprecationWarning: Call to deprecated create function Descriptor(). Note: Create unlinked descriptors is going to go away. Please use get/find descriptors from generated code or query the descriptor_pool. |
| 14-Oct-2026 22:06:04 | _SETTOGGLE = _descriptor.Descriptor( |
| 14-Oct-2026 22:06:04 | |
| 14-Oct-2026 22:06:04 | ../casa-6.7.4-12-pipeline-2026.2.1.55-py3.12.el8/lib/py/lib/python3.12/site-packages/casaplotms/private/plotms_pb2.py:367: 12 warnings |
| 14-Oct-2026 22:06:04 | /lustre/cv/sw/casa/casaci/cvpost128/bamboohome/xml-data/build-dir/PIPESPECS-TESTPIPE202621CASA674-ML228PY312TEST/casa-build-utils/pipeline/workdir/casa-6.7.4-12-pipeline-2026.2.1.55-py3.12.el8/lib/py/lib/python3.12/site-packages/casaplotms/private/plotms_pb2.py:367: DeprecationWarning: Call to deprecated create function FieldDescriptor(). Note: Create unlinked descriptors is going to go away. Please use get/find descriptors from generated code or query the descriptor_pool. |
| 14-Oct-2026 22:06:04 | _descriptor.FieldDescriptor( |
| 14-Oct-2026 22:06:04 | |
| 14-Oct-2026 22:06:04 | ../casa-6.7.4-12-pipeline-2026.2.1.55-py3.12.el8/lib/py/lib/python3.12/site-packages/casaplotms/private/plotms_pb2.py:374: 12 warnings |
| 14-Oct-2026 22:06:04 | /lustre/cv/sw/casa/casaci/cvpost128/bamboohome/xml-data/build-dir/PIPESPECS-TESTPIPE202621CASA674-ML228PY312TEST/casa-build-utils/pipeline/workdir/casa-6.7.4-12-pipeline-2026.2.1.55-py3.12.el8/lib/py/lib/python3.12/site-packages/casaplotms/private/plotms_pb2.py:374: DeprecationWarning: Call to deprecated create function FieldDescriptor(). Note: Create unlinked descriptors is going to go away. Please use get/find descriptors from generated code or query the descriptor_pool. |
| 14-Oct-2026 22:06:04 | _descriptor.FieldDescriptor( |
| 14-Oct-2026 22:06:04 | |
| 14-Oct-2026 22:06:04 | ../casa-6.7.4-12-pipeline-2026.2.1.55-py3.12.el8/lib/py/lib/python3.12/site-packages/casaplotms/private/plotms_pb2.py:381: 12 warnings |
| 14-Oct-2026 22:06:04 | /lustre/cv/sw/casa/casaci/cvpost128/bamboohome/xml-data/build-dir/PIPESPECS-TESTPIPE202621CASA674-ML228PY312TEST/casa-build-utils/pipeline/workdir/casa-6.7.4-12-pipeline-2026.2.1.55-py3.12.el8/lib/py/lib/python3.12/site-packages/casaplotms/private/plotms_pb2.py:381: DeprecationWarning: Call to deprecated create function FieldDescriptor(). Note: Create unlinked descriptors is going to go away. Please use get/find descriptors from generated code or query the descriptor_pool. |
| 14-Oct-2026 22:06:04 | _descriptor.FieldDescriptor( |
| 14-Oct-2026 22:06:04 | |
| 14-Oct-2026 22:06:04 | ../casa-6.7.4-12-pipeline-2026.2.1.55-py3.12.el8/lib/py/lib/python3.12/site-packages/casaplotms/private/plotms_pb2.py:388: 12 warnings |
| 14-Oct-2026 22:06:04 | /lustre/cv/sw/casa/casaci/cvpost128/bamboohome/xml-data/build-dir/PIPESPECS-TESTPIPE202621CASA674-ML228PY312TEST/casa-build-utils/pipeline/workdir/casa-6.7.4-12-pipeline-2026.2.1.55-py3.12.el8/lib/py/lib/python3.12/site-packages/casaplotms/private/plotms_pb2.py:388: DeprecationWarning: Call to deprecated create function FieldDescriptor(). Note: Create unlinked descriptors is going to go away. Please use get/find descriptors from generated code or query the descriptor_pool. |
| 14-Oct-2026 22:06:04 | _descriptor.FieldDescriptor( |
| 14-Oct-2026 22:06:04 | |
| 14-Oct-2026 22:06:04 | ../casa-6.7.4-12-pipeline-2026.2.1.55-py3.12.el8/lib/py/lib/python3.12/site-packages/casaplotms/private/plotms_pb2.py:395: 12 warnings |
| 14-Oct-2026 22:06:04 | /lustre/cv/sw/casa/casaci/cvpost128/bamboohome/xml-data/build-dir/PIPESPECS-TESTPIPE202621CASA674-ML228PY312TEST/casa-build-utils/pipeline/workdir/casa-6.7.4-12-pipeline-2026.2.1.55-py3.12.el8/lib/py/lib/python3.12/site-packages/casaplotms/private/plotms_pb2.py:395: DeprecationWarning: Call to deprecated create function FieldDescriptor(). Note: Create unlinked descriptors is going to go away. Please use get/find descriptors from generated code or query the descriptor_pool. |
| 14-Oct-2026 22:06:04 | _descriptor.FieldDescriptor( |
| 14-Oct-2026 22:06:04 | |
| 14-Oct-2026 22:06:04 | ../casa-6.7.4-12-pipeline-2026.2.1.55-py3.12.el8/lib/py/lib/python3.12/site-packages/casaplotms/private/plotms_pb2.py:402: 12 warnings |
| 14-Oct-2026 22:06:04 | /lustre/cv/sw/casa/casaci/cvpost128/bamboohome/xml-data/build-dir/PIPESPECS-TESTPIPE202621CASA674-ML228PY312TEST/casa-build-utils/pipeline/workdir/casa-6.7.4-12-pipeline-2026.2.1.55-py3.12.el8/lib/py/lib/python3.12/site-packages/casaplotms/private/plotms_pb2.py:402: DeprecationWarning: Call to deprecated create function FieldDescriptor(). Note: Create unlinked descriptors is going to go away. Please use get/find descriptors from generated code or query the descriptor_pool. |
| 14-Oct-2026 22:06:04 | _descriptor.FieldDescriptor( |
| 14-Oct-2026 22:06:04 | |
| 14-Oct-2026 22:06:04 | ../casa-6.7.4-12-pipeline-2026.2.1.55-py3.12.el8/lib/py/lib/python3.12/site-packages/casaplotms/private/plotms_pb2.py:409: 12 warnings |
| 14-Oct-2026 22:06:04 | /lustre/cv/sw/casa/casaci/cvpost128/bamboohome/xml-data/build-dir/PIPESPECS-TESTPIPE202621CASA674-ML228PY312TEST/casa-build-utils/pipeline/workdir/casa-6.7.4-12-pipeline-2026.2.1.55-py3.12.el8/lib/py/lib/python3.12/site-packages/casaplotms/private/plotms_pb2.py:409: DeprecationWarning: Call to deprecated create function FieldDescriptor(). Note: Create unlinked descriptors is going to go away. Please use get/find descriptors from generated code or query the descriptor_pool. |
| 14-Oct-2026 22:06:04 | _descriptor.FieldDescriptor( |
| 14-Oct-2026 22:06:04 | |
| 14-Oct-2026 22:06:04 | ../casa-6.7.4-12-pipeline-2026.2.1.55-py3.12.el8/lib/py/lib/python3.12/site-packages/casaplotms/private/plotms_pb2.py:416: 12 warnings |
| 14-Oct-2026 22:06:04 | /lustre/cv/sw/casa/casaci/cvpost128/bamboohome/xml-data/build-dir/PIPESPECS-TESTPIPE202621CASA674-ML228PY312TEST/casa-build-utils/pipeline/workdir/casa-6.7.4-12-pipeline-2026.2.1.55-py3.12.el8/lib/py/lib/python3.12/site-packages/casaplotms/private/plotms_pb2.py:416: DeprecationWarning: Call to deprecated create function FieldDescriptor(). Note: Create unlinked descriptors is going to go away. Please use get/find descriptors from generated code or query the descriptor_pool. |
| 14-Oct-2026 22:06:04 | _descriptor.FieldDescriptor( |
| 14-Oct-2026 22:06:04 | |
| 14-Oct-2026 22:06:04 | ../casa-6.7.4-12-pipeline-2026.2.1.55-py3.12.el8/lib/py/lib/python3.12/site-packages/casaplotms/private/plotms_pb2.py:423: 12 warnings |
| 14-Oct-2026 22:06:04 | /lustre/cv/sw/casa/casaci/cvpost128/bamboohome/xml-data/build-dir/PIPESPECS-TESTPIPE202621CASA674-ML228PY312TEST/casa-build-utils/pipeline/workdir/casa-6.7.4-12-pipeline-2026.2.1.55-py3.12.el8/lib/py/lib/python3.12/site-packages/casaplotms/private/plotms_pb2.py:423: DeprecationWarning: Call to deprecated create function FieldDescriptor(). Note: Create unlinked descriptors is going to go away. Please use get/find descriptors from generated code or query the descriptor_pool. |
| 14-Oct-2026 22:06:04 | _descriptor.FieldDescriptor( |
| 14-Oct-2026 22:06:04 | |
| 14-Oct-2026 22:06:04 | ../casa-6.7.4-12-pipeline-2026.2.1.55-py3.12.el8/lib/py/lib/python3.12/site-packages/casaplotms/private/plotms_pb2.py:430: 12 warnings |
| 14-Oct-2026 22:06:04 | /lustre/cv/sw/casa/casaci/cvpost128/bamboohome/xml-data/build-dir/PIPESPECS-TESTPIPE202621CASA674-ML228PY312TEST/casa-build-utils/pipeline/workdir/casa-6.7.4-12-pipeline-2026.2.1.55-py3.12.el8/lib/py/lib/python3.12/site-packages/casaplotms/private/plotms_pb2.py:430: DeprecationWarning: Call to deprecated create function FieldDescriptor(). Note: Create unlinked descriptors is going to go away. Please use get/find descriptors from generated code or query the descriptor_pool. |
| 14-Oct-2026 22:06:04 | _descriptor.FieldDescriptor( |
| 14-Oct-2026 22:06:04 | |
| 14-Oct-2026 22:06:04 | ../casa-6.7.4-12-pipeline-2026.2.1.55-py3.12.el8/lib/py/lib/python3.12/site-packages/casaplotms/private/plotms_pb2.py:437: 12 warnings |
| 14-Oct-2026 22:06:04 | /lustre/cv/sw/casa/casaci/cvpost128/bamboohome/xml-data/build-dir/PIPESPECS-TESTPIPE202621CASA674-ML228PY312TEST/casa-build-utils/pipeline/workdir/casa-6.7.4-12-pipeline-2026.2.1.55-py3.12.el8/lib/py/lib/python3.12/site-packages/casaplotms/private/plotms_pb2.py:437: DeprecationWarning: Call to deprecated create function FieldDescriptor(). Note: Create unlinked descriptors is going to go away. Please use get/find descriptors from generated code or query the descriptor_pool. |
| 14-Oct-2026 22:06:04 | _descriptor.FieldDescriptor( |
| 14-Oct-2026 22:06:04 | |
| 14-Oct-2026 22:06:04 | ../casa-6.7.4-12-pipeline-2026.2.1.55-py3.12.el8/lib/py/lib/python3.12/site-packages/casaplotms/private/plotms_pb2.py:444: 12 warnings |
| 14-Oct-2026 22:06:04 | /lustre/cv/sw/casa/casaci/cvpost128/bamboohome/xml-data/build-dir/PIPESPECS-TESTPIPE202621CASA674-ML228PY312TEST/casa-build-utils/pipeline/workdir/casa-6.7.4-12-pipeline-2026.2.1.55-py3.12.el8/lib/py/lib/python3.12/site-packages/casaplotms/private/plotms_pb2.py:444: DeprecationWarning: Call to deprecated create function FieldDescriptor(). Note: Create unlinked descriptors is going to go away. Please use get/find descriptors from generated code or query the descriptor_pool. |
| 14-Oct-2026 22:06:04 | _descriptor.FieldDescriptor( |
| 14-Oct-2026 22:06:04 | |
| 14-Oct-2026 22:06:04 | ../casa-6.7.4-12-pipeline-2026.2.1.55-py3.12.el8/lib/py/lib/python3.12/site-packages/casaplotms/private/plotms_pb2.py:451: 12 warnings |
| 14-Oct-2026 22:06:04 | /lustre/cv/sw/casa/casaci/cvpost128/bamboohome/xml-data/build-dir/PIPESPECS-TESTPIPE202621CASA674-ML228PY312TEST/casa-build-utils/pipeline/workdir/casa-6.7.4-12-pipeline-2026.2.1.55-py3.12.el8/lib/py/lib/python3.12/site-packages/casaplotms/private/plotms_pb2.py:451: DeprecationWarning: Call to deprecated create function FieldDescriptor(). Note: Create unlinked descriptors is going to go away. Please use get/find descriptors from generated code or query the descriptor_pool. |
| 14-Oct-2026 22:06:04 | _descriptor.FieldDescriptor( |
| 14-Oct-2026 22:06:04 | |
| 14-Oct-2026 22:06:04 | ../casa-6.7.4-12-pipeline-2026.2.1.55-py3.12.el8/lib/py/lib/python3.12/site-packages/casaplotms/private/plotms_pb2.py:458: 12 warnings |
| 14-Oct-2026 22:06:04 | /lustre/cv/sw/casa/casaci/cvpost128/bamboohome/xml-data/build-dir/PIPESPECS-TESTPIPE202621CASA674-ML228PY312TEST/casa-build-utils/pipeline/workdir/casa-6.7.4-12-pipeline-2026.2.1.55-py3.12.el8/lib/py/lib/python3.12/site-packages/casaplotms/private/plotms_pb2.py:458: DeprecationWarning: Call to deprecated create function FieldDescriptor(). Note: Create unlinked descriptors is going to go away. Please use get/find descriptors from generated code or query the descriptor_pool. |
| 14-Oct-2026 22:06:04 | _descriptor.FieldDescriptor( |
| 14-Oct-2026 22:06:04 | |
| 14-Oct-2026 22:06:04 | ../casa-6.7.4-12-pipeline-2026.2.1.55-py3.12.el8/lib/py/lib/python3.12/site-packages/casaplotms/private/plotms_pb2.py:465: 12 warnings |
| 14-Oct-2026 22:06:04 | /lustre/cv/sw/casa/casaci/cvpost128/bamboohome/xml-data/build-dir/PIPESPECS-TESTPIPE202621CASA674-ML228PY312TEST/casa-build-utils/pipeline/workdir/casa-6.7.4-12-pipeline-2026.2.1.55-py3.12.el8/lib/py/lib/python3.12/site-packages/casaplotms/private/plotms_pb2.py:465: DeprecationWarning: Call to deprecated create function FieldDescriptor(). Note: Create unlinked descriptors is going to go away. Please use get/find descriptors from generated code or query the descriptor_pool. |
| 14-Oct-2026 22:06:04 | _descriptor.FieldDescriptor( |
| 14-Oct-2026 22:06:04 | |
| 14-Oct-2026 22:06:04 | ../casa-6.7.4-12-pipeline-2026.2.1.55-py3.12.el8/lib/py/lib/python3.12/site-packages/casaplotms/private/plotms_pb2.py:360: 12 warnings |
| 14-Oct-2026 22:06:04 | /lustre/cv/sw/casa/casaci/cvpost128/bamboohome/xml-data/build-dir/PIPESPECS-TESTPIPE202621CASA674-ML228PY312TEST/casa-build-utils/pipeline/workdir/casa-6.7.4-12-pipeline-2026.2.1.55-py3.12.el8/lib/py/lib/python3.12/site-packages/casaplotms/private/plotms_pb2.py:360: DeprecationWarning: Call to deprecated create function Descriptor(). Note: Create unlinked descriptors is going to go away. Please use get/find descriptors from generated code or query the descriptor_pool. |
| 14-Oct-2026 22:06:04 | _SETSELECTION = _descriptor.Descriptor( |
| 14-Oct-2026 22:06:04 | |
| 14-Oct-2026 22:06:04 | ../casa-6.7.4-12-pipeline-2026.2.1.55-py3.12.el8/lib/py/lib/python3.12/site-packages/casaplotms/private/plotms_pb2.py:496: 12 warnings |
| 14-Oct-2026 22:06:04 | /lustre/cv/sw/casa/casaci/cvpost128/bamboohome/xml-data/build-dir/PIPESPECS-TESTPIPE202621CASA674-ML228PY312TEST/casa-build-utils/pipeline/workdir/casa-6.7.4-12-pipeline-2026.2.1.55-py3.12.el8/lib/py/lib/python3.12/site-packages/casaplotms/private/plotms_pb2.py:496: DeprecationWarning: Call to deprecated create function FieldDescriptor(). Note: Create unlinked descriptors is going to go away. Please use get/find descriptors from generated code or query the descriptor_pool. |
| 14-Oct-2026 22:06:04 | _descriptor.FieldDescriptor( |
| 14-Oct-2026 22:06:04 | |
| 14-Oct-2026 22:06:04 | ../casa-6.7.4-12-pipeline-2026.2.1.55-py3.12.el8/lib/py/lib/python3.12/site-packages/casaplotms/private/plotms_pb2.py:503: 12 warnings |
| 14-Oct-2026 22:06:04 | /lustre/cv/sw/casa/casaci/cvpost128/bamboohome/xml-data/build-dir/PIPESPECS-TESTPIPE202621CASA674-ML228PY312TEST/casa-build-utils/pipeline/workdir/casa-6.7.4-12-pipeline-2026.2.1.55-py3.12.el8/lib/py/lib/python3.12/site-packages/casaplotms/private/plotms_pb2.py:503: DeprecationWarning: Call to deprecated create function FieldDescriptor(). Note: Create unlinked descriptors is going to go away. Please use get/find descriptors from generated code or query the descriptor_pool. |
| 14-Oct-2026 22:06:04 | _descriptor.FieldDescriptor( |
| 14-Oct-2026 22:06:04 | |
| 14-Oct-2026 22:06:04 | ../casa-6.7.4-12-pipeline-2026.2.1.55-py3.12.el8/lib/py/lib/python3.12/site-packages/casaplotms/private/plotms_pb2.py:510: 12 warnings |
| 14-Oct-2026 22:06:04 | /lustre/cv/sw/casa/casaci/cvpost128/bamboohome/xml-data/build-dir/PIPESPECS-TESTPIPE202621CASA674-ML228PY312TEST/casa-build-utils/pipeline/workdir/casa-6.7.4-12-pipeline-2026.2.1.55-py3.12.el8/lib/py/lib/python3.12/site-packages/casaplotms/private/plotms_pb2.py:510: DeprecationWarning: Call to deprecated create function FieldDescriptor(). Note: Create unlinked descriptors is going to go away. Please use get/find descriptors from generated code or query the descriptor_pool. |
| 14-Oct-2026 22:06:04 | _descriptor.FieldDescriptor( |
| 14-Oct-2026 22:06:04 | |
| 14-Oct-2026 22:06:04 | ../casa-6.7.4-12-pipeline-2026.2.1.55-py3.12.el8/lib/py/lib/python3.12/site-packages/casaplotms/private/plotms_pb2.py:517: 12 warnings |
| 14-Oct-2026 22:06:04 | /lustre/cv/sw/casa/casaci/cvpost128/bamboohome/xml-data/build-dir/PIPESPECS-TESTPIPE202621CASA674-ML228PY312TEST/casa-build-utils/pipeline/workdir/casa-6.7.4-12-pipeline-2026.2.1.55-py3.12.el8/lib/py/lib/python3.12/site-packages/casaplotms/private/plotms_pb2.py:517: DeprecationWarning: Call to deprecated create function FieldDescriptor(). Note: Create unlinked descriptors is going to go away. Please use get/find descriptors from generated code or query the descriptor_pool. |
| 14-Oct-2026 22:06:04 | _descriptor.FieldDescriptor( |
| 14-Oct-2026 22:06:04 | |
| 14-Oct-2026 22:06:04 | ../casa-6.7.4-12-pipeline-2026.2.1.55-py3.12.el8/lib/py/lib/python3.12/site-packages/casaplotms/private/plotms_pb2.py:524: 12 warnings |
| 14-Oct-2026 22:06:04 | /lustre/cv/sw/casa/casaci/cvpost128/bamboohome/xml-data/build-dir/PIPESPECS-TESTPIPE202621CASA674-ML228PY312TEST/casa-build-utils/pipeline/workdir/casa-6.7.4-12-pipeline-2026.2.1.55-py3.12.el8/lib/py/lib/python3.12/site-packages/casaplotms/private/plotms_pb2.py:524: DeprecationWarning: Call to deprecated create function FieldDescriptor(). Note: Create unlinked descriptors is going to go away. Please use get/find descriptors from generated code or query the descriptor_pool. |
| 14-Oct-2026 22:06:04 | _descriptor.FieldDescriptor( |
| 14-Oct-2026 22:06:04 | |
| 14-Oct-2026 22:06:04 | ../casa-6.7.4-12-pipeline-2026.2.1.55-py3.12.el8/lib/py/lib/python3.12/site-packages/casaplotms/private/plotms_pb2.py:531: 12 warnings |
| 14-Oct-2026 22:06:04 | /lustre/cv/sw/casa/casaci/cvpost128/bamboohome/xml-data/build-dir/PIPESPECS-TESTPIPE202621CASA674-ML228PY312TEST/casa-build-utils/pipeline/workdir/casa-6.7.4-12-pipeline-2026.2.1.55-py3.12.el8/lib/py/lib/python3.12/site-packages/casaplotms/private/plotms_pb2.py:531: DeprecationWarning: Call to deprecated create function FieldDescriptor(). Note: Create unlinked descriptors is going to go away. Please use get/find descriptors from generated code or query the descriptor_pool. |
| 14-Oct-2026 22:06:04 | _descriptor.FieldDescriptor( |
| 14-Oct-2026 22:06:04 | |
| 14-Oct-2026 22:06:04 | ../casa-6.7.4-12-pipeline-2026.2.1.55-py3.12.el8/lib/py/lib/python3.12/site-packages/casaplotms/private/plotms_pb2.py:538: 12 warnings |
| 14-Oct-2026 22:06:04 | /lustre/cv/sw/casa/casaci/cvpost128/bamboohome/xml-data/build-dir/PIPESPECS-TESTPIPE202621CASA674-ML228PY312TEST/casa-build-utils/pipeline/workdir/casa-6.7.4-12-pipeline-2026.2.1.55-py3.12.el8/lib/py/lib/python3.12/site-packages/casaplotms/private/plotms_pb2.py:538: DeprecationWarning: Call to deprecated create function FieldDescriptor(). Note: Create unlinked descriptors is going to go away. Please use get/find descriptors from generated code or query the descriptor_pool. |
| 14-Oct-2026 22:06:04 | _descriptor.FieldDescriptor( |
| 14-Oct-2026 22:06:04 | |
| 14-Oct-2026 22:06:04 | ../casa-6.7.4-12-pipeline-2026.2.1.55-py3.12.el8/lib/py/lib/python3.12/site-packages/casaplotms/private/plotms_pb2.py:545: 12 warnings |
| 14-Oct-2026 22:06:04 | /lustre/cv/sw/casa/casaci/cvpost128/bamboohome/xml-data/build-dir/PIPESPECS-TESTPIPE202621CASA674-ML228PY312TEST/casa-build-utils/pipeline/workdir/casa-6.7.4-12-pipeline-2026.2.1.55-py3.12.el8/lib/py/lib/python3.12/site-packages/casaplotms/private/plotms_pb2.py:545: DeprecationWarning: Call to deprecated create function FieldDescriptor(). Note: Create unlinked descriptors is going to go away. Please use get/find descriptors from generated code or query the descriptor_pool. |
| 14-Oct-2026 22:06:04 | _descriptor.FieldDescriptor( |
| 14-Oct-2026 22:06:04 | |
| 14-Oct-2026 22:06:04 | ../casa-6.7.4-12-pipeline-2026.2.1.55-py3.12.el8/lib/py/lib/python3.12/site-packages/casaplotms/private/plotms_pb2.py:552: 12 warnings |
| 14-Oct-2026 22:06:04 | /lustre/cv/sw/casa/casaci/cvpost128/bamboohome/xml-data/build-dir/PIPESPECS-TESTPIPE202621CASA674-ML228PY312TEST/casa-build-utils/pipeline/workdir/casa-6.7.4-12-pipeline-2026.2.1.55-py3.12.el8/lib/py/lib/python3.12/site-packages/casaplotms/private/plotms_pb2.py:552: DeprecationWarning: Call to deprecated create function FieldDescriptor(). Note: Create unlinked descriptors is going to go away. Please use get/find descriptors from generated code or query the descriptor_pool. |
| 14-Oct-2026 22:06:04 | _descriptor.FieldDescriptor( |
| 14-Oct-2026 22:06:04 | |
| 14-Oct-2026 22:06:04 | ../casa-6.7.4-12-pipeline-2026.2.1.55-py3.12.el8/lib/py/lib/python3.12/site-packages/casaplotms/private/plotms_pb2.py:559: 12 warnings |
| 14-Oct-2026 22:06:04 | /lustre/cv/sw/casa/casaci/cvpost128/bamboohome/xml-data/build-dir/PIPESPECS-TESTPIPE202621CASA674-ML228PY312TEST/casa-build-utils/pipeline/workdir/casa-6.7.4-12-pipeline-2026.2.1.55-py3.12.el8/lib/py/lib/python3.12/site-packages/casaplotms/private/plotms_pb2.py:559: DeprecationWarning: Call to deprecated create function FieldDescriptor(). Note: Create unlinked descriptors is going to go away. Please use get/find descriptors from generated code or query the descriptor_pool. |
| 14-Oct-2026 22:06:04 | _descriptor.FieldDescriptor( |
| 14-Oct-2026 22:06:04 | |
| 14-Oct-2026 22:06:04 | ../casa-6.7.4-12-pipeline-2026.2.1.55-py3.12.el8/lib/py/lib/python3.12/site-packages/casaplotms/private/plotms_pb2.py:489: 12 warnings |
| 14-Oct-2026 22:06:04 | /lustre/cv/sw/casa/casaci/cvpost128/bamboohome/xml-data/build-dir/PIPESPECS-TESTPIPE202621CASA674-ML228PY312TEST/casa-build-utils/pipeline/workdir/casa-6.7.4-12-pipeline-2026.2.1.55-py3.12.el8/lib/py/lib/python3.12/site-packages/casaplotms/private/plotms_pb2.py:489: DeprecationWarning: Call to deprecated create function Descriptor(). Note: Create unlinked descriptors is going to go away. Please use get/find descriptors from generated code or query the descriptor_pool. |
| 14-Oct-2026 22:06:04 | _SETAVERAGING = _descriptor.Descriptor( |
| 14-Oct-2026 22:06:04 | |
| 14-Oct-2026 22:06:04 | ../casa-6.7.4-12-pipeline-2026.2.1.55-py3.12.el8/lib/py/lib/python3.12/site-packages/casaplotms/private/plotms_pb2.py:590: 12 warnings |
| 14-Oct-2026 22:06:04 | /lustre/cv/sw/casa/casaci/cvpost128/bamboohome/xml-data/build-dir/PIPESPECS-TESTPIPE202621CASA674-ML228PY312TEST/casa-build-utils/pipeline/workdir/casa-6.7.4-12-pipeline-2026.2.1.55-py3.12.el8/lib/py/lib/python3.12/site-packages/casaplotms/private/plotms_pb2.py:590: DeprecationWarning: Call to deprecated create function FieldDescriptor(). Note: Create unlinked descriptors is going to go away. Please use get/find descriptors from generated code or query the descriptor_pool. |
| 14-Oct-2026 22:06:04 | _descriptor.FieldDescriptor( |
| 14-Oct-2026 22:06:04 | |
| 14-Oct-2026 22:06:04 | ../casa-6.7.4-12-pipeline-2026.2.1.55-py3.12.el8/lib/py/lib/python3.12/site-packages/casaplotms/private/plotms_pb2.py:597: 12 warnings |
| 14-Oct-2026 22:06:04 | /lustre/cv/sw/casa/casaci/cvpost128/bamboohome/xml-data/build-dir/PIPESPECS-TESTPIPE202621CASA674-ML228PY312TEST/casa-build-utils/pipeline/workdir/casa-6.7.4-12-pipeline-2026.2.1.55-py3.12.el8/lib/py/lib/python3.12/site-packages/casaplotms/private/plotms_pb2.py:597: DeprecationWarning: Call to deprecated create function FieldDescriptor(). Note: Create unlinked descriptors is going to go away. Please use get/find descriptors from generated code or query the descriptor_pool. |
| 14-Oct-2026 22:06:04 | _descriptor.FieldDescriptor( |
| 14-Oct-2026 22:06:04 | |
| 14-Oct-2026 22:06:04 | ../casa-6.7.4-12-pipeline-2026.2.1.55-py3.12.el8/lib/py/lib/python3.12/site-packages/casaplotms/private/plotms_pb2.py:604: 12 warnings |
| 14-Oct-2026 22:06:04 | /lustre/cv/sw/casa/casaci/cvpost128/bamboohome/xml-data/build-dir/PIPESPECS-TESTPIPE202621CASA674-ML228PY312TEST/casa-build-utils/pipeline/workdir/casa-6.7.4-12-pipeline-2026.2.1.55-py3.12.el8/lib/py/lib/python3.12/site-packages/casaplotms/private/plotms_pb2.py:604: DeprecationWarning: Call to deprecated create function FieldDescriptor(). Note: Create unlinked descriptors is going to go away. Please use get/find descriptors from generated code or query the descriptor_pool. |
| 14-Oct-2026 22:06:04 | _descriptor.FieldDescriptor( |
| 14-Oct-2026 22:06:04 | |
| 14-Oct-2026 22:06:04 | ../casa-6.7.4-12-pipeline-2026.2.1.55-py3.12.el8/lib/py/lib/python3.12/site-packages/casaplotms/private/plotms_pb2.py:611: 12 warnings |
| 14-Oct-2026 22:06:04 | /lustre/cv/sw/casa/casaci/cvpost128/bamboohome/xml-data/build-dir/PIPESPECS-TESTPIPE202621CASA674-ML228PY312TEST/casa-build-utils/pipeline/workdir/casa-6.7.4-12-pipeline-2026.2.1.55-py3.12.el8/lib/py/lib/python3.12/site-packages/casaplotms/private/plotms_pb2.py:611: DeprecationWarning: Call to deprecated create function FieldDescriptor(). Note: Create unlinked descriptors is going to go away. Please use get/find descriptors from generated code or query the descriptor_pool. |
| 14-Oct-2026 22:06:04 | _descriptor.FieldDescriptor( |
| 14-Oct-2026 22:06:04 | |
| 14-Oct-2026 22:06:04 | ../casa-6.7.4-12-pipeline-2026.2.1.55-py3.12.el8/lib/py/lib/python3.12/site-packages/casaplotms/private/plotms_pb2.py:618: 12 warnings |
| 14-Oct-2026 22:06:04 | /lustre/cv/sw/casa/casaci/cvpost128/bamboohome/xml-data/build-dir/PIPESPECS-TESTPIPE202621CASA674-ML228PY312TEST/casa-build-utils/pipeline/workdir/casa-6.7.4-12-pipeline-2026.2.1.55-py3.12.el8/lib/py/lib/python3.12/site-packages/casaplotms/private/plotms_pb2.py:618: DeprecationWarning: Call to deprecated create function FieldDescriptor(). Note: Create unlinked descriptors is going to go away. Please use get/find descriptors from generated code or query the descriptor_pool. |
| 14-Oct-2026 22:06:04 | _descriptor.FieldDescriptor( |
| 14-Oct-2026 22:06:04 | |
| 14-Oct-2026 22:06:04 | ../casa-6.7.4-12-pipeline-2026.2.1.55-py3.12.el8/lib/py/lib/python3.12/site-packages/casaplotms/private/plotms_pb2.py:625: 12 warnings |
| 14-Oct-2026 22:06:04 | /lustre/cv/sw/casa/casaci/cvpost128/bamboohome/xml-data/build-dir/PIPESPECS-TESTPIPE202621CASA674-ML228PY312TEST/casa-build-utils/pipeline/workdir/casa-6.7.4-12-pipeline-2026.2.1.55-py3.12.el8/lib/py/lib/python3.12/site-packages/casaplotms/private/plotms_pb2.py:625: DeprecationWarning: Call to deprecated create function FieldDescriptor(). Note: Create unlinked descriptors is going to go away. Please use get/find descriptors from generated code or query the descriptor_pool. |
| 14-Oct-2026 22:06:04 | _descriptor.FieldDescriptor( |
| 14-Oct-2026 22:06:04 | |
| 14-Oct-2026 22:06:04 | ../casa-6.7.4-12-pipeline-2026.2.1.55-py3.12.el8/lib/py/lib/python3.12/site-packages/casaplotms/private/plotms_pb2.py:583: 12 warnings |
| 14-Oct-2026 22:06:04 | /lustre/cv/sw/casa/casaci/cvpost128/bamboohome/xml-data/build-dir/PIPESPECS-TESTPIPE202621CASA674-ML228PY312TEST/casa-build-utils/pipeline/workdir/casa-6.7.4-12-pipeline-2026.2.1.55-py3.12.el8/lib/py/lib/python3.12/site-packages/casaplotms/private/plotms_pb2.py:583: DeprecationWarning: Call to deprecated create function Descriptor(). Note: Create unlinked descriptors is going to go away. Please use get/find descriptors from generated code or query the descriptor_pool. |
| 14-Oct-2026 22:06:04 | _SETTRANSFORM = _descriptor.Descriptor( |
| 14-Oct-2026 22:06:04 | |
| 14-Oct-2026 22:06:04 | ../casa-6.7.4-12-pipeline-2026.2.1.55-py3.12.el8/lib/py/lib/python3.12/site-packages/casaplotms/private/plotms_pb2.py:656: 12 warnings |
| 14-Oct-2026 22:06:04 | /lustre/cv/sw/casa/casaci/cvpost128/bamboohome/xml-data/build-dir/PIPESPECS-TESTPIPE202621CASA674-ML228PY312TEST/casa-build-utils/pipeline/workdir/casa-6.7.4-12-pipeline-2026.2.1.55-py3.12.el8/lib/py/lib/python3.12/site-packages/casaplotms/private/plotms_pb2.py:656: DeprecationWarning: Call to deprecated create function FieldDescriptor(). Note: Create unlinked descriptors is going to go away. Please use get/find descriptors from generated code or query the descriptor_pool. |
| 14-Oct-2026 22:06:04 | _descriptor.FieldDescriptor( |
| 14-Oct-2026 22:06:04 | |
| 14-Oct-2026 22:06:04 | ../casa-6.7.4-12-pipeline-2026.2.1.55-py3.12.el8/lib/py/lib/python3.12/site-packages/casaplotms/private/plotms_pb2.py:663: 12 warnings |
| 14-Oct-2026 22:06:04 | /lustre/cv/sw/casa/casaci/cvpost128/bamboohome/xml-data/build-dir/PIPESPECS-TESTPIPE202621CASA674-ML228PY312TEST/casa-build-utils/pipeline/workdir/casa-6.7.4-12-pipeline-2026.2.1.55-py3.12.el8/lib/py/lib/python3.12/site-packages/casaplotms/private/plotms_pb2.py:663: DeprecationWarning: Call to deprecated create function FieldDescriptor(). Note: Create unlinked descriptors is going to go away. Please use get/find descriptors from generated code or query the descriptor_pool. |
| 14-Oct-2026 22:06:04 | _descriptor.FieldDescriptor( |
| 14-Oct-2026 22:06:04 | |
| 14-Oct-2026 22:06:04 | ../casa-6.7.4-12-pipeline-2026.2.1.55-py3.12.el8/lib/py/lib/python3.12/site-packages/casaplotms/private/plotms_pb2.py:670: 12 warnings |
| 14-Oct-2026 22:06:04 | /lustre/cv/sw/casa/casaci/cvpost128/bamboohome/xml-data/build-dir/PIPESPECS-TESTPIPE202621CASA674-ML228PY312TEST/casa-build-utils/pipeline/workdir/casa-6.7.4-12-pipeline-2026.2.1.55-py3.12.el8/lib/py/lib/python3.12/site-packages/casaplotms/private/plotms_pb2.py:670: DeprecationWarning: Call to deprecated create function FieldDescriptor(). Note: Create unlinked descriptors is going to go away. Please use get/find descriptors from generated code or query the descriptor_pool. |
| 14-Oct-2026 22:06:04 | _descriptor.FieldDescriptor( |
| 14-Oct-2026 22:06:04 | |
| 14-Oct-2026 22:06:04 | ../casa-6.7.4-12-pipeline-2026.2.1.55-py3.12.el8/lib/py/lib/python3.12/site-packages/casaplotms/private/plotms_pb2.py:677: 12 warnings |
| 14-Oct-2026 22:06:04 | /lustre/cv/sw/casa/casaci/cvpost128/bamboohome/xml-data/build-dir/PIPESPECS-TESTPIPE202621CASA674-ML228PY312TEST/casa-build-utils/pipeline/workdir/casa-6.7.4-12-pipeline-2026.2.1.55-py3.12.el8/lib/py/lib/python3.12/site-packages/casaplotms/private/plotms_pb2.py:677: DeprecationWarning: Call to deprecated create function FieldDescriptor(). Note: Create unlinked descriptors is going to go away. Please use get/find descriptors from generated code or query the descriptor_pool. |
| 14-Oct-2026 22:06:04 | _descriptor.FieldDescriptor( |
| 14-Oct-2026 22:06:04 | |
| 14-Oct-2026 22:06:04 | ../casa-6.7.4-12-pipeline-2026.2.1.55-py3.12.el8/lib/py/lib/python3.12/site-packages/casaplotms/private/plotms_pb2.py:649: 12 warnings |
| 14-Oct-2026 22:06:04 | /lustre/cv/sw/casa/casaci/cvpost128/bamboohome/xml-data/build-dir/PIPESPECS-TESTPIPE202621CASA674-ML228PY312TEST/casa-build-utils/pipeline/workdir/casa-6.7.4-12-pipeline-2026.2.1.55-py3.12.el8/lib/py/lib/python3.12/site-packages/casaplotms/private/plotms_pb2.py:649: DeprecationWarning: Call to deprecated create function Descriptor(). Note: Create unlinked descriptors is going to go away. Please use get/find descriptors from generated code or query the descriptor_pool. |
| 14-Oct-2026 22:06:04 | _SETCALIBRATION = _descriptor.Descriptor( |
| 14-Oct-2026 22:06:04 | |
| 14-Oct-2026 22:06:04 | ../casa-6.7.4-12-pipeline-2026.2.1.55-py3.12.el8/lib/py/lib/python3.12/site-packages/casaplotms/private/plotms_pb2.py:708: 12 warnings |
| 14-Oct-2026 22:06:04 | /lustre/cv/sw/casa/casaci/cvpost128/bamboohome/xml-data/build-dir/PIPESPECS-TESTPIPE202621CASA674-ML228PY312TEST/casa-build-utils/pipeline/workdir/casa-6.7.4-12-pipeline-2026.2.1.55-py3.12.el8/lib/py/lib/python3.12/site-packages/casaplotms/private/plotms_pb2.py:708: DeprecationWarning: Call to deprecated create function FieldDescriptor(). Note: Create unlinked descriptors is going to go away. Please use get/find descriptors from generated code or query the descriptor_pool. |
| 14-Oct-2026 22:06:04 | _descriptor.FieldDescriptor( |
| 14-Oct-2026 22:06:04 | |
| 14-Oct-2026 22:06:04 | ../casa-6.7.4-12-pipeline-2026.2.1.55-py3.12.el8/lib/py/lib/python3.12/site-packages/casaplotms/private/plotms_pb2.py:715: 12 warnings |
| 14-Oct-2026 22:06:04 | /lustre/cv/sw/casa/casaci/cvpost128/bamboohome/xml-data/build-dir/PIPESPECS-TESTPIPE202621CASA674-ML228PY312TEST/casa-build-utils/pipeline/workdir/casa-6.7.4-12-pipeline-2026.2.1.55-py3.12.el8/lib/py/lib/python3.12/site-packages/casaplotms/private/plotms_pb2.py:715: DeprecationWarning: Call to deprecated create function FieldDescriptor(). Note: Create unlinked descriptors is going to go away. Please use get/find descriptors from generated code or query the descriptor_pool. |
| 14-Oct-2026 22:06:04 | _descriptor.FieldDescriptor( |
| 14-Oct-2026 22:06:04 | |
| 14-Oct-2026 22:06:04 | ../casa-6.7.4-12-pipeline-2026.2.1.55-py3.12.el8/lib/py/lib/python3.12/site-packages/casaplotms/private/plotms_pb2.py:722: 12 warnings |
| 14-Oct-2026 22:06:04 | /lustre/cv/sw/casa/casaci/cvpost128/bamboohome/xml-data/build-dir/PIPESPECS-TESTPIPE202621CASA674-ML228PY312TEST/casa-build-utils/pipeline/workdir/casa-6.7.4-12-pipeline-2026.2.1.55-py3.12.el8/lib/py/lib/python3.12/site-packages/casaplotms/private/plotms_pb2.py:722: DeprecationWarning: Call to deprecated create function FieldDescriptor(). Note: Create unlinked descriptors is going to go away. Please use get/find descriptors from generated code or query the descriptor_pool. |
| 14-Oct-2026 22:06:04 | _descriptor.FieldDescriptor( |
| 14-Oct-2026 22:06:04 | |
| 14-Oct-2026 22:06:04 | ../casa-6.7.4-12-pipeline-2026.2.1.55-py3.12.el8/lib/py/lib/python3.12/site-packages/casaplotms/private/plotms_pb2.py:729: 12 warnings |
| 14-Oct-2026 22:06:04 | /lustre/cv/sw/casa/casaci/cvpost128/bamboohome/xml-data/build-dir/PIPESPECS-TESTPIPE202621CASA674-ML228PY312TEST/casa-build-utils/pipeline/workdir/casa-6.7.4-12-pipeline-2026.2.1.55-py3.12.el8/lib/py/lib/python3.12/site-packages/casaplotms/private/plotms_pb2.py:729: DeprecationWarning: Call to deprecated create function FieldDescriptor(). Note: Create unlinked descriptors is going to go away. Please use get/find descriptors from generated code or query the descriptor_pool. |
| 14-Oct-2026 22:06:04 | _descriptor.FieldDescriptor( |
| 14-Oct-2026 22:06:04 | |
| 14-Oct-2026 22:06:04 | ../casa-6.7.4-12-pipeline-2026.2.1.55-py3.12.el8/lib/py/lib/python3.12/site-packages/casaplotms/private/plotms_pb2.py:736: 12 warnings |
| 14-Oct-2026 22:06:04 | /lustre/cv/sw/casa/casaci/cvpost128/bamboohome/xml-data/build-dir/PIPESPECS-TESTPIPE202621CASA674-ML228PY312TEST/casa-build-utils/pipeline/workdir/casa-6.7.4-12-pipeline-2026.2.1.55-py3.12.el8/lib/py/lib/python3.12/site-packages/casaplotms/private/plotms_pb2.py:736: DeprecationWarning: Call to deprecated create function FieldDescriptor(). Note: Create unlinked descriptors is going to go away. Please use get/find descriptors from generated code or query the descriptor_pool. |
| 14-Oct-2026 22:06:04 | _descriptor.FieldDescriptor( |
| 14-Oct-2026 22:06:04 | |
| 14-Oct-2026 22:06:04 | ../casa-6.7.4-12-pipeline-2026.2.1.55-py3.12.el8/lib/py/lib/python3.12/site-packages/casaplotms/private/plotms_pb2.py:743: 12 warnings |
| 14-Oct-2026 22:06:04 | /lustre/cv/sw/casa/casaci/cvpost128/bamboohome/xml-data/build-dir/PIPESPECS-TESTPIPE202621CASA674-ML228PY312TEST/casa-build-utils/pipeline/workdir/casa-6.7.4-12-pipeline-2026.2.1.55-py3.12.el8/lib/py/lib/python3.12/site-packages/casaplotms/private/plotms_pb2.py:743: DeprecationWarning: Call to deprecated create function FieldDescriptor(). Note: Create unlinked descriptors is going to go away. Please use get/find descriptors from generated code or query the descriptor_pool. |
| 14-Oct-2026 22:06:04 | _descriptor.FieldDescriptor( |
| 14-Oct-2026 22:06:04 | |
| 14-Oct-2026 22:06:04 | ../casa-6.7.4-12-pipeline-2026.2.1.55-py3.12.el8/lib/py/lib/python3.12/site-packages/casaplotms/private/plotms_pb2.py:750: 12 warnings |
| 14-Oct-2026 22:06:04 | /lustre/cv/sw/casa/casaci/cvpost128/bamboohome/xml-data/build-dir/PIPESPECS-TESTPIPE202621CASA674-ML228PY312TEST/casa-build-utils/pipeline/workdir/casa-6.7.4-12-pipeline-2026.2.1.55-py3.12.el8/lib/py/lib/python3.12/site-packages/casaplotms/private/plotms_pb2.py:750: DeprecationWarning: Call to deprecated create function FieldDescriptor(). Note: Create unlinked descriptors is going to go away. Please use get/find descriptors from generated code or query the descriptor_pool. |
| 14-Oct-2026 22:06:04 | _descriptor.FieldDescriptor( |
| 14-Oct-2026 22:06:04 | |
| 14-Oct-2026 22:06:04 | ../casa-6.7.4-12-pipeline-2026.2.1.55-py3.12.el8/lib/py/lib/python3.12/site-packages/casaplotms/private/plotms_pb2.py:757: 12 warnings |
| 14-Oct-2026 22:06:04 | /lustre/cv/sw/casa/casaci/cvpost128/bamboohome/xml-data/build-dir/PIPESPECS-TESTPIPE202621CASA674-ML228PY312TEST/casa-build-utils/pipeline/workdir/casa-6.7.4-12-pipeline-2026.2.1.55-py3.12.el8/lib/py/lib/python3.12/site-packages/casaplotms/private/plotms_pb2.py:757: DeprecationWarning: Call to deprecated create function FieldDescriptor(). Note: Create unlinked descriptors is going to go away. Please use get/find descriptors from generated code or query the descriptor_pool. |
| 14-Oct-2026 22:06:04 | _descriptor.FieldDescriptor( |
| 14-Oct-2026 22:06:04 | |
| 14-Oct-2026 22:06:04 | ../casa-6.7.4-12-pipeline-2026.2.1.55-py3.12.el8/lib/py/lib/python3.12/site-packages/casaplotms/private/plotms_pb2.py:764: 12 warnings |
| 14-Oct-2026 22:06:04 | /lustre/cv/sw/casa/casaci/cvpost128/bamboohome/xml-data/build-dir/PIPESPECS-TESTPIPE202621CASA674-ML228PY312TEST/casa-build-utils/pipeline/workdir/casa-6.7.4-12-pipeline-2026.2.1.55-py3.12.el8/lib/py/lib/python3.12/site-packages/casaplotms/private/plotms_pb2.py:764: DeprecationWarning: Call to deprecated create function FieldDescriptor(). Note: Create unlinked descriptors is going to go away. Please use get/find descriptors from generated code or query the descriptor_pool. |
| 14-Oct-2026 22:06:04 | _descriptor.FieldDescriptor( |
| 14-Oct-2026 22:06:04 | |
| 14-Oct-2026 22:06:04 | ../casa-6.7.4-12-pipeline-2026.2.1.55-py3.12.el8/lib/py/lib/python3.12/site-packages/casaplotms/private/plotms_pb2.py:771: 12 warnings |
| 14-Oct-2026 22:06:04 | /lustre/cv/sw/casa/casaci/cvpost128/bamboohome/xml-data/build-dir/PIPESPECS-TESTPIPE202621CASA674-ML228PY312TEST/casa-build-utils/pipeline/workdir/casa-6.7.4-12-pipeline-2026.2.1.55-py3.12.el8/lib/py/lib/python3.12/site-packages/casaplotms/private/plotms_pb2.py:771: DeprecationWarning: Call to deprecated create function FieldDescriptor(). Note: Create unlinked descriptors is going to go away. Please use get/find descriptors from generated code or query the descriptor_pool. |
| 14-Oct-2026 22:06:04 | _descriptor.FieldDescriptor( |
| 14-Oct-2026 22:06:04 | |
| 14-Oct-2026 22:06:04 | ../casa-6.7.4-12-pipeline-2026.2.1.55-py3.12.el8/lib/py/lib/python3.12/site-packages/casaplotms/private/plotms_pb2.py:701: 12 warnings |
| 14-Oct-2026 22:06:04 | /lustre/cv/sw/casa/casaci/cvpost128/bamboohome/xml-data/build-dir/PIPESPECS-TESTPIPE202621CASA674-ML228PY312TEST/casa-build-utils/pipeline/workdir/casa-6.7.4-12-pipeline-2026.2.1.55-py3.12.el8/lib/py/lib/python3.12/site-packages/casaplotms/private/plotms_pb2.py:701: DeprecationWarning: Call to deprecated create function Descriptor(). Note: Create unlinked descriptors is going to go away. Please use get/find descriptors from generated code or query the descriptor_pool. |
| 14-Oct-2026 22:06:04 | _SETFLAGEXTENSION = _descriptor.Descriptor( |
| 14-Oct-2026 22:06:04 | |
| 14-Oct-2026 22:06:04 | ../casa-6.7.4-12-pipeline-2026.2.1.55-py3.12.el8/lib/py/lib/python3.12/site-packages/casaplotms/private/plotms_pb2.py:802: 12 warnings |
| 14-Oct-2026 22:06:04 | /lustre/cv/sw/casa/casaci/cvpost128/bamboohome/xml-data/build-dir/PIPESPECS-TESTPIPE202621CASA674-ML228PY312TEST/casa-build-utils/pipeline/workdir/casa-6.7.4-12-pipeline-2026.2.1.55-py3.12.el8/lib/py/lib/python3.12/site-packages/casaplotms/private/plotms_pb2.py:802: DeprecationWarning: Call to deprecated create function FieldDescriptor(). Note: Create unlinked descriptors is going to go away. Please use get/find descriptors from generated code or query the descriptor_pool. |
| 14-Oct-2026 22:06:04 | _descriptor.FieldDescriptor( |
| 14-Oct-2026 22:06:04 | |
| 14-Oct-2026 22:06:04 | ../casa-6.7.4-12-pipeline-2026.2.1.55-py3.12.el8/lib/py/lib/python3.12/site-packages/casaplotms/private/plotms_pb2.py:795: 12 warnings |
| 14-Oct-2026 22:06:04 | /lustre/cv/sw/casa/casaci/cvpost128/bamboohome/xml-data/build-dir/PIPESPECS-TESTPIPE202621CASA674-ML228PY312TEST/casa-build-utils/pipeline/workdir/casa-6.7.4-12-pipeline-2026.2.1.55-py3.12.el8/lib/py/lib/python3.12/site-packages/casaplotms/private/plotms_pb2.py:795: DeprecationWarning: Call to deprecated create function Descriptor(). Note: Create unlinked descriptors is going to go away. Please use get/find descriptors from generated code or query the descriptor_pool. |
| 14-Oct-2026 22:06:04 | _EXPORTRANGE = _descriptor.Descriptor( |
| 14-Oct-2026 22:06:04 | |
| 14-Oct-2026 22:06:04 | ../casa-6.7.4-12-pipeline-2026.2.1.55-py3.12.el8/lib/py/lib/python3.12/site-packages/casaplotms/private/plotms_pb2.py:833: 12 warnings |
| 14-Oct-2026 22:06:04 | /lustre/cv/sw/casa/casaci/cvpost128/bamboohome/xml-data/build-dir/PIPESPECS-TESTPIPE202621CASA674-ML228PY312TEST/casa-build-utils/pipeline/workdir/casa-6.7.4-12-pipeline-2026.2.1.55-py3.12.el8/lib/py/lib/python3.12/site-packages/casaplotms/private/plotms_pb2.py:833: DeprecationWarning: Call to deprecated create function FieldDescriptor(). Note: Create unlinked descriptors is going to go away. Please use get/find descriptors from generated code or query the descriptor_pool. |
| 14-Oct-2026 22:06:04 | _descriptor.FieldDescriptor( |
| 14-Oct-2026 22:06:04 | |
| 14-Oct-2026 22:06:04 | ../casa-6.7.4-12-pipeline-2026.2.1.55-py3.12.el8/lib/py/lib/python3.12/site-packages/casaplotms/private/plotms_pb2.py:840: 12 warnings |
| 14-Oct-2026 22:06:04 | /lustre/cv/sw/casa/casaci/cvpost128/bamboohome/xml-data/build-dir/PIPESPECS-TESTPIPE202621CASA674-ML228PY312TEST/casa-build-utils/pipeline/workdir/casa-6.7.4-12-pipeline-2026.2.1.55-py3.12.el8/lib/py/lib/python3.12/site-packages/casaplotms/private/plotms_pb2.py:840: DeprecationWarning: Call to deprecated create function FieldDescriptor(). Note: Create unlinked descriptors is going to go away. Please use get/find descriptors from generated code or query the descriptor_pool. |
| 14-Oct-2026 22:06:04 | _descriptor.FieldDescriptor( |
| 14-Oct-2026 22:06:04 | |
| 14-Oct-2026 22:06:04 | ../casa-6.7.4-12-pipeline-2026.2.1.55-py3.12.el8/lib/py/lib/python3.12/site-packages/casaplotms/private/plotms_pb2.py:847: 12 warnings |
| 14-Oct-2026 22:06:04 | /lustre/cv/sw/casa/casaci/cvpost128/bamboohome/xml-data/build-dir/PIPESPECS-TESTPIPE202621CASA674-ML228PY312TEST/casa-build-utils/pipeline/workdir/casa-6.7.4-12-pipeline-2026.2.1.55-py3.12.el8/lib/py/lib/python3.12/site-packages/casaplotms/private/plotms_pb2.py:847: DeprecationWarning: Call to deprecated create function FieldDescriptor(). Note: Create unlinked descriptors is going to go away. Please use get/find descriptors from generated code or query the descriptor_pool. |
| 14-Oct-2026 22:06:04 | _descriptor.FieldDescriptor( |
| 14-Oct-2026 22:06:04 | |
| 14-Oct-2026 22:06:04 | ../casa-6.7.4-12-pipeline-2026.2.1.55-py3.12.el8/lib/py/lib/python3.12/site-packages/casaplotms/private/plotms_pb2.py:854: 12 warnings |
| 14-Oct-2026 22:06:04 | /lustre/cv/sw/casa/casaci/cvpost128/bamboohome/xml-data/build-dir/PIPESPECS-TESTPIPE202621CASA674-ML228PY312TEST/casa-build-utils/pipeline/workdir/casa-6.7.4-12-pipeline-2026.2.1.55-py3.12.el8/lib/py/lib/python3.12/site-packages/casaplotms/private/plotms_pb2.py:854: DeprecationWarning: Call to deprecated create function FieldDescriptor(). Note: Create unlinked descriptors is going to go away. Please use get/find descriptors from generated code or query the descriptor_pool. |
| 14-Oct-2026 22:06:04 | _descriptor.FieldDescriptor( |
| 14-Oct-2026 22:06:04 | |
| 14-Oct-2026 22:06:04 | ../casa-6.7.4-12-pipeline-2026.2.1.55-py3.12.el8/lib/py/lib/python3.12/site-packages/casaplotms/private/plotms_pb2.py:861: 12 warnings |
| 14-Oct-2026 22:06:04 | /lustre/cv/sw/casa/casaci/cvpost128/bamboohome/xml-data/build-dir/PIPESPECS-TESTPIPE202621CASA674-ML228PY312TEST/casa-build-utils/pipeline/workdir/casa-6.7.4-12-pipeline-2026.2.1.55-py3.12.el8/lib/py/lib/python3.12/site-packages/casaplotms/private/plotms_pb2.py:861: DeprecationWarning: Call to deprecated create function FieldDescriptor(). Note: Create unlinked descriptors is going to go away. Please use get/find descriptors from generated code or query the descriptor_pool. |
| 14-Oct-2026 22:06:04 | _descriptor.FieldDescriptor( |
| 14-Oct-2026 22:06:04 | |
| 14-Oct-2026 22:06:04 | ../casa-6.7.4-12-pipeline-2026.2.1.55-py3.12.el8/lib/py/lib/python3.12/site-packages/casaplotms/private/plotms_pb2.py:868: 12 warnings |
| 14-Oct-2026 22:06:04 | /lustre/cv/sw/casa/casaci/cvpost128/bamboohome/xml-data/build-dir/PIPESPECS-TESTPIPE202621CASA674-ML228PY312TEST/casa-build-utils/pipeline/workdir/casa-6.7.4-12-pipeline-2026.2.1.55-py3.12.el8/lib/py/lib/python3.12/site-packages/casaplotms/private/plotms_pb2.py:868: DeprecationWarning: Call to deprecated create function FieldDescriptor(). Note: Create unlinked descriptors is going to go away. Please use get/find descriptors from generated code or query the descriptor_pool. |
| 14-Oct-2026 22:06:04 | _descriptor.FieldDescriptor( |
| 14-Oct-2026 22:06:04 | |
| 14-Oct-2026 22:06:04 | ../casa-6.7.4-12-pipeline-2026.2.1.55-py3.12.el8/lib/py/lib/python3.12/site-packages/casaplotms/private/plotms_pb2.py:875: 12 warnings |
| 14-Oct-2026 22:06:04 | /lustre/cv/sw/casa/casaci/cvpost128/bamboohome/xml-data/build-dir/PIPESPECS-TESTPIPE202621CASA674-ML228PY312TEST/casa-build-utils/pipeline/workdir/casa-6.7.4-12-pipeline-2026.2.1.55-py3.12.el8/lib/py/lib/python3.12/site-packages/casaplotms/private/plotms_pb2.py:875: DeprecationWarning: Call to deprecated create function FieldDescriptor(). Note: Create unlinked descriptors is going to go away. Please use get/find descriptors from generated code or query the descriptor_pool. |
| 14-Oct-2026 22:06:04 | _descriptor.FieldDescriptor( |
| 14-Oct-2026 22:06:04 | |
| 14-Oct-2026 22:06:04 | ../casa-6.7.4-12-pipeline-2026.2.1.55-py3.12.el8/lib/py/lib/python3.12/site-packages/casaplotms/private/plotms_pb2.py:882: 12 warnings |
| 14-Oct-2026 22:06:04 | /lustre/cv/sw/casa/casaci/cvpost128/bamboohome/xml-data/build-dir/PIPESPECS-TESTPIPE202621CASA674-ML228PY312TEST/casa-build-utils/pipeline/workdir/casa-6.7.4-12-pipeline-2026.2.1.55-py3.12.el8/lib/py/lib/python3.12/site-packages/casaplotms/private/plotms_pb2.py:882: DeprecationWarning: Call to deprecated create function FieldDescriptor(). Note: Create unlinked descriptors is going to go away. Please use get/find descriptors from generated code or query the descriptor_pool. |
| 14-Oct-2026 22:06:04 | _descriptor.FieldDescriptor( |
| 14-Oct-2026 22:06:04 | |
| 14-Oct-2026 22:06:04 | ../casa-6.7.4-12-pipeline-2026.2.1.55-py3.12.el8/lib/py/lib/python3.12/site-packages/casaplotms/private/plotms_pb2.py:889: 12 warnings |
| 14-Oct-2026 22:06:04 | /lustre/cv/sw/casa/casaci/cvpost128/bamboohome/xml-data/build-dir/PIPESPECS-TESTPIPE202621CASA674-ML228PY312TEST/casa-build-utils/pipeline/workdir/casa-6.7.4-12-pipeline-2026.2.1.55-py3.12.el8/lib/py/lib/python3.12/site-packages/casaplotms/private/plotms_pb2.py:889: DeprecationWarning: Call to deprecated create function FieldDescriptor(). Note: Create unlinked descriptors is going to go away. Please use get/find descriptors from generated code or query the descriptor_pool. |
| 14-Oct-2026 22:06:04 | _descriptor.FieldDescriptor( |
| 14-Oct-2026 22:06:04 | |
| 14-Oct-2026 22:06:04 | ../casa-6.7.4-12-pipeline-2026.2.1.55-py3.12.el8/lib/py/lib/python3.12/site-packages/casaplotms/private/plotms_pb2.py:826: 12 warnings |
| 14-Oct-2026 22:06:04 | /lustre/cv/sw/casa/casaci/cvpost128/bamboohome/xml-data/build-dir/PIPESPECS-TESTPIPE202621CASA674-ML228PY312TEST/casa-build-utils/pipeline/workdir/casa-6.7.4-12-pipeline-2026.2.1.55-py3.12.el8/lib/py/lib/python3.12/site-packages/casaplotms/private/plotms_pb2.py:826: DeprecationWarning: Call to deprecated create function Descriptor(). Note: Create unlinked descriptors is going to go away. Please use get/find descriptors from generated code or query the descriptor_pool. |
| 14-Oct-2026 22:06:04 | _SETITERATE = _descriptor.Descriptor( |
| 14-Oct-2026 22:06:04 | |
| 14-Oct-2026 22:06:04 | ../casa-6.7.4-12-pipeline-2026.2.1.55-py3.12.el8/lib/py/lib/python3.12/site-packages/casaplotms/private/plotms_pb2.py:920: 12 warnings |
| 14-Oct-2026 22:06:04 | /lustre/cv/sw/casa/casaci/cvpost128/bamboohome/xml-data/build-dir/PIPESPECS-TESTPIPE202621CASA674-ML228PY312TEST/casa-build-utils/pipeline/workdir/casa-6.7.4-12-pipeline-2026.2.1.55-py3.12.el8/lib/py/lib/python3.12/site-packages/casaplotms/private/plotms_pb2.py:920: DeprecationWarning: Call to deprecated create function FieldDescriptor(). Note: Create unlinked descriptors is going to go away. Please use get/find descriptors from generated code or query the descriptor_pool. |
| 14-Oct-2026 22:06:04 | _descriptor.FieldDescriptor( |
| 14-Oct-2026 22:06:04 | |
| 14-Oct-2026 22:06:04 | ../casa-6.7.4-12-pipeline-2026.2.1.55-py3.12.el8/lib/py/lib/python3.12/site-packages/casaplotms/private/plotms_pb2.py:927: 12 warnings |
| 14-Oct-2026 22:06:04 | /lustre/cv/sw/casa/casaci/cvpost128/bamboohome/xml-data/build-dir/PIPESPECS-TESTPIPE202621CASA674-ML228PY312TEST/casa-build-utils/pipeline/workdir/casa-6.7.4-12-pipeline-2026.2.1.55-py3.12.el8/lib/py/lib/python3.12/site-packages/casaplotms/private/plotms_pb2.py:927: DeprecationWarning: Call to deprecated create function FieldDescriptor(). Note: Create unlinked descriptors is going to go away. Please use get/find descriptors from generated code or query the descriptor_pool. |
| 14-Oct-2026 22:06:04 | _descriptor.FieldDescriptor( |
| 14-Oct-2026 22:06:04 | |
| 14-Oct-2026 22:06:04 | ../casa-6.7.4-12-pipeline-2026.2.1.55-py3.12.el8/lib/py/lib/python3.12/site-packages/casaplotms/private/plotms_pb2.py:934: 12 warnings |
| 14-Oct-2026 22:06:04 | /lustre/cv/sw/casa/casaci/cvpost128/bamboohome/xml-data/build-dir/PIPESPECS-TESTPIPE202621CASA674-ML228PY312TEST/casa-build-utils/pipeline/workdir/casa-6.7.4-12-pipeline-2026.2.1.55-py3.12.el8/lib/py/lib/python3.12/site-packages/casaplotms/private/plotms_pb2.py:934: DeprecationWarning: Call to deprecated create function FieldDescriptor(). Note: Create unlinked descriptors is going to go away. Please use get/find descriptors from generated code or query the descriptor_pool. |
| 14-Oct-2026 22:06:04 | _descriptor.FieldDescriptor( |
| 14-Oct-2026 22:06:04 | |
| 14-Oct-2026 22:06:04 | ../casa-6.7.4-12-pipeline-2026.2.1.55-py3.12.el8/lib/py/lib/python3.12/site-packages/casaplotms/private/plotms_pb2.py:913: 12 warnings |
| 14-Oct-2026 22:06:04 | /lustre/cv/sw/casa/casaci/cvpost128/bamboohome/xml-data/build-dir/PIPESPECS-TESTPIPE202621CASA674-ML228PY312TEST/casa-build-utils/pipeline/workdir/casa-6.7.4-12-pipeline-2026.2.1.55-py3.12.el8/lib/py/lib/python3.12/site-packages/casaplotms/private/plotms_pb2.py:913: DeprecationWarning: Call to deprecated create function Descriptor(). Note: Create unlinked descriptors is going to go away. Please use get/find descriptors from generated code or query the descriptor_pool. |
| 14-Oct-2026 22:06:04 | _SETSTRING = _descriptor.Descriptor( |
| 14-Oct-2026 22:06:04 | |
| 14-Oct-2026 22:06:04 | ../casa-6.7.4-12-pipeline-2026.2.1.55-py3.12.el8/lib/py/lib/python3.12/site-packages/casaplotms/private/plotms_pb2.py:965: 12 warnings |
| 14-Oct-2026 22:06:04 | /lustre/cv/sw/casa/casaci/cvpost128/bamboohome/xml-data/build-dir/PIPESPECS-TESTPIPE202621CASA674-ML228PY312TEST/casa-build-utils/pipeline/workdir/casa-6.7.4-12-pipeline-2026.2.1.55-py3.12.el8/lib/py/lib/python3.12/site-packages/casaplotms/private/plotms_pb2.py:965: DeprecationWarning: Call to deprecated create function FieldDescriptor(). Note: Create unlinked descriptors is going to go away. Please use get/find descriptors from generated code or query the descriptor_pool. |
| 14-Oct-2026 22:06:04 | _descriptor.FieldDescriptor( |
| 14-Oct-2026 22:06:04 | |
| 14-Oct-2026 22:06:04 | ../casa-6.7.4-12-pipeline-2026.2.1.55-py3.12.el8/lib/py/lib/python3.12/site-packages/casaplotms/private/plotms_pb2.py:972: 12 warnings |
| 14-Oct-2026 22:06:04 | /lustre/cv/sw/casa/casaci/cvpost128/bamboohome/xml-data/build-dir/PIPESPECS-TESTPIPE202621CASA674-ML228PY312TEST/casa-build-utils/pipeline/workdir/casa-6.7.4-12-pipeline-2026.2.1.55-py3.12.el8/lib/py/lib/python3.12/site-packages/casaplotms/private/plotms_pb2.py:972: DeprecationWarning: Call to deprecated create function FieldDescriptor(). Note: Create unlinked descriptors is going to go away. Please use get/find descriptors from generated code or query the descriptor_pool. |
| 14-Oct-2026 22:06:04 | _descriptor.FieldDescriptor( |
| 14-Oct-2026 22:06:04 | |
| 14-Oct-2026 22:06:04 | ../casa-6.7.4-12-pipeline-2026.2.1.55-py3.12.el8/lib/py/lib/python3.12/site-packages/casaplotms/private/plotms_pb2.py:979: 12 warnings |
| 14-Oct-2026 22:06:04 | /lustre/cv/sw/casa/casaci/cvpost128/bamboohome/xml-data/build-dir/PIPESPECS-TESTPIPE202621CASA674-ML228PY312TEST/casa-build-utils/pipeline/workdir/casa-6.7.4-12-pipeline-2026.2.1.55-py3.12.el8/lib/py/lib/python3.12/site-packages/casaplotms/private/plotms_pb2.py:979: DeprecationWarning: Call to deprecated create function FieldDescriptor(). Note: Create unlinked descriptors is going to go away. Please use get/find descriptors from generated code or query the descriptor_pool. |
| 14-Oct-2026 22:06:04 | _descriptor.FieldDescriptor( |
| 14-Oct-2026 22:06:04 | |
| 14-Oct-2026 22:06:04 | tests/regression/fast/alma_sd_fast_test.py::test_uid___A002_X85c183_X36f_SPW15_23__PPR__regression |
| 14-Oct-2026 22:06:04 | tests/regression/fast/nobeyama_sd_fast_test.py::test_mg2_20170525142607_180419__procedure_hsdn_calimage__regression |
| 14-Oct-2026 22:06:04 | /lustre/cv/sw/casa/casaci/cvpost128/bamboohome/xml-data/build-dir/PIPESPECS-TESTPIPE202621CASA674-ML228PY312TEST/casa-build-utils/pipeline/workdir/casa-6.7.4-12-pipeline-2026.2.1.55-py3.12.el8/lib/py/lib/python3.12/multiprocessing/popen_fork.py:66: DeprecationWarning: This process (pid=615393) is multi-threaded, use of fork() may lead to deadlocks in the child. |
| 14-Oct-2026 22:06:04 | self.pid = os.fork() |
| 14-Oct-2026 22:06:04 | |
| 14-Oct-2026 22:06:04 | tests/regression/fast/alma_if_fast_test.py::test_uid___A002_Xc46ab2_X15ae_repSPW_spw16_17_small__PPR__regression |
| 14-Oct-2026 22:06:04 | /lustre/cv/sw/casa/casaci/cvpost128/bamboohome/xml-data/build-dir/PIPESPECS-TESTPIPE202621CASA674-ML228PY312TEST/casa-build-utils/pipeline/workdir/casa-6.7.4-12-pipeline-2026.2.1.55-py3.12.el8/lib/py/lib/python3.12/multiprocessing/popen_fork.py:66: DeprecationWarning: This process (pid=615348) is multi-threaded, use of fork() may lead to deadlocks in the child. |
| 14-Oct-2026 22:06:04 | self.pid = os.fork() |
| 14-Oct-2026 22:06:04 | |
| 14-Oct-2026 22:06:04 | tests/regression/fast/nobeyama_sd_fast_test.py::test_mg2_20170525142607_180419__PPR__regression |
| 14-Oct-2026 22:06:04 | tests/regression/fast/vla_fast_test.py::test_13A_537__procedure_hifv__regression |
| 14-Oct-2026 22:06:04 | /lustre/cv/sw/casa/casaci/cvpost128/bamboohome/xml-data/build-dir/PIPESPECS-TESTPIPE202621CASA674-ML228PY312TEST/casa-build-utils/pipeline/workdir/casa-6.7.4-12-pipeline-2026.2.1.55-py3.12.el8/lib/py/lib/python3.12/multiprocessing/popen_fork.py:66: DeprecationWarning: This process (pid=615389) is multi-threaded, use of fork() may lead to deadlocks in the child. |
| 14-Oct-2026 22:06:04 | self.pid = os.fork() |
| 14-Oct-2026 22:06:04 | |
| 14-Oct-2026 22:06:04 | tests/regression/fast/vla_fast_test.py::test_13A_537__calibration__PPR__regression |
| 14-Oct-2026 22:06:04 | tests/regression/fast/vla_fast_test.py::test_13A_537__restore__PPR__regression |
| 14-Oct-2026 22:06:04 | /lustre/cv/sw/casa/casaci/cvpost128/bamboohome/xml-data/build-dir/PIPESPECS-TESTPIPE202621CASA674-ML228PY312TEST/casa-build-utils/pipeline/workdir/casa-6.7.4-12-pipeline-2026.2.1.55-py3.12.el8/lib/py/lib/python3.12/multiprocessing/popen_fork.py:66: DeprecationWarning: This process (pid=615385) is multi-threaded, use of fork() may lead to deadlocks in the child. |
| 14-Oct-2026 22:06:04 | self.pid = os.fork() |
| 14-Oct-2026 22:06:04 | |
| 14-Oct-2026 22:06:04 | tests/regression/fast/alma_if_fast_test.py::test_uid___A002_Xc46ab2_X15ae__selfcal_restore_procedure_hifa_image__regression |
| 14-Oct-2026 22:06:04 | /lustre/cv/sw/casa/casaci/cvpost128/bamboohome/xml-data/build-dir/PIPESPECS-TESTPIPE202621CASA674-ML228PY312TEST/casa-build-utils/pipeline/workdir/casa-6.7.4-12-pipeline-2026.2.1.55-py3.12.el8/lib/py/lib/python3.12/multiprocessing/popen_fork.py:66: DeprecationWarning: This process (pid=615377) is multi-threaded, use of fork() may lead to deadlocks in the child. |
| 14-Oct-2026 22:06:04 | self.pid = os.fork() |
| 14-Oct-2026 22:06:04 | |
| 14-Oct-2026 22:06:04 | tests/regression/fast/alma_if_fast_test.py::test_uid___A002_Xef72bb_X9d29__renorm_restore_procedure_hifa_image__regression |
| 14-Oct-2026 22:06:04 | /lustre/cv/sw/casa/casaci/cvpost128/bamboohome/xml-data/build-dir/PIPESPECS-TESTPIPE202621CASA674-ML228PY312TEST/casa-build-utils/pipeline/workdir/casa-6.7.4-12-pipeline-2026.2.1.55-py3.12.el8/lib/py/lib/python3.12/multiprocessing/popen_fork.py:66: DeprecationWarning: This process (pid=615357) is multi-threaded, use of fork() may lead to deadlocks in the child. |
| 14-Oct-2026 22:06:04 | self.pid = os.fork() |
| 14-Oct-2026 22:06:04 | |
| 14-Oct-2026 22:06:04 | tests/regression/fast/alma_if_fast_test.py::test_E2E6_1_00010_S__uid___A002_Xd0a588_X2239__procedure_hifa_image__regression |
| 14-Oct-2026 22:06:04 | tests/regression/fast/alma_if_fast_test.py::test_csv_3899_eb2_small__procedure_hifa_calimage__regression |
| 14-Oct-2026 22:06:04 | /lustre/cv/sw/casa/casaci/cvpost128/bamboohome/xml-data/build-dir/PIPESPECS-TESTPIPE202621CASA674-ML228PY312TEST/casa-build-utils/pipeline/workdir/casa-6.7.4-12-pipeline-2026.2.1.55-py3.12.el8/lib/py/lib/python3.12/multiprocessing/popen_fork.py:66: DeprecationWarning: This process (pid=615361) is multi-threaded, use of fork() may lead to deadlocks in the child. |
| 14-Oct-2026 22:06:04 | self.pid = os.fork() |
| 14-Oct-2026 22:06:04 | |
| 14-Oct-2026 22:06:04 | tests/regression/fast/alma_if_fast_test.py::test_uid___A002_Xc845c0_X7366__cycle5_restore_procedure_hifa_image__regression |
| 14-Oct-2026 22:06:04 | /lustre/cv/sw/casa/casaci/cvpost128/bamboohome/xml-data/build-dir/PIPESPECS-TESTPIPE202621CASA674-ML228PY312TEST/casa-build-utils/pipeline/workdir/casa-6.7.4-12-pipeline-2026.2.1.55-py3.12.el8/lib/py/lib/python3.12/multiprocessing/popen_fork.py:66: DeprecationWarning: This process (pid=615369) is multi-threaded, use of fork() may lead to deadlocks in the child. |
| 14-Oct-2026 22:06:04 | self.pid = os.fork() |
| 14-Oct-2026 22:06:04 | |
| 14-Oct-2026 22:06:04 | tests/regression/fast/alma_if_fast_test.py::test_uid___A002_Xee1eb6_Xc58d__procedure_hifa_calsurvey__regression |
| 14-Oct-2026 22:06:04 | tests/regression/fast/alma_sd_fast_test.py::test_uid___A002_X85c183_X36f__procedure_hsd_calimage__regression |
| 14-Oct-2026 22:06:04 | /lustre/cv/sw/casa/casaci/cvpost128/bamboohome/xml-data/build-dir/PIPESPECS-TESTPIPE202621CASA674-ML228PY312TEST/casa-build-utils/pipeline/workdir/casa-6.7.4-12-pipeline-2026.2.1.55-py3.12.el8/lib/py/lib/python3.12/multiprocessing/popen_fork.py:66: DeprecationWarning: This process (pid=615365) is multi-threaded, use of fork() may lead to deadlocks in the child. |
| 14-Oct-2026 22:06:04 | self.pid = os.fork() |
| 14-Oct-2026 22:06:04 | |
| 14-Oct-2026 22:06:04 | tests/regression/fast/vla_fast_test.py::test_13A_537__restore__cont_cube_selfcal__regression |
| 14-Oct-2026 22:06:04 | tests/regression/fast/vlass_fast_test.py::test_TSKY0001__vlass_quicklook_regression |
| 14-Oct-2026 22:06:04 | /lustre/cv/sw/casa/casaci/cvpost128/bamboohome/xml-data/build-dir/PIPESPECS-TESTPIPE202621CASA674-ML228PY312TEST/casa-build-utils/pipeline/workdir/casa-6.7.4-12-pipeline-2026.2.1.55-py3.12.el8/lib/py/lib/python3.12/multiprocessing/popen_fork.py:66: DeprecationWarning: This process (pid=615381) is multi-threaded, use of fork() may lead to deadlocks in the child. |
| 14-Oct-2026 22:06:04 | self.pid = os.fork() |
| 14-Oct-2026 22:06:04 | |
| 14-Oct-2026 22:06:04 | tests/regression/fast/alma_if_fast_test.py::test_2022_1_00207_S__uid___A001_X2d20_X373d__PPR__regression |
| 14-Oct-2026 22:06:04 | /lustre/cv/sw/casa/casaci/cvpost128/bamboohome/xml-data/build-dir/PIPESPECS-TESTPIPE202621CASA674-ML228PY312TEST/casa-build-utils/pipeline/workdir/casa-6.7.4-12-pipeline-2026.2.1.55-py3.12.el8/lib/py/lib/python3.12/multiprocessing/popen_fork.py:66: DeprecationWarning: This process (pid=615373) is multi-threaded, use of fork() may lead to deadlocks in the child. |
| 14-Oct-2026 22:06:04 | self.pid = os.fork() |
| 14-Oct-2026 22:06:04 | |
| 14-Oct-2026 22:06:12 | tests/regression/fast/alma_if_fast_test.py::test_2023_1_00228_S__uid___A002_X1199f9e_X7c24__procedure_hifa_calimage_diffgain__regression |
| 14-Oct-2026 22:06:12 | /lustre/cv/sw/casa/casaci/cvpost128/bamboohome/xml-data/build-dir/PIPESPECS-TESTPIPE202621CASA674-ML228PY312TEST/casa-build-utils/pipeline/workdir/casa-6.7.4-12-pipeline-2026.2.1.55-py3.12.el8/lib/py/lib/python3.12/multiprocessing/popen_fork.py:66: DeprecationWarning: This process (pid=615352) is multi-threaded, use of fork() may lead to deadlocks in the child. |
| 14-Oct-2026 22:06:12 | self.pid = os.fork() |
| 14-Oct-2026 22:06:12 | |
| 14-Oct-2026 22:06:12 | -- Docs: https://docs.pytest.org/en/stable/how-to/capture-warnings.html |
| 14-Oct-2026 22:06:12 | - generated xml file: /lustre/cv/sw/casa/casaci/cvpost128/bamboohome/xml-data/build-dir/PIPESPECS-TESTPIPE202621CASA674-ML228PY312TEST/casa-build-utils/pipeline/workdir/pipeline_regression_test_result.xml - |
| 14-Oct-2026 22:06:12 | =========================== short test summary info ============================ |
| 14-Oct-2026 22:06:12 | FAILED tests/regression/fast/alma_if_fast_test.py::test_csv_3899_eb2_small__procedure_hifa_calimage__regression - @pytest.mark.twelve |
| 14-Oct-2026 22:06:12 | def test_csv_3899_eb2_small__procedure_hifa_calimage__regression(): |
| 14-Oct-2026 22:06:12 | """PIPE-2245: Run small ALMA cal+image regression to cover various heuristics |
| 14-Oct-2026 22:06:12 | |
| 14-Oct-2026 22:06:12 | Recipe name: procedure_hifa_calimage |
| 14-Oct-2026 22:06:12 | Dataset: CSV-3899-EB2-small |
| 14-Oct-2026 22:06:12 | """ |
| 14-Oct-2026 22:06:12 | ref_directory = 'pl-regressiontest/CSV-3899-EB2-small' |
| 14-Oct-2026 22:06:12 | |
| 14-Oct-2026 22:06:12 | pt = PipelineTester( |
| 14-Oct-2026 22:06:12 | visname=['uid___A002_X1181695_X1c6a4_8ant.ms'], |
| 14-Oct-2026 22:06:12 | recipe='procedure_hifa_calimage.xml', |
| 14-Oct-2026 22:06:12 | input_dir=ref_directory, |
| 14-Oct-2026 22:06:12 | expectedoutput_dir=ref_directory, |
| 14-Oct-2026 22:06:12 | ) |
| 14-Oct-2026 22:06:12 | |
| 14-Oct-2026 22:06:12 | > pt.run(omp_num_threads=1) |
| 14-Oct-2026 22:06:12 | |
| 14-Oct-2026 22:06:12 | tests/regression/fast/alma_if_fast_test.py:181: |
| 14-Oct-2026 22:06:12 | _ _ _ _ _ _ _ _ _ _ _ _ _ _ _ _ _ _ _ _ _ _ _ _ _ _ _ _ _ _ _ _ _ _ _ _ _ _ _ _ |
| 14-Oct-2026 22:06:12 | tests/testing_utils.py:381: in run |
| 14-Oct-2026 22:06:12 | self.__compare_results(new_file, default_relative_tolerance) |
| 14-Oct-2026 22:06:12 | _ _ _ _ _ _ _ _ _ _ _ _ _ _ _ _ _ _ _ _ _ _ _ _ _ _ _ _ _ _ _ _ _ _ _ _ _ _ _ _ |
| 14-Oct-2026 22:06:12 | |
| 14-Oct-2026 22:06:12 | self = <tests.testing_utils.PipelineTester object at 0x7fde249c6a50> |
| 14-Oct-2026 22:06:12 | new_file = 'uid___A002_X1181695_X1c6a4_8ant.ms.NEW.results.txt' |
| 14-Oct-2026 22:06:12 | relative_tolerance = 1e-07 |
| 14-Oct-2026 22:06:12 | |
| 14-Oct-2026 22:06:12 | def __compare_results(self, new_file: str, relative_tolerance: float) -> None: |
| 14-Oct-2026 22:06:12 | """ |
| 14-Oct-2026 22:06:12 | Compare results between new one loaded from file and old one. |
| 14-Oct-2026 22:06:12 | |
| 14-Oct-2026 22:06:12 | Args: |
| 14-Oct-2026 22:06:12 | new_file : file path of new results |
| 14-Oct-2026 22:06:12 | relative_tolerance : relative tolerance of output value |
| 14-Oct-2026 22:06:12 | """ |
| 14-Oct-2026 22:06:12 | with open(self.expectedoutput_file) as expected_fd, open(new_file) as new_fd: |
| 14-Oct-2026 22:06:12 | expected_results = expected_fd.readlines() |
| 14-Oct-2026 22:06:12 | new_results = new_fd.readlines() |
| 14-Oct-2026 22:06:12 | errors = [] |
| 14-Oct-2026 22:06:12 | worst_diff = (0, 0) |
| 14-Oct-2026 22:06:12 | worst_percent_diff = (0, 0) |
| 14-Oct-2026 22:06:12 | for old, new in zip(expected_results, new_results): |
| 14-Oct-2026 22:06:12 | try: |
| 14-Oct-2026 22:06:12 | oldkey, oldval, tol = self.__sanitize_results_string(old) |
| 14-Oct-2026 22:06:12 | newkey, newval, _ = self.__sanitize_results_string(new) |
| 14-Oct-2026 22:06:12 | except ValueError as e: |
| 14-Oct-2026 22:06:12 | errorstr = "The results: {0} could not be parsed. Error: {1}".format(new, str(e)) |
| 14-Oct-2026 22:06:12 | errors.append(errorstr) |
| 14-Oct-2026 22:06:12 | continue |
| 14-Oct-2026 22:06:12 | |
| 14-Oct-2026 22:06:12 | assert oldkey == newkey, f"Expected key {oldkey} does not match new key {newkey}." |
| 14-Oct-2026 22:06:12 | tolerance = tol if tol else relative_tolerance |
| 14-Oct-2026 22:06:12 | if newval is not None: |
| 14-Oct-2026 22:06:12 | LOG.info('Comparing %s to %s with a rel. tolerance of %s', oldval, newval, tolerance) |
| 14-Oct-2026 22:06:12 | if oldval != pytest.approx(newval, rel=tolerance): |
| 14-Oct-2026 22:06:12 | diff = oldval-newval |
| 14-Oct-2026 22:06:12 | percent_diff = (oldval-newval)/oldval * 100 if oldval != 0 else 100 |
| 14-Oct-2026 22:06:12 | if abs(diff) > abs(worst_diff[0]): |
| 14-Oct-2026 22:06:12 | worst_diff = diff, oldkey |
| 14-Oct-2026 22:06:12 | if abs(percent_diff) > abs(worst_percent_diff[0]): |
| 14-Oct-2026 22:06:12 | worst_percent_diff = percent_diff, oldkey |
| 14-Oct-2026 22:06:12 | errorstr = f"{oldkey}\n\tvalues differ by > a relative difference of {tolerance}\n\texpected: {oldval}\n\tnew: {newval}\n\tdiff: {diff}\n\tpercent_diff: {percent_diff}%" |
| 14-Oct-2026 22:06:12 | errors.append(errorstr) |
| 14-Oct-2026 22:06:12 | elif oldval is not None: |
| 14-Oct-2026 22:06:12 | # If only the new value is None, fail |
| 14-Oct-2026 22:06:12 | errorstr = f"{oldkey}\n\tvalue is None\n\texpected: {oldval}\n\tnew: {newval}" |
| 14-Oct-2026 22:06:12 | errors.append(errorstr) |
| 14-Oct-2026 22:06:12 | else: |
| 14-Oct-2026 22:06:12 | # If old and new values are both None, this is expected, so pass |
| 14-Oct-2026 22:06:12 | LOG.info('Comparing %s and %s... both values are None.', oldval, newval) |
| 14-Oct-2026 22:06:12 | |
| 14-Oct-2026 22:06:12 | [LOG.warning(x) for x in errors] |
| 14-Oct-2026 22:06:12 | n_errors = len(errors) |
| 14-Oct-2026 22:06:12 | if n_errors > 0: |
| 14-Oct-2026 22:06:12 | summary_str = f"Worst absolute diff, {worst_diff[1]}: {worst_diff[0]}\nWorst percentage diff, {worst_percent_diff[1]}: {worst_percent_diff[0]}%" |
| 14-Oct-2026 22:06:12 | errors.append(summary_str) |
| 14-Oct-2026 22:06:12 | > pytest.fail("Failed to match {0} result value{1} within tolerance{1} :\n{2}".format( |
| 14-Oct-2026 22:06:12 | n_errors, '' if n_errors == 1 else 's', '\n'.join(errors)), pytrace=True) |
| 14-Oct-2026 22:06:12 | E Failed: Failed to match 2 result values within tolerances : |
| 14-Oct-2026 22:06:12 | E s16.hifa_gfluxscaleflag.uid___A002_X1181695_X1c6a4_8ant.qa.metric.CorrectedampflagQAHandler |
| 14-Oct-2026 22:06:12 | E values differ by > a relative difference of 1e-07 |
| 14-Oct-2026 22:06:12 | E expected: 0.0053688072299937365 |
| 14-Oct-2026 22:06:12 | E new: 0.0 |
| 14-Oct-2026 22:06:12 | E diff: 0.0053688072299937365 |
| 14-Oct-2026 22:06:12 | E percent_diff: 100.0% |
| 14-Oct-2026 22:06:12 | E s16.hifa_gfluxscaleflag.uid___A002_X1181695_X1c6a4_8ant.qa.score.CorrectedampflagQAHandler |
| 14-Oct-2026 22:06:12 | E values differ by > a relative difference of 1e-07 |
| 14-Oct-2026 22:06:12 | E expected: 0.9946311927700062 |
| 14-Oct-2026 22:06:12 | E new: 1.0 |
| 14-Oct-2026 22:06:12 | E diff: -0.005368807229993777 |
| 14-Oct-2026 22:06:12 | E percent_diff: -0.539778690736802% |
| 14-Oct-2026 22:06:12 | E Worst absolute diff, s16.hifa_gfluxscaleflag.uid___A002_X1181695_X1c6a4_8ant.qa.score.CorrectedampflagQAHandler: -0.005368807229993777 |
| 14-Oct-2026 22:06:12 | E Worst percentage diff, s16.hifa_gfluxscaleflag.uid___A002_X1181695_X1c6a4_8ant.qa.metric.CorrectedampflagQAHandler: 100.0% |
| 14-Oct-2026 22:06:12 | |
| 14-Oct-2026 22:06:12 | tests/testing_utils.py:440: Failed |
| 14-Oct-2026 22:06:12 | ========== 1 failed, 17 passed, 1254 warnings in 40279.74s (11:11:19) ========== |
| 14-Oct-2026 22:06:12 | 2026-10-14 22:06:06 INFO pipeline.infrastructure.mpihelpers::SynthesisUtilMethods::getResource synthesis.imager.memprofile.enable is enabled, initializing output file for imager profiling information (memory and run time): casa.synthesis.imager.memprofile.615301.cvpost128.20261014_220605.txt |
| 14-Oct-2026 22:06:12 | 0 |
| 14-Oct-2026 22:06:12 | Finished task 'Test' with result: Success |
| 14-Oct-2026 22:06:12 | Starting task 'JUnit Parser' of type 'com.atlassian.bamboo.plugins.testresultparser:task.testresultparser.junit' |
| 14-Oct-2026 22:06:12 | Parsing test results under /lustre/cv/sw/casa/casaci/cvpost128/bamboohome/xml-data/build-dir/PIPESPECS-TESTPIPE202621CASA674-ML228PY312TEST... |
| 14-Oct-2026 22:07:30 | Failing task since 1 failing test cases were found. |
| 14-Oct-2026 22:07:30 | Finished task 'JUnit Parser' with result: Failed |
| 14-Oct-2026 22:07:30 | Running post build plugin 'Docker Container Cleanup' |
| 14-Oct-2026 22:07:30 | Running post build plugin 'NCover Results Collector' |
| 14-Oct-2026 22:07:30 | Running post build plugin 'Build Results Label Collector' |
| 14-Oct-2026 22:07:30 | Running post build plugin 'Clover Results Collector' |
| 14-Oct-2026 22:07:30 | Running post build plugin 'npm Cache Cleanup' |
| 14-Oct-2026 22:07:30 | Running post build plugin 'Artifact Copier' |
| 14-Oct-2026 22:07:30 | Publishing an artifact: Unit Test Result xml |
| 14-Oct-2026 22:07:30 | Finished publishing of artifact Required shared artifact Http Compression On : [Unit Test Result xml], patterns: [pipeline_regression_test_result.xml] anchored at: [casa-build-utils/pipeline/workdir/] in 80.41 ms |
| 14-Oct-2026 22:07:30 | Publishing an artifact: Regression Test Result |
| 14-Oct-2026 22:07:30 | Finished publishing of artifact Required shared artifact Http Compression On : [Regression Test Result], patterns: [pipeline_unit_test_result.xml] anchored at: [casa-build-utils/pipeline/workdir/] in 34.00 ms |
| 14-Oct-2026 22:07:30 | Finalising the build... |
| 14-Oct-2026 22:07:30 | Stopping timer. |
| 14-Oct-2026 22:07:30 | Build PIPESPECS-TESTPIPE202621CASA674-ML228PY312TEST-9 completed. |
| 14-Oct-2026 18:07:30 | Running on server: post build plugin 'Build Hanging Detection Configuration' |
| 14-Oct-2026 18:07:30 | Running on server: post build plugin 'NCover Results Collector' |
| 14-Oct-2026 18:07:30 | Running on server: post build plugin 'Build Labeller' |
| 14-Oct-2026 18:07:30 | Running on server: post build plugin 'Clover Delta Calculator' |
| 14-Oct-2026 18:07:30 | Running on server: post build plugin 'Maven Dependencies Postprocessor' |
| 14-Oct-2026 18:07:30 | All post build plugins have finished |
| 14-Oct-2026 18:07:30 | Generating build results summary... |
| 14-Oct-2026 18:07:31 | Saving build results to disk... |
| 14-Oct-2026 18:07:31 | Store variable context... |
| 14-Oct-2026 18:07:31 | Finished building PIPESPECS-TESTPIPE202621CASA674-ML228PY312TEST-9. |