Build: #2 failed
Job: Pipeline PR Test 6.7.4 failed
Job result summary
- Completed
- Duration
- 33 seconds
- Agent
- casaci-4.cv.nrao.edu test agent9
- Revision
-
9109ab0b3679dfba97fcba0d7725f6ef2e9163c0
- Fixed in
- #3 (Changes by Shawn Booth)
Error summary
The build generated some errors. See the full build log for more details.
Cloning into 'casa-build-utils'...
X11 forwarding request failed on channel 0
% Total % Received % Xferd Average Speed Time Time Time Current
Dload Upload Total Spent Left Speed
0 0 0 0 0 0 0 0 --:--:-- --:--:-- --:--:-- 0
100 471 100 471 0 0 19625 0 --:--:-- --:--:-- --:--:-- 19625
% Total % Received % Xferd Average Speed Time Time Time Current
Dload Upload Total Spent Left Speed
0 0 0 0 0 0 0 0 --:--:-- --:--:-- --:--:-- 0
46 800M 46 372M 0 0 428M 0 0:00:01 --:--:-- 0:00:01 427M
100 800M 100 800M 0 0 437M 0 0:00:01 0:00:01 --:--:-- 437M
Cloning into 'casa-build-utils'...
WARNING: The script distro is installed in '/home/casatest/.local/bin' which is not on PATH.
Consider adding this directory to PATH or, if you prefer to suppress this warning, use --no-warn-script-location.
[notice] A new release of pip is available: 24.3.1 -> 26.2.1
[notice] To update, run: pip3 install --upgrade pip
Traceback (most recent call last):
File "/home/casatest/casa-build-utils/pipeline/testpipeline.py", line 62, in <module>
raise Exception("Merge failed")
Exception: Merge failed
mkdir: cannot create directory 'workdir': File exists
cp: cannot stat '/home/casatest/casa-build-utils/pipeline/workdir/pipeline_test_result.xml': No such file or directory
chown: cannot access '/pkgout/*': No such file or directory
X11 forwarding request failed on channel 0
% Total % Received % Xferd Average Speed Time Time Time Current
Dload Upload Total Spent Left Speed
0 0 0 0 0 0 0 0 --:--:-- --:--:-- --:--:-- 0
100 471 100 471 0 0 19625 0 --:--:-- --:--:-- --:--:-- 19625
% Total % Received % Xferd Average Speed Time Time Time Current
Dload Upload Total Spent Left Speed
0 0 0 0 0 0 0 0 --:--:-- --:--:-- --:--:-- 0
46 800M 46 372M 0 0 428M 0 0:00:01 --:--:-- 0:00:01 427M
100 800M 100 800M 0 0 437M 0 0:00:01 0:00:01 --:--:-- 437M
Cloning into 'casa-build-utils'...
WARNING: The script distro is installed in '/home/casatest/.local/bin' which is not on PATH.
Consider adding this directory to PATH or, if you prefer to suppress this warning, use --no-warn-script-location.
[notice] A new release of pip is available: 24.3.1 -> 26.2.1
[notice] To update, run: pip3 install --upgrade pip
Traceback (most recent call last):
File "/home/casatest/casa-build-utils/pipeline/testpipeline.py", line 62, in <module>
raise Exception("Merge failed")
Exception: Merge failed
mkdir: cannot create directory 'workdir': File exists
cp: cannot stat '/home/casatest/casa-build-utils/pipeline/workdir/pipeline_test_result.xml': No such file or directory
chown: cannot access '/pkgout/*': No such file or directory