Build: #4 failed
Job: Pipeline PR Test 6.7.4 failed
Job result summary
- Completed
- Duration
- 55 seconds
- Agent
- casaci-4.cv.nrao.edu test agent5
- Revision
-
ba5cfefa438b0aec7feafc7b2ed4cd07a4334165
- Fixed in
- #5 (Changes by Takeshi Nakazato)
Error summary
The build generated some errors. See the full build log for more details.
Cloning into 'casa-build-utils'...
X11 forwarding request failed on channel 0
% Total % Received % Xferd Average Speed Time Time Time Current
Dload Upload Total Spent Left Speed
0 0 0 0 0 0 0 0 --:--:-- --:--:-- --:--:-- 0
100 472 100 472 0 0 7044 0 --:--:-- --:--:-- --:--:-- 7044
% Total % Received % Xferd Average Speed Time Time Time Current
Dload Upload Total Spent Left Speed
0 0 0 0 0 0 0 0 --:--:-- --:--:-- --:--:-- 0
2 802M 2 23.8M 0 0 37.8M 0 0:00:21 --:--:-- 0:00:21 37.7M
8 802M 8 69.6M 0 0 43.0M 0 0:00:18 0:00:01 0:00:17 43.0M
14 802M 14 114M 0 0 43.3M 0 0:00:18 0:00:02 0:00:16 43.3M
19 802M 19 156M 0 0 43.2M 0 0:00:18 0:00:03 0:00:15 43.2M
25 802M 25 203M 0 0 44.0M 0 0:00:18 0:00:04 0:00:14 44.0M
29 802M 29 240M 0 0 42.7M 0 0:00:18 0:00:05 0:00:13 43.4M
35 802M 35 282M 0 0 42.5M 0 0:00:18 0:00:06 0:00:12 42.4M
41 802M 41 329M 0 0 43.1M 0 0:00:18 0:00:07 0:00:11 43.0M
45 802M 45 365M 0 0 42.3M 0 0:00:18 0:00:08 0:00:10 41.6M
50 802M 50 404M 0 0 41.9M 0 0:00:19 0:00:09 0:00:10 39.9M
55 802M 55 441M 0 0 41.5M 0 0:00:19 0:00:10 0:00:09 40.1M
60 802M 60 483M 0 0 41.5M 0 0:00:19 0:00:11 0:00:08 40.2M
64 802M 64 521M 0 0 41.1M 0 0:00:19 0:00:12 0:00:07 38.2M
70 802M 70 564M 0 0 41.4M 0 0:00:19 0:00:13 0:00:06 39.9M
75 802M 75 608M 0 0 41.5M 0 0:00:19 0:00:14 0:00:05 40.8M
80 802M 80 645M 0 0 41.2M 0 0:00:19 0:00:15 0:00:04 40.5M
86 802M 86 691M 0 0 41.5M 0 0:00:19 0:00:16 0:00:03 41.5M
92 802M 92 742M 0 0 42.1M 0 0:00:19 0:00:17 0:00:02 44.4M
98 802M 98 789M 0 0 42.3M 0 0:00:18 0:00:18 --:--:-- 44.8M
100 802M 100 802M 0 0 42.5M 0 0:00:18 0:00:18 --:--:-- 45.7M
Cloning into 'casa-build-utils'...
WARNING: The script distro is installed in '/home/casatest/.local/bin' which is not on PATH.
Consider adding this directory to PATH or, if you prefer to suppress this warning, use --no-warn-script-location.
[notice] A new release of pip is available: 24.3.1 -> 26.2.1
[notice] To update, run: pip3 install --upgrade pip
Traceback (most recent call last):
File "/home/casatest/casa-build-utils/pipeline/testpipeline.py", line 62, in <module>
raise Exception("Merge failed")
Exception: Merge failed
mkdir: cannot create directory 'workdir': File exists
cp: cannot stat '/home/casatest/casa-build-utils/pipeline/workdir/pipeline_test_result.xml': No such file or directory
chown: cannot access '/pkgout/*': No such file or directory
X11 forwarding request failed on channel 0
% Total % Received % Xferd Average Speed Time Time Time Current
Dload Upload Total Spent Left Speed
0 0 0 0 0 0 0 0 --:--:-- --:--:-- --:--:-- 0
100 472 100 472 0 0 7044 0 --:--:-- --:--:-- --:--:-- 7044
% Total % Received % Xferd Average Speed Time Time Time Current
Dload Upload Total Spent Left Speed
0 0 0 0 0 0 0 0 --:--:-- --:--:-- --:--:-- 0
2 802M 2 23.8M 0 0 37.8M 0 0:00:21 --:--:-- 0:00:21 37.7M
8 802M 8 69.6M 0 0 43.0M 0 0:00:18 0:00:01 0:00:17 43.0M
14 802M 14 114M 0 0 43.3M 0 0:00:18 0:00:02 0:00:16 43.3M
19 802M 19 156M 0 0 43.2M 0 0:00:18 0:00:03 0:00:15 43.2M
25 802M 25 203M 0 0 44.0M 0 0:00:18 0:00:04 0:00:14 44.0M
29 802M 29 240M 0 0 42.7M 0 0:00:18 0:00:05 0:00:13 43.4M
35 802M 35 282M 0 0 42.5M 0 0:00:18 0:00:06 0:00:12 42.4M
41 802M 41 329M 0 0 43.1M 0 0:00:18 0:00:07 0:00:11 43.0M
45 802M 45 365M 0 0 42.3M 0 0:00:18 0:00:08 0:00:10 41.6M
50 802M 50 404M 0 0 41.9M 0 0:00:19 0:00:09 0:00:10 39.9M
55 802M 55 441M 0 0 41.5M 0 0:00:19 0:00:10 0:00:09 40.1M
60 802M 60 483M 0 0 41.5M 0 0:00:19 0:00:11 0:00:08 40.2M
64 802M 64 521M 0 0 41.1M 0 0:00:19 0:00:12 0:00:07 38.2M
70 802M 70 564M 0 0 41.4M 0 0:00:19 0:00:13 0:00:06 39.9M
75 802M 75 608M 0 0 41.5M 0 0:00:19 0:00:14 0:00:05 40.8M
80 802M 80 645M 0 0 41.2M 0 0:00:19 0:00:15 0:00:04 40.5M
86 802M 86 691M 0 0 41.5M 0 0:00:19 0:00:16 0:00:03 41.5M
92 802M 92 742M 0 0 42.1M 0 0:00:19 0:00:17 0:00:02 44.4M
98 802M 98 789M 0 0 42.3M 0 0:00:18 0:00:18 --:--:-- 44.8M
100 802M 100 802M 0 0 42.5M 0 0:00:18 0:00:18 --:--:-- 45.7M
Cloning into 'casa-build-utils'...
WARNING: The script distro is installed in '/home/casatest/.local/bin' which is not on PATH.
Consider adding this directory to PATH or, if you prefer to suppress this warning, use --no-warn-script-location.
[notice] A new release of pip is available: 24.3.1 -> 26.2.1
[notice] To update, run: pip3 install --upgrade pip
Traceback (most recent call last):
File "/home/casatest/casa-build-utils/pipeline/testpipeline.py", line 62, in <module>
raise Exception("Merge failed")
Exception: Merge failed
mkdir: cannot create directory 'workdir': File exists
cp: cannot stat '/home/casatest/casa-build-utils/pipeline/workdir/pipeline_test_result.xml': No such file or directory
chown: cannot access '/pkgout/*': No such file or directory