Build: #33 failed

Job: Pipeline PR Test 6.7.4 failed

Stages & jobs

  1. Default Stage

Build log

The build generated 39,668 lines of output.   The output is too long and has been truncated to the last 1,000 lines. Download or view full build log.

02-Oct-2026 13:54:47 infrastructure/executeppr_test.py::test_xmlobjectifier_casttype[true-True] PASSED [ 54%]
02-Oct-2026 13:54:47 infrastructure/executeppr_test.py::test_xmlobjectifier_casttype[False-False] PASSED [ 55%]
02-Oct-2026 13:54:47 infrastructure/executeppr_test.py::test_xmlobjectifier_casttype[['','table1.cal']-expected_value5] PASSED [ 55%]
02-Oct-2026 13:54:47 infrastructure/executeppr_test.py::test_xmlobjectifier_casttype[['test1.ms','test2.ms']-expected_value6] PASSED [ 55%]
02-Oct-2026 13:54:47 infrastructure/executeppr_test.py::test_xmlobjectifier_casttype[test1.ms,test2.ms-test1.ms,test2.ms] PASSED [ 55%]
02-Oct-2026 13:54:47 infrastructure/executeppr_test.py::test_xmlobjectifier_casttype[&lt;12km-<12km] PASSED [ 55%]
02-Oct-2026 13:54:47 infrastructure/executeppr_test.py::test_xmlobjectifier_casttype[None-None] PASSED [ 55%]
02-Oct-2026 13:54:47 infrastructure/executeppr_test.py::test_xmlobjectifier_casttype[[[0,0,1,1],[0,1,0,1]]-expected_value10] PASSED [ 55%]
02-Oct-2026 13:54:47 infrastructure/prefect_adapter_test.py::TestIsPrefectEnabled::test_disabled_when_env_not_set PASSED [ 55%]
02-Oct-2026 13:54:47 infrastructure/prefect_adapter_test.py::TestIsPrefectEnabled::test_disabled_when_env_var_false PASSED [ 55%]
02-Oct-2026 13:54:47 infrastructure/prefect_adapter_test.py::TestIsPrefectEnabled::test_disabled_when_prefect_not_available PASSED [ 56%]
02-Oct-2026 13:54:47 infrastructure/prefect_adapter_test.py::TestIsPrefectEnabled::test_enabled_when_env_var_true SKIPPED [ 56%]
02-Oct-2026 13:54:47 infrastructure/prefect_adapter_test.py::TestTaskResultSummary::test_default_values PASSED [ 56%]
02-Oct-2026 13:54:47 infrastructure/prefect_adapter_test.py::TestTaskResultSummary::test_failed_summary PASSED [ 56%]
02-Oct-2026 13:54:47 infrastructure/prefect_adapter_test.py::TestTaskResultSummary::test_frozen PASSED [ 56%]
02-Oct-2026 13:54:47 infrastructure/prefect_adapter_test.py::TestTaskResultSummary::test_serialization_roundtrip PASSED [ 56%]
02-Oct-2026 13:54:47 infrastructure/prefect_adapter_test.py::TestExecutePipelineTask::test_pipeline_exception_on_tracebacks PASSED [ 56%]
02-Oct-2026 13:54:47 infrastructure/prefect_adapter_test.py::TestExecutePipelineTask::test_successful_execution PASSED [ 56%]
02-Oct-2026 13:54:47 infrastructure/prefect_adapter_test.py::TestExecutePipelineTask::test_unhandled_exception PASSED [ 57%]
02-Oct-2026 13:54:47 infrastructure/renderer/htmlrenderer_test.py::test_format_correlation_bits[ALMA_BASELINE-BITS_4x4-BITS_4x4] PASSED [ 57%]
02-Oct-2026 13:54:47 infrastructure/renderer/htmlrenderer_test.py::test_format_correlation_bits[ALMA_ACA-BITS_4x4-BITS_4x4] PASSED [ 57%]
02-Oct-2026 13:54:47 infrastructure/renderer/htmlrenderer_test.py::test_format_correlation_bits[ALMA_BASELINE-UNKNOWN-Unknown] PASSED [ 57%]
02-Oct-2026 13:54:47 infrastructure/renderer/htmlrenderer_test.py::test_format_correlation_bits[ALMA_ACA-UNKNOWN-Unknown] PASSED [ 57%]
02-Oct-2026 13:54:47 infrastructure/renderer/htmlrenderer_test.py::test_format_correlation_bits[ALMA_BASELINE-None-Unknown] PASSED [ 57%]
02-Oct-2026 13:54:47 infrastructure/renderer/htmlrenderer_test.py::test_format_correlation_bits[ALMA_ACA-None-BITS_4x4] PASSED [ 57%]
02-Oct-2026 13:54:47 infrastructure/renderer/htmlrenderer_test.py::test_format_correlation_bits[ALMA_BASELINE--Unknown] PASSED [ 57%]
02-Oct-2026 13:54:47 infrastructure/renderer/htmlrenderer_test.py::test_format_correlation_bits[ALMA_ACA--BITS_4x4] PASSED [ 58%]
02-Oct-2026 13:54:47 infrastructure/renderer/zd_telmjd_test.py::TestZdTelmjd::test_zd_values PASSED [ 58%]
02-Oct-2026 13:54:47 infrastructure/renderer/zd_telmjd_test.py::TestZdTelmjd::test_field_count PASSED [ 58%]
02-Oct-2026 13:54:47 infrastructure/renderer/zd_telmjd_test.py::TestZdTelmjd::test_timestamp_count PASSED [ 58%]
02-Oct-2026 13:54:47 infrastructure/renderer/zd_telmjd_test.py::TestZdTelmjd::test_telmjd_exact PASSED [ 58%]
02-Oct-2026 13:54:47 infrastructure/utils/casa_data_test.py::test_md5_hash_string_solar_system_models PASSED [ 58%]
02-Oct-2026 13:54:47 infrastructure/utils/casa_data_test.py::test_get_iso_mtime PASSED        [ 58%]
02-Oct-2026 13:54:47 infrastructure/utils/casa_data_test.py::test_retrieve_corresponding_solar_system_models_with_one_file PASSED [ 58%]
02-Oct-2026 13:54:47 infrastructure/utils/casa_data_test.py::test_retrieve_corresponding_solar_system_models_with_two_files PASSED [ 58%]
02-Oct-2026 13:54:47 infrastructure/utils/casa_data_test.py::test_get_filename_info PASSED    [ 59%]
02-Oct-2026 13:54:47 infrastructure/utils/casa_data_test.py::test_info_string_solar_system_models_with_one_file PASSED [ 59%]
02-Oct-2026 13:54:47 infrastructure/utils/casa_data_test.py::test_info_string_solar_system_models_with_two_files PASSED [ 59%]
02-Oct-2026 13:54:47 infrastructure/utils/casa_data_test.py::test_IERSInfo_class_creation PASSED [ 59%]
02-Oct-2026 13:54:47 infrastructure/utils/casa_data_test.py::test_IERSInfo_class_loads_data PASSED [ 59%]
02-Oct-2026 13:54:47 infrastructure/utils/casa_data_test.py::test_IERSInfo_get_IERS_version_method PASSED [ 59%]
02-Oct-2026 13:54:47 infrastructure/utils/casa_data_test.py::test_IERSInfo_get_IERSeop2000_last_entry_method PASSED [ 59%]
02-Oct-2026 13:54:47 infrastructure/utils/casa_data_test.py::test_get_IERS_info PASSED        [ 59%]
02-Oct-2026 13:54:47 infrastructure/utils/casa_data_test.py::test_validate_date_method PASSED [ 60%]
02-Oct-2026 13:54:47 infrastructure/utils/casa_data_test.py::test_string_representation_for_IERS_info PASSED [ 60%]
02-Oct-2026 13:54:47 infrastructure/utils/casa_data_test.py::test_date_message_type PASSED    [ 60%]
02-Oct-2026 13:54:47 infrastructure/utils/casa_data_test.py::test_date_message_type_when_data_is_not_found PASSED [ 60%]
02-Oct-2026 13:54:47 infrastructure/utils/casa_data_test.py::test_from_mjd_to_datetime PASSED [ 60%]
02-Oct-2026 13:54:47 infrastructure/utils/casa_data_test.py::test_IERSInfo_when_data_is_not_found PASSED [ 60%]
02-Oct-2026 13:54:47 infrastructure/utils/casa_data_test.py::test_get_IERS_info_when_data_is_not_found PASSED [ 60%]
02-Oct-2026 13:54:47 infrastructure/utils/casa_data_test.py::test_validate_date_method_when_data_is_not_found PASSED [ 60%]
02-Oct-2026 13:54:47 infrastructure/utils/casa_data_test.py::test_string_representation_for_IERS_info_when_data_is_not_found PASSED [ 60%]
02-Oct-2026 13:54:47 infrastructure/utils/conversion_test.py::test_commafy[inp0-kwargs0-] PASSED [ 61%]
02-Oct-2026 13:54:47 infrastructure/utils/conversion_test.py::test_commafy[inp1-kwargs1-'a'] PASSED [ 61%]
02-Oct-2026 13:54:47 infrastructure/utils/conversion_test.py::test_commafy[inp2-kwargs2-'a' and 'b'] PASSED [ 61%]
02-Oct-2026 13:54:47 infrastructure/utils/conversion_test.py::test_commafy[inp3-kwargs3-'a', 'b' and 'c'] PASSED [ 61%]
02-Oct-2026 13:54:47 infrastructure/utils/conversion_test.py::test_commafy[inp4-kwargs4-'a', 'b' and 'c'] PASSED [ 61%]
02-Oct-2026 13:54:47 infrastructure/utils/conversion_test.py::test_commafy[inp5-kwargs5-a and b] PASSED [ 61%]
02-Oct-2026 13:54:47 infrastructure/utils/conversion_test.py::test_commafy[inp6-kwargs6-s '25', '27' and '29'] PASSED [ 61%]
02-Oct-2026 13:54:47 infrastructure/utils/conversion_test.py::test_commafy[inp7-kwargs7-'a'; 'b' and 'c'] PASSED [ 61%]
02-Oct-2026 13:54:47 infrastructure/utils/conversion_test.py::test_commafy[inp8-kwargs8-'a', 'b' & 'c'] PASSED [ 62%]
02-Oct-2026 13:54:47 infrastructure/utils/conversion_test.py::test_dequote[Field '1'-Field 1] PASSED [ 62%]
02-Oct-2026 13:54:47 infrastructure/utils/conversion_test.py::test_dequote[Field "1"-Field 1] PASSED [ 62%]
02-Oct-2026 13:54:47 infrastructure/utils/conversion_test.py::test_dequote["Field 1", "Field 2"-Field 1, Field 2] PASSED [ 62%]
02-Oct-2026 13:54:47 infrastructure/utils/conversion_test.py::test_dequote['Field 1', 'Field 2'-Field 1, Field 2] PASSED [ 62%]
02-Oct-2026 13:54:47 infrastructure/utils/conversion_test.py::test_flatten[inp0-expected0] PASSED [ 62%]
02-Oct-2026 13:55:05 infrastructure/utils/conversion_test.py::test_flatten[inp1-expected1] PASSED [ 62%]
02-Oct-2026 13:55:05 infrastructure/utils/conversion_test.py::test_flatten[inp2-expected2] PASSED [ 62%]
02-Oct-2026 13:55:05 infrastructure/utils/conversion_test.py::test_flatten[abcd-expected3] PASSED [ 62%]
02-Oct-2026 13:55:05 infrastructure/utils/conversion_test.py::test_flatten[inp4-expected4] PASSED [ 63%]
02-Oct-2026 13:55:05 infrastructure/utils/conversion_test.py::test_flatten_empty PASSED       [ 63%]
02-Oct-2026 13:55:05 infrastructure/utils/conversion_test.py::test_format_datetime[inp0-kwargs0-2020-01-01 12:34:56] PASSED [ 63%]
02-Oct-2026 13:55:05 infrastructure/utils/conversion_test.py::test_format_datetime[inp1-kwargs1-2020-01-01 12:34:56.00001] PASSED [ 63%]
02-Oct-2026 13:55:05 infrastructure/utils/conversion_test.py::test_format_datetime[inp2-kwargs2-2020-01-01 12:34:56.000007] PASSED [ 63%]
02-Oct-2026 13:55:05 infrastructure/utils/conversion_test.py::test_format_datetime_raises_exception_too_high_precision PASSED [ 63%]
02-Oct-2026 13:55:05 infrastructure/utils/conversion_test.py::test_format_timedelta[inp0-kwargs0-1 day, 0:00:00] PASSED [ 63%]
02-Oct-2026 13:55:05 infrastructure/utils/conversion_test.py::test_format_timedelta[inp1-kwargs1-9 days, 0:00:08.00601] PASSED [ 63%]
02-Oct-2026 13:55:05 infrastructure/utils/conversion_test.py::test_format_timedelta[inp2-kwargs2-9 days, 0:00:08.006007] PASSED [ 64%]
02-Oct-2026 13:55:05 infrastructure/utils/conversion_test.py::test_format_timedelta_raises_exception_too_high_precision PASSED [ 64%]
02-Oct-2026 13:55:05 infrastructure/utils/conversion_test.py::test_mjd_seconds_to_datetime[inp0-expected0] PASSED [ 64%]
02-Oct-2026 13:55:05 infrastructure/utils/conversion_test.py::test_mjd_seconds_to_datetime[inp1-expected1] PASSED [ 64%]
02-Oct-2026 13:55:05 infrastructure/utils/conversion_test.py::test_range_to_list[-expected0] PASSED [ 64%]
02-Oct-2026 13:55:05 infrastructure/utils/conversion_test.py::test_range_to_list[1-expected1] PASSED [ 64%]
02-Oct-2026 13:55:05 infrastructure/utils/conversion_test.py::test_range_to_list[1,2-expected2] PASSED [ 64%]
02-Oct-2026 13:55:05 infrastructure/utils/conversion_test.py::test_range_to_list[1~3,5,7~9-expected3] PASSED [ 64%]
02-Oct-2026 13:55:05 infrastructure/utils/conversion_test.py::test_safe_split[-expected0] PASSED [ 65%]
02-Oct-2026 13:55:05 infrastructure/utils/conversion_test.py::test_safe_split[Field 1-expected1] PASSED [ 65%]
02-Oct-2026 13:55:05 infrastructure/utils/conversion_test.py::test_safe_split[Field 1, 'Field 2,3'-expected2] PASSED [ 65%]
02-Oct-2026 13:55:05 infrastructure/utils/conversion_test.py::test_safe_split["Field 1,2" , Field 3-expected3] PASSED [ 65%]
02-Oct-2026 13:55:05 infrastructure/utils/conversion_test.py::test__parse_antenna[inp0-TypeError] PASSED [ 65%]
02-Oct-2026 13:55:05 infrastructure/utils/conversion_test.py::test__parse_antenna[inp1-expected1] PASSED [ 65%]
02-Oct-2026 13:55:05 infrastructure/utils/conversion_test.py::test__parse_antenna[inp2-expected2] PASSED [ 65%]
02-Oct-2026 13:55:05 infrastructure/utils/conversion_test.py::test__parse_antenna[inp3-expected3] PASSED [ 65%]
02-Oct-2026 13:55:05 infrastructure/utils/conversion_test.py::test__parse_antenna[inp4-expected4] PASSED [ 65%]
02-Oct-2026 13:55:05 infrastructure/utils/conversion_test.py::test__parse_antenna[inp5-expected5] PASSED [ 66%]
02-Oct-2026 13:55:05 infrastructure/utils/conversion_test.py::test__parse_antenna[inp6-expected6] PASSED [ 66%]
02-Oct-2026 13:55:05 infrastructure/utils/conversion_test.py::test__parse_antenna[inp7-expected7] PASSED [ 66%]
02-Oct-2026 13:55:05 infrastructure/utils/conversion_test.py::test__parse_antenna[inp8-expected8] PASSED [ 66%]
02-Oct-2026 13:55:05 infrastructure/utils/conversion_test.py::test__parse_antenna[inp9-expected9] PASSED [ 66%]
02-Oct-2026 13:55:05 infrastructure/utils/conversion_test.py::test__parse_antenna[inp10-expected10] PASSED [ 66%]
02-Oct-2026 13:55:05 infrastructure/utils/conversion_test.py::test__parse_antenna[inp11-expected11] PASSED [ 66%]
02-Oct-2026 13:55:05 infrastructure/utils/conversion_test.py::test__parse_antenna[inp12-expected12] PASSED [ 66%]
02-Oct-2026 13:55:05 infrastructure/utils/conversion_test.py::test__parse_antenna[inp13-expected13] PASSED [ 67%]
02-Oct-2026 13:55:05 infrastructure/utils/conversion_test.py::test__parse_antenna[inp14-expected14] PASSED [ 67%]
02-Oct-2026 13:55:05 infrastructure/utils/conversion_test.py::test__parse_antenna[inp15-expected15] PASSED [ 67%]
02-Oct-2026 13:55:05 infrastructure/utils/conversion_test.py::test__parse_antenna[inp16-expected16] PASSED [ 67%]
02-Oct-2026 13:55:05 infrastructure/utils/conversion_test.py::test__parse_field[inp0-TypeError] PASSED [ 67%]
02-Oct-2026 13:55:05 infrastructure/utils/conversion_test.py::test__parse_field[inp1-expected1] PASSED [ 67%]
02-Oct-2026 13:55:05 infrastructure/utils/conversion_test.py::test__parse_field[inp2-expected2] PASSED [ 67%]
02-Oct-2026 13:55:05 infrastructure/utils/conversion_test.py::test__parse_field[inp3-expected3] PASSED [ 67%]
02-Oct-2026 13:55:05 infrastructure/utils/conversion_test.py::test__parse_field[inp4-expected4] PASSED [ 67%]
02-Oct-2026 13:55:05 infrastructure/utils/conversion_test.py::test__parse_field[inp5-expected5] PASSED [ 68%]
02-Oct-2026 13:55:05 infrastructure/utils/conversion_test.py::test__parse_field[inp6-expected6] PASSED [ 68%]
02-Oct-2026 13:55:05 infrastructure/utils/conversion_test.py::test__parse_field[inp7-expected7] PASSED [ 68%]
02-Oct-2026 13:55:05 infrastructure/utils/conversion_test.py::test__parse_field[inp8-expected8] PASSED [ 68%]
02-Oct-2026 13:55:05 infrastructure/utils/conversion_test.py::test__parse_field[inp9-expected9] PASSED [ 68%]
02-Oct-2026 13:55:05 infrastructure/utils/conversion_test.py::test__parse_field[inp10-expected10] PASSED [ 68%]
02-Oct-2026 13:55:05 infrastructure/utils/conversion_test.py::test__parse_field[inp11-expected11] PASSED [ 68%]
02-Oct-2026 13:55:05 infrastructure/utils/conversion_test.py::test__parse_field[inp12-expected12] PASSED [ 68%]
02-Oct-2026 13:55:05 infrastructure/utils/conversion_test.py::test__parse_field[inp13-expected13] PASSED [ 69%]
02-Oct-2026 13:55:05 infrastructure/utils/conversion_test.py::test__parse_field[inp14-expected14] PASSED [ 69%]
02-Oct-2026 13:55:05 infrastructure/utils/conversion_test.py::test__parse_field[inp15-expected15] PASSED [ 69%]
02-Oct-2026 13:55:05 infrastructure/utils/conversion_test.py::test__parse_field[inp16-expected16] PASSED [ 69%]
02-Oct-2026 13:55:05 infrastructure/utils/conversion_test.py::test__parse_spw[inp0-None] PASSED [ 69%]
02-Oct-2026 13:55:05 infrastructure/utils/conversion_test.py::test__parse_spw[inp1-expected1] PASSED [ 69%]
02-Oct-2026 13:55:05 infrastructure/utils/conversion_test.py::test__parse_spw[inp2-expected2] PASSED [ 69%]
02-Oct-2026 13:55:05 infrastructure/utils/conversion_test.py::test__parse_spw[inp3-expected3] PASSED [ 69%]
02-Oct-2026 13:55:05 infrastructure/utils/conversion_test.py::test__parse_spw[inp4-expected4] PASSED [ 69%]
02-Oct-2026 13:55:05 infrastructure/utils/conversion_test.py::test__parse_spw[inp5-expected5] PASSED [ 70%]
02-Oct-2026 13:55:05 infrastructure/utils/conversion_test.py::test__parse_spw[inp6-Exception] PASSED [ 70%]
02-Oct-2026 13:55:05 infrastructure/utils/conversion_test.py::test__parse_spw[inp7-expected7] PASSED [ 70%]
02-Oct-2026 13:55:05 infrastructure/utils/conversion_test.py::test__parse_spw[inp8-expected8] PASSED [ 70%]
02-Oct-2026 13:55:05 infrastructure/utils/conversion_test.py::test__parse_spw[inp9-expected9] PASSED [ 70%]
02-Oct-2026 13:55:05 infrastructure/utils/conversion_test.py::test__parse_spw[inp10-expected10] PASSED [ 70%]
02-Oct-2026 13:55:05 infrastructure/utils/conversion_test.py::test__parse_spw[inp11-expected11] PASSED [ 70%]
02-Oct-2026 13:55:05 infrastructure/utils/conversion_test.py::test_convert_paths[task(vis='/lustre/data/my_file.ms',field='NGC7771,"NGC7752/3",J2355+4950,,"5795"')-task(vis='my_file.ms',field='NGC7771,"NGC7752/3",J2355+4950,,"5795"')] PASSED [ 70%]
02-Oct-2026 13:55:05 infrastructure/utils/conversion_test.py::test_convert_paths[task(vis="..//working/output.ms")-task(vis="output.ms")] PASSED [ 71%]
02-Oct-2026 13:55:05 infrastructure/utils/conversion_test.py::test_convert_paths[task(vis='/full/path/to/my_file.ms', gaintable=['../some/caltable1.tbl', 'caltable2.tbl'])-task(vis='my_file.ms', gaintable=['caltable1.tbl', 'caltable2.tbl'])] PASSED [ 71%]
02-Oct-2026 13:55:05 infrastructure/utils/conversion_test.py::test_convert_paths[\n# This is a comment and should be preserved.\ntask(\n    vis = '/path/to/data.ms', # Another comment\n    output = "output_dir/final.ms",\n    param = 'some_text'\n)\n# A final comment.\n-\n# This is a comment and should be preserved.\ntask(\n    vis = 'data.ms', # Another comment\n    output = "final.ms",\n    param = 'some_text'\n)\n# A final comment.\n] PASSED [ 71%]
02-Oct-2026 13:55:05 infrastructure/utils/conversion_test.py::test_convert_paths[task(param='my_value with "nested" quotes')-task(param='my_value with "nested" quotes')] PASSED [ 71%]
02-Oct-2026 13:55:05 infrastructure/utils/flagversion_tools_test.py::test_transfer_flagversion_identity PASSED [ 71%]
02-Oct-2026 13:55:05 infrastructure/utils/flagversion_tools_test.py::test_transfer_flagversion_mstransform PASSED [ 71%]
02-Oct-2026 13:55:05 infrastructure/utils/flagversion_tools_test.py::test_transfer_flagversion_reorder PASSED [ 71%]
02-Oct-2026 13:55:05 infrastructure/utils/imaging_test.py::test__get_cube_freq_axis[/opt/pipeline-testdata/pl-unittest/helms30_sci.spw16.cube-freq_axis0] PASSED [ 71%]
02-Oct-2026 13:55:05 infrastructure/utils/imaging_test.py::test_chan_selection_to_frequencies[/opt/pipeline-testdata/pl-unittest/helms30_sci.spw16.cube-10~20-GHz-frequency_ranges0] PASSED [ 72%]
02-Oct-2026 13:55:14 infrastructure/utils/imaging_test.py::test_chan_selection_to_frequencies[/opt/pipeline-testdata/pl-unittest/helms30_sci.spw16.cube-40~50;60~80-GHz-frequency_ranges1] PASSED [ 72%]
02-Oct-2026 13:55:14 infrastructure/utils/imaging_test.py::test_freq_selection_to_channels[/opt/pipeline-testdata/pl-unittest/helms30_sci.spw16.cube-214.5~214.9GHz-channel_ranges0] PASSED [ 72%]
02-Oct-2026 13:55:14 infrastructure/utils/imaging_test.py::test_freq_selection_to_channels[/opt/pipeline-testdata/pl-unittest/helms30_sci.spw16.cube-214.5~214.9GHz;215123.4~215567.8MHz-channel_ranges1] PASSED [ 72%]
02-Oct-2026 13:55:14 infrastructure/utils/imaging_test.py::test_spw_intersect[spw_range0-line_regions0-expected0] PASSED [ 72%]
02-Oct-2026 13:55:14 infrastructure/utils/imaging_test.py::test_spw_intersect[spw_range1-line_regions1-expected1] PASSED [ 72%]
02-Oct-2026 13:55:14 infrastructure/utils/imaging_test.py::test_spw_intersect[spw_range2-line_regions2-expected2] PASSED [ 72%]
02-Oct-2026 13:55:14 infrastructure/utils/imaging_test.py::test_spw_intersect[spw_range3-line_regions3-expected3] PASSED [ 72%]
02-Oct-2026 13:55:14 infrastructure/utils/imaging_test.py::test_spw_intersect[spw_range4-line_regions4-expected4] PASSED [ 72%]
02-Oct-2026 13:55:14 infrastructure/utils/imaging_test.py::test_spw_intersect[spw_range5-line_regions5-expected5] PASSED [ 73%]
02-Oct-2026 13:55:14 infrastructure/utils/imaging_test.py::test_update_sens_dict[dct0-udct0-rdct0] PASSED [ 73%]
02-Oct-2026 13:55:14 infrastructure/utils/imaging_test.py::test_update_beams_dict[dct0-udct0-rdct0] PASSED [ 73%]
02-Oct-2026 13:55:14 infrastructure/utils/imaging_test.py::test_set_nested_dict[dct0-keys0-1-rdct0] PASSED [ 73%]
02-Oct-2026 13:55:14 infrastructure/utils/imaging_test.py::test_intersect_ranges[ranges0-intersect_range0] PASSED [ 73%]
02-Oct-2026 13:55:14 infrastructure/utils/imaging_test.py::test_intersect_ranges[ranges1-intersect_range1] PASSED [ 73%]
02-Oct-2026 13:55:14 infrastructure/utils/imaging_test.py::test_intersect_ranges[ranges2-intersect_range2] PASSED [ 73%]
02-Oct-2026 13:55:14 infrastructure/utils/imaging_test.py::test_intersect_ranges[ranges3-intersect_range3] PASSED [ 73%]
02-Oct-2026 13:55:14 infrastructure/utils/imaging_test.py::test_intersect_ranges_by_weight[ranges0-0.01-0.5-intersect_range0] PASSED [ 74%]
02-Oct-2026 13:55:14 infrastructure/utils/imaging_test.py::test_intersect_ranges_by_weight[ranges1-0.01-1.0-intersect_range1] PASSED [ 74%]
02-Oct-2026 13:55:14 infrastructure/utils/imaging_test.py::test_intersect_ranges_by_weight[ranges2-0.0001-0.7-intersect_range2] PASSED [ 74%]
02-Oct-2026 13:55:14 infrastructure/utils/imaging_test.py::test_intersect_ranges_by_weight[ranges3-0.001-1.0-intersect_range3] PASSED [ 74%]
02-Oct-2026 13:55:14 infrastructure/utils/imaging_test.py::test_intersect_ranges_by_weight[ranges4-0.01-1.0-intersect_range4] PASSED [ 74%]
02-Oct-2026 13:55:14 infrastructure/utils/imaging_test.py::test_merge_ranges[ranges0-merged_ranges0] PASSED [ 74%]
02-Oct-2026 13:55:14 infrastructure/utils/imaging_test.py::test_merge_ranges[ranges1-merged_ranges1] PASSED [ 74%]
02-Oct-2026 13:55:14 infrastructure/utils/imaging_test.py::test_merge_ranges[ranges2-merged_ranges2] PASSED [ 74%]
02-Oct-2026 13:55:14 infrastructure/utils/imaging_test.py::test_equal_to_n_digits[1.234-1.235-3-True] PASSED [ 74%]
02-Oct-2026 13:55:14 infrastructure/utils/imaging_test.py::test_equal_to_n_digits[1.234-1.235-4-False] PASSED [ 75%]
02-Oct-2026 13:55:14 infrastructure/utils/imaging_test.py::test_velocity_to_frequency[29.976248175km/s-100.01GHz-100.0GHz] PASSED [ 75%]
02-Oct-2026 13:55:14 infrastructure/utils/imaging_test.py::test_frequency_to_velocity[100.0GHz-100.01GHz-29.976248175km/s] PASSED [ 75%]
02-Oct-2026 13:55:14 infrastructure/utils/imaging_test.py::test_predict_kernel[beam0-target_beam0-1e-06-0.001-kn0-2] PASSED [ 75%]
02-Oct-2026 13:55:14 infrastructure/utils/imaging_test.py::test_predict_kernel[beam1-target_beam1-1e-06-0.001-kn1-1] PASSED [ 75%]
02-Oct-2026 13:55:14 infrastructure/utils/imaging_test.py::test_predict_kernel[beam2-target_beam2-1e-06-0.001-kn2-0] PASSED [ 75%]
02-Oct-2026 13:55:14 infrastructure/utils/math_test.py::test_simple PASSED                    [ 75%]
02-Oct-2026 13:55:14 infrastructure/utils/math_test.py::test_round_half_up[-2.1-0--2.0] PASSED [ 75%]
02-Oct-2026 13:55:14 infrastructure/utils/math_test.py::test_round_half_up[-2.5-0--3.0] PASSED [ 76%]
02-Oct-2026 13:55:14 infrastructure/utils/math_test.py::test_round_half_up[-3.5-0--4.0] PASSED [ 76%]
02-Oct-2026 13:55:14 infrastructure/utils/math_test.py::test_round_half_up[4.2-0-4.0] PASSED  [ 76%]
02-Oct-2026 13:55:14 infrastructure/utils/math_test.py::test_round_half_up[4.5-0-5.0] PASSED  [ 76%]
02-Oct-2026 13:55:14 infrastructure/utils/math_test.py::test_round_half_up[-6.034543-4--6.0345] PASSED [ 76%]
02-Oct-2026 13:55:14 infrastructure/utils/math_test.py::test_round_half_up[-7.034443-4--7.0344] PASSED [ 76%]
02-Oct-2026 13:55:14 infrastructure/utils/math_test.py::test_round_up[-2.1-0--3.0] PASSED     [ 76%]
02-Oct-2026 13:55:14 infrastructure/utils/math_test.py::test_round_up[-2.5-0--3.0] PASSED     [ 76%]
02-Oct-2026 13:55:14 infrastructure/utils/math_test.py::test_round_up[-3.5-0--4.0] PASSED     [ 76%]
02-Oct-2026 13:55:14 infrastructure/utils/math_test.py::test_round_up[4.2-0-5.0] PASSED       [ 77%]
02-Oct-2026 13:55:14 infrastructure/utils/math_test.py::test_round_up[4.5-0-5.0] PASSED       [ 77%]
02-Oct-2026 13:55:14 infrastructure/utils/math_test.py::test_round_up[-6.034543-4--6.0346] PASSED [ 77%]
02-Oct-2026 13:55:14 infrastructure/utils/math_test.py::test_round_up[-7.034443-4--7.0345] PASSED [ 77%]
02-Oct-2026 13:55:14 infrastructure/utils/math_test.py::test_round_down[-2.1-0--2.0] PASSED   [ 77%]
02-Oct-2026 13:55:14 infrastructure/utils/math_test.py::test_round_down[-2.5-0--2.0] PASSED   [ 77%]
02-Oct-2026 13:55:14 infrastructure/utils/math_test.py::test_round_down[-3.5-0--3.0] PASSED   [ 77%]
02-Oct-2026 13:55:14 infrastructure/utils/math_test.py::test_round_down[4.2-0-4.0] PASSED     [ 77%]
02-Oct-2026 13:55:14 infrastructure/utils/math_test.py::test_round_down[4.5-0-4.0] PASSED     [ 78%]
02-Oct-2026 13:55:14 infrastructure/utils/math_test.py::test_round_down[-6.034543-4--6.0345] PASSED [ 78%]
02-Oct-2026 13:55:14 infrastructure/utils/math_test.py::test_round_down[-7.034443-4--7.0344] PASSED [ 78%]
02-Oct-2026 13:55:14 infrastructure/utils/positioncorrection_test.py::test_do_wide_field_corr[/opt/pipeline-testdata/pl-unittest/VLASS1.1.ql.T19t20.J155950+333000.fits-obs_long0-obs_lat0-expected0] PASSED [ 78%]
02-Oct-2026 13:55:14 infrastructure/utils/positioncorrection_test.py::test_do_wide_field_corr[/opt/pipeline-testdata/pl-unittest/VLASS1.2.ql.T17t06.J041750+243000.fits-obs_long1-obs_lat1-expected1] PASSED [ 78%]
02-Oct-2026 13:55:14 infrastructure/utils/positioncorrection_test.py::test_calc_zd_pa[ra0-dec0-obs_long0-obs_lat0-date_time0-expected0] PASSED [ 78%]
02-Oct-2026 13:55:14 infrastructure/utils/positioncorrection_test.py::test_calc_zd_pa[ra1-dec1-obs_long1-obs_lat1-date_time1-expected1] PASSED [ 78%]
02-Oct-2026 13:55:14 infrastructure/utils/sorting_test.py::test_natural_sort[input_list0-expected0] PASSED [ 78%]
02-Oct-2026 13:55:14 infrastructure/utils/sorting_test.py::test_natural_sort[input_list1-expected1] PASSED [ 79%]
02-Oct-2026 13:55:14 infrastructure/utils/sorting_test.py::test_natural_sort[input_list2-expected2] PASSED [ 79%]
02-Oct-2026 13:55:14 infrastructure/utils/sorting_test.py::test_natural_sort[input_list3-expected3] PASSED [ 79%]
02-Oct-2026 13:55:14 infrastructure/utils/sorting_test.py::test_numeric_sort[input_list0-expected0] PASSED [ 79%]
02-Oct-2026 13:55:14 infrastructure/utils/sorting_test.py::test_numeric_sort[input_list1-expected1] PASSED [ 79%]
02-Oct-2026 13:55:14 infrastructure/utils/sorting_test.py::test_numeric_sort[input_list2-expected2] PASSED [ 79%]
02-Oct-2026 13:55:14 infrastructure/utils/sorting_test.py::test_natural_sort_key[session9-expected0] PASSED [ 79%]
02-Oct-2026 13:55:14 infrastructure/utils/sorting_test.py::test_natural_sort_key[session10-expected1] PASSED [ 79%]
02-Oct-2026 13:55:14 infrastructure/utils/sorting_test.py::test_natural_sort_key[session10a-expected2] PASSED [ 79%]
02-Oct-2026 13:55:14 infrastructure/utils/sorting_test.py::test_natural_sort_key[spw10-expected3] PASSED [ 80%]
02-Oct-2026 13:55:14 infrastructure/utils/sorting_test.py::test_natural_sort_key[spw100-expected4] PASSED [ 80%]
02-Oct-2026 13:55:14 infrastructure/utils/sorting_test.py::test_natural_sort_key[spw1-expected5] PASSED [ 80%]
02-Oct-2026 13:55:14 infrastructure/utils/sorting_test.py::test_natural_sort_key[Spw10-expected6] PASSED [ 80%]
02-Oct-2026 13:55:14 infrastructure/utils/sorting_test.py::test_numeric_sort_key[9,11,13-expected0] PASSED [ 80%]
02-Oct-2026 13:55:14 infrastructure/utils/sorting_test.py::test_numeric_sort_key[9,11-expected1] PASSED [ 80%]
02-Oct-2026 13:55:14 infrastructure/utils/sorting_test.py::test_numeric_sort_key[V1.2-expected2] PASSED [ 80%]
02-Oct-2026 13:55:14 infrastructure/utils/sorting_test.py::test_numeric_sort_key[v1.2-expected3] PASSED [ 80%]
02-Oct-2026 13:55:14 infrastructure/utils/utils_test.py::test_find_ranges[-] PASSED           [ 81%]
02-Oct-2026 13:55:14 infrastructure/utils/utils_test.py::test_find_ranges[data1-] PASSED      [ 81%]
02-Oct-2026 13:55:14 infrastructure/utils/utils_test.py::test_find_ranges[1:2-1:2] PASSED     [ 81%]
02-Oct-2026 13:55:14 infrastructure/utils/utils_test.py::test_find_ranges[data3-1~3] PASSED   [ 81%]
02-Oct-2026 13:55:14 infrastructure/utils/utils_test.py::test_find_ranges[data4-5~12,14,16:17] PASSED [ 81%]
02-Oct-2026 13:55:14 infrastructure/utils/utils_test.py::test_find_ranges[data5-1~3,6~7] PASSED [ 81%]
02-Oct-2026 13:55:14 infrastructure/utils/utils_test.py::test_find_ranges[data6-1~3,6~7] PASSED [ 81%]
02-Oct-2026 13:55:14 infrastructure/utils/utils_test.py::test_dict_merge[a0-b0-expected0] PASSED [ 81%]
02-Oct-2026 13:55:14 infrastructure/utils/utils_test.py::test_dict_merge[a1-1-1] PASSED       [ 81%]
02-Oct-2026 13:55:24 infrastructure/utils/utils_test.py::test_dict_merge[a2-b2-expected2] PASSED [ 82%]
02-Oct-2026 13:55:24 infrastructure/utils/utils_test.py::test_dict_merge[a3-b3-expected3] PASSED [ 82%]
02-Oct-2026 13:55:24 infrastructure/utils/utils_test.py::test_dict_merge[a4-b4-expected4] PASSED [ 82%]
02-Oct-2026 13:55:24 infrastructure/utils/utils_test.py::test_dict_merge[a5-b5-expected5] PASSED [ 82%]
02-Oct-2026 13:55:24 infrastructure/utils/utils_test.py::test_dict_merge[a6-b6-expected6] PASSED [ 82%]
02-Oct-2026 13:55:24 infrastructure/utils/utils_test.py::test_are_equal[a0-b0-True] PASSED    [ 82%]
02-Oct-2026 13:55:24 infrastructure/utils/utils_test.py::test_are_equal[a1-b1-False] PASSED   [ 82%]
02-Oct-2026 13:55:24 infrastructure/utils/utils_test.py::test_are_equal[a2-b2-False] PASSED   [ 82%]
02-Oct-2026 13:55:24 infrastructure/utils/utils_test.py::test_are_equal[a3-b3-True] PASSED    [ 83%]
02-Oct-2026 13:55:24 infrastructure/utils/utils_test.py::test_are_equal[a4-b4-False] PASSED   [ 83%]
02-Oct-2026 13:55:24 infrastructure/utils/utils_test.py::test_approx_equal[0.01-0.012-0.01-True] PASSED [ 83%]
02-Oct-2026 13:55:24 infrastructure/utils/utils_test.py::test_approx_equal[0.01-0.012-0.001-False] PASSED [ 83%]
02-Oct-2026 13:55:24 infrastructure/utils/utils_test.py::test_approx_equal[1.0-2.0-0.1-False] PASSED [ 83%]
02-Oct-2026 13:55:24 infrastructure/utils/utils_test.py::test_approx_equal[1-2-10-True] PASSED [ 83%]
02-Oct-2026 13:55:24 infrastructure/utils/utils_test.py::test_get_num_caltable_polarizations[uid___A002_Xc46ab2_X15ae_repSPW_spw16_17_small.ms.hifa_timegaincal.s17_7.spw0.solintinf.gacal.tbl-1] PASSED [ 83%]
02-Oct-2026 13:55:24 infrastructure/utils/utils_test.py::test_get_num_caltable_polarizations[uid___A002_Xc46ab2_X15ae_repSPW_spw16_17_small.ms.hifa_timegaincal.s17_2.spw0.solintinf.gpcal.tbl-2] PASSED [ 83%]
02-Oct-2026 13:55:24 infrastructure/utils/utils_test.py::test_flagged_intervals[vec0-expected0] PASSED [ 83%]
02-Oct-2026 13:55:24 infrastructure/utils/utils_test.py::test_flagged_intervals[vec1-expected1] PASSED [ 84%]
02-Oct-2026 13:55:24 infrastructure/utils/utils_test.py::test_flagged_intervals[vec2-expected2] PASSED [ 84%]
02-Oct-2026 13:55:24 infrastructure/utils/utils_test.py::test_flagged_intervals[vec3-expected3] PASSED [ 84%]
02-Oct-2026 13:55:24 infrastructure/utils/utils_test.py::test_fieldname_for_casa[-] PASSED    [ 84%]
02-Oct-2026 13:55:24 infrastructure/utils/utils_test.py::test_fieldname_for_casa[helm30-helm30] PASSED [ 84%]
02-Oct-2026 13:55:24 infrastructure/utils/utils_test.py::test_fieldname_for_casa[helm=30-"helm=30"] PASSED [ 84%]
02-Oct-2026 13:55:24 infrastructure/utils/utils_test.py::test_fieldname_for_casa[1-"1"] PASSED [ 84%]
02-Oct-2026 13:55:24 infrastructure/utils/utils_test.py::test_fieldname_clean[-] PASSED       [ 84%]
02-Oct-2026 13:55:24 infrastructure/utils/utils_test.py::test_fieldname_clean[helm30-helm30] PASSED [ 85%]
02-Oct-2026 13:55:24 infrastructure/utils/utils_test.py::test_fieldname_clean[helm=30-helm_30] PASSED [ 85%]
02-Oct-2026 13:55:24 infrastructure/utils/utils_test.py::test_fieldname_clean[1-1] PASSED     [ 85%]
02-Oct-2026 13:55:24 infrastructure/utils/utils_test.py::test_get_field_accessor[ms0-field0-Jupiter] PASSED [ 85%]
02-Oct-2026 13:55:24 infrastructure/utils/utils_test.py::test_get_field_accessor[ms1-field1-3] PASSED [ 85%]
02-Oct-2026 13:55:24 infrastructure/utils/utils_test.py::test_get_field_identifiers[ms0-expected0] PASSED [ 85%]
02-Oct-2026 13:55:24 infrastructure/utils/utils_test.py::test_get_field_identifiers[ms1-expected1] PASSED [ 85%]
02-Oct-2026 13:55:24 infrastructure/utils/utils_test.py::test_get_receiver_type_for_spws[ms0-spwids0-expected0] PASSED [ 85%]
02-Oct-2026 13:55:24 infrastructure/utils/utils_test.py::test_get_casa_quantity[None-expected0] PASSED [ 86%]
02-Oct-2026 13:55:24 infrastructure/utils/utils_test.py::test_get_casa_quantity[10klambda-expected1] PASSED [ 86%]
02-Oct-2026 13:55:24 infrastructure/utils/utils_test.py::test_get_casa_quantity[10.0-expected2] PASSED [ 86%]
02-Oct-2026 13:55:24 infrastructure/utils/utils_test.py::test_place_repr_source_first[itemlist0-f2-expected0] PASSED [ 86%]
02-Oct-2026 13:55:24 infrastructure/utils/utils_test.py::test_place_repr_source_first[itemlist1-f2-expected1] PASSED [ 86%]
02-Oct-2026 13:55:24 infrastructure/utils/utils_test.py::test_get_taskhistory_fromimage FAILED [ 86%]
02-Oct-2026 13:55:24 infrastructure/utils/utils_test.py::test_list_to_str[value0-[1, 2, 3]] PASSED [ 86%]
02-Oct-2026 13:55:24 infrastructure/utils/utils_test.py::test_list_to_str[value1-[1, 2, 3]] PASSED [ 86%]
02-Oct-2026 13:55:24 infrastructure/utils/utils_test.py::test_list_to_str[value2-[1, 2, 3]] PASSED [ 86%]
02-Oct-2026 13:55:24 infrastructure/utils/utils_test.py::test_list_to_str[1-1] PASSED         [ 87%]
02-Oct-2026 13:55:24 infrastructure/utils/utils_test.py::test_list_to_str[value4-<lambda>] PASSED [ 87%]
02-Oct-2026 13:55:24 infrastructure/utils/utils_test.py::test_list_to_str[value5-<lambda>] PASSED [ 87%]
02-Oct-2026 13:55:24 infrastructure/utils/utils_test.py::test_list_to_str_py310[value0-[[np.int64(1)], [np.int64(2), np.int64(3)]]] PASSED [ 87%]
02-Oct-2026 13:55:24 infrastructure/utils/utils_test.py::test_build_refantignore[ea01-ignorerefant0-ea01,ea02,ea03] PASSED [ 87%]
02-Oct-2026 13:55:24 infrastructure/utils/utils_test.py::test_build_refantignore[ea01-ignorerefant1-ea01] PASSED [ 87%]
02-Oct-2026 13:55:24 infrastructure/utils/utils_test.py::test_build_refantignore[-ignorerefant2-ea02,ea03] PASSED [ 87%]
02-Oct-2026 13:55:24 infrastructure/utils/utils_test.py::test_build_refantignore[-ignorerefant3-] PASSED [ 87%]
02-Oct-2026 13:55:24 infrastructure/utils/weblog_test.py::test_OrderedDefaultdict_insertion PASSED [ 88%]
02-Oct-2026 13:55:24 infrastructure/utils/weblog_test.py::test_OrderedDefaultdict_typical_use_case PASSED [ 88%]
02-Oct-2026 13:55:24 infrastructure/utils/weblog_test.py::test_merge_td_columns[params0-expected0] PASSED [ 88%]
02-Oct-2026 13:55:24 infrastructure/utils/weblog_test.py::test_merge_td_columns[params1-expected1] PASSED [ 88%]
02-Oct-2026 13:55:24 infrastructure/utils/weblog_test.py::test_merge_td_columns[params2-expected2] PASSED [ 88%]
02-Oct-2026 13:55:24 infrastructure/utils/weblog_test.py::test_merge_td_columns_num_to_merge[0-params0-expected0] PASSED [ 88%]
02-Oct-2026 13:55:24 infrastructure/utils/weblog_test.py::test_merge_td_columns_num_to_merge[1-params1-expected1] PASSED [ 88%]
02-Oct-2026 13:55:24 infrastructure/utils/weblog_test.py::test_merge_td_columns_num_to_merge[2-params2-expected2] PASSED [ 88%]
02-Oct-2026 13:55:24 infrastructure/utils/weblog_test.py::test_merge_td_columns_num_to_merge[3-params3-expected3] PASSED [ 88%]
02-Oct-2026 13:55:24 infrastructure/utils/weblog_test.py::test_merge_td_columns_num_to_merge[20-params4-expected4] PASSED [ 89%]
02-Oct-2026 13:55:24 infrastructure/utils/weblog_test.py::test_merge_td_columns_num_to_merge[-1-params5-expected5] PASSED [ 89%]
02-Oct-2026 13:55:24 infrastructure/utils/weblog_test.py::test_merge_td_columns_vertical_align PASSED [ 89%]
02-Oct-2026 13:55:24 infrastructure/utils/weblog_test.py::test_total_time_on_target_on_source PASSED [ 89%]
02-Oct-2026 13:55:24 infrastructure/utils/weblog_test.py::test_total_time_on_source PASSED    [ 89%]
02-Oct-2026 13:55:24 infrastructure/utils_test.py::test_string_to_val[True-True] PASSED       [ 89%]
02-Oct-2026 13:55:24 infrastructure/utils_test.py::test_string_to_val[false-false] PASSED     [ 89%]
02-Oct-2026 13:55:24 infrastructure/utils_test.py::test_string_to_val[1,2,3-1,2,3] PASSED     [ 89%]
02-Oct-2026 13:55:24 infrastructure/utils_test.py::test_string_to_val[(1,2,3)-expected_value3] PASSED [ 90%]
02-Oct-2026 13:55:24 infrastructure/utils_test.py::test_string_to_val[[1,2,3]-expected_value4] PASSED [ 90%]
02-Oct-2026 13:55:24 infrastructure/utils_test.py::test_string_to_val[None-None] PASSED       [ 90%]
02-Oct-2026 13:55:24 infrastructure/utils_test.py::test_string_to_val[none-none] PASSED       [ 90%]
02-Oct-2026 13:55:24 infrastructure/utils_test.py::test_string_to_val['none'-none] PASSED     [ 90%]
02-Oct-2026 13:55:24 infrastructure/utils_test.py::test_string_to_val[>12klambda->12klambda] PASSED [ 90%]
02-Oct-2026 13:55:24 infrastructure/utils_test.py::test_string_to_val[&lt;12km-&lt;12km] PASSED [ 90%]
02-Oct-2026 13:55:24 infrastructure/utils_test.py::test_string_to_val[[[0,0,1,1],[0,1,0,1]]-expected_value10] PASSED [ 90%]
02-Oct-2026 13:55:24 qa/scorecalculator_test.py::test_get_line_ranges[lines0-expected0] PASSED [ 90%]
02-Oct-2026 13:55:24 qa/scorecalculator_test.py::test_get_line_ranges[lines1-expected1] PASSED [ 91%]
02-Oct-2026 13:55:24 qa/scorecalculator_test.py::test_get_line_ranges[lines2-expected2] PASSED [ 91%]
02-Oct-2026 13:55:24 qa/scorecalculator_test.py::test_get_line_ranges[lines3-expected3] PASSED [ 91%]
02-Oct-2026 13:55:24 qa/scorecalculator_test.py::test_get_line_ranges[lines4-expected4] PASSED [ 91%]
02-Oct-2026 13:55:24 qa/scorecalculator_test.py::test_examine_sd_edge_lines[lines0-2048-edge0-False] PASSED [ 91%]
02-Oct-2026 13:55:24 qa/scorecalculator_test.py::test_examine_sd_edge_lines[lines1-1024-edge1-False] PASSED [ 91%]
02-Oct-2026 13:55:24 qa/scorecalculator_test.py::test_examine_sd_edge_lines[lines2-1024-edge2-False] PASSED [ 91%]
02-Oct-2026 13:55:24 qa/scorecalculator_test.py::test_examine_sd_edge_lines[lines3-1024-edge3-True] PASSED [ 91%]
02-Oct-2026 13:55:24 qa/scorecalculator_test.py::test_examine_sd_edge_lines[lines4-1024-edge4-True] PASSED [ 92%]
02-Oct-2026 13:55:24 qa/scorecalculator_test.py::test_examine_sd_edge_lines[lines5-1024-edge5-True] PASSED [ 92%]
02-Oct-2026 13:55:24 qa/scorecalculator_test.py::test_examine_sd_edge_lines[lines6-1024-edge6-True] PASSED [ 92%]
02-Oct-2026 13:55:24 qa/scorecalculator_test.py::test_examine_sd_edge_lines[lines7-1024-edge7-True] PASSED [ 92%]
02-Oct-2026 13:55:24 qa/scorecalculator_test.py::test_examine_sd_edge_lines[lines8-1024-edge8-True] PASSED [ 92%]
02-Oct-2026 13:55:24 qa/scorecalculator_test.py::test_examine_sd_edge_lines[lines9-1024-edge9-True] PASSED [ 92%]
02-Oct-2026 13:55:30 qa/scorecalculator_test.py::test_examine_sd_edge_lines[lines10-1024-edge10-True] PASSED [ 92%]
02-Oct-2026 13:55:30 qa/scorecalculator_test.py::test_examine_sd_edge_lines[lines11-1024-edge11-True] PASSED [ 92%]
02-Oct-2026 13:55:30 qa/scorecalculator_test.py::test_examine_sd_edge_lines[lines12-1024-edge12-True] PASSED [ 93%]
02-Oct-2026 13:55:30 qa/scorecalculator_test.py::test_examine_sd_edge_lines[lines13-1024-edge13-True] PASSED [ 93%]
02-Oct-2026 13:55:30 qa/scorecalculator_test.py::test_examine_sd_edge_lines[lines14-1024-edge14-True] PASSED [ 93%]
02-Oct-2026 13:55:30 qa/scorecalculator_test.py::test_examine_sd_edge_lines[lines15-1024-edge15-False] PASSED [ 93%]
02-Oct-2026 13:55:30 qa/scorecalculator_test.py::test_examine_sd_edge_lines[lines16-1024-edge16-True] PASSED [ 93%]
02-Oct-2026 13:55:30 qa/scorecalculator_test.py::test_examine_sd_edge_lines[lines17-1024-edge17-False] PASSED [ 93%]
02-Oct-2026 13:55:30 qa/scorecalculator_test.py::test_examine_sd_wide_lines[lines0-2048-edge0-False] PASSED [ 93%]
02-Oct-2026 13:55:30 qa/scorecalculator_test.py::test_examine_sd_wide_lines[lines1-1024-edge1-False] PASSED [ 93%]
02-Oct-2026 13:55:30 qa/scorecalculator_test.py::test_examine_sd_wide_lines[lines2-2048-edge2-False] PASSED [ 93%]
02-Oct-2026 13:55:30 qa/scorecalculator_test.py::test_examine_sd_wide_lines[lines3-1024-edge3-True] PASSED [ 94%]
02-Oct-2026 13:55:30 qa/scorecalculator_test.py::test_examine_sd_wide_lines[lines4-1024-edge4-True] PASSED [ 94%]
02-Oct-2026 13:55:30 qa/scorecalculator_test.py::test_examine_sd_wide_lines[lines5-1024-edge5-True] PASSED [ 94%]
02-Oct-2026 13:55:30 qa/scorecalculator_test.py::test_examine_sd_wide_lines[lines6-2048-edge6-True] PASSED [ 94%]
02-Oct-2026 13:55:30 qa/scorecalculator_test.py::test_examine_sd_wide_lines[lines7-1024-edge7-False] PASSED [ 94%]
02-Oct-2026 13:55:30 qa/scorecalculator_test.py::test_examine_sd_wide_lines[lines8-1024-edge8-True] PASSED [ 94%]
02-Oct-2026 13:55:30 qa/scorecalculator_test.py::test_examine_sd_wide_lines[lines9-1024-edge9-True] PASSED [ 94%]
02-Oct-2026 13:55:30 qa/scorecalculator_test.py::test_examine_sd_wide_lines[lines10-1024-edge10-True] PASSED [ 94%]
02-Oct-2026 13:55:30 qa/scorecalculator_test.py::test_examine_sd_wide_lines[lines11-1024-edge11-True] PASSED [ 95%]
02-Oct-2026 13:55:30 qa/scorecalculator_test.py::test_channel_ranges_for_image[edge0-16-1-ranges0-expected0] PASSED [ 95%]
02-Oct-2026 13:55:30 qa/scorecalculator_test.py::test_channel_ranges_for_image[edge1-16--1-ranges1-expected1] PASSED [ 95%]
02-Oct-2026 13:55:30 qa/scorecalculator_test.py::test_channel_ranges_for_image[edge2-16-1-ranges2-expected2] PASSED [ 95%]
02-Oct-2026 13:55:30 qa/scorecalculator_test.py::test_channel_ranges_for_image[edge3-16-1-ranges3-expected3] PASSED [ 95%]
02-Oct-2026 13:55:30 qa/scorecalculator_test.py::test_channel_ranges_for_image[edge4-16--1-ranges4-expected4] PASSED [ 95%]
02-Oct-2026 13:55:30 qa/scorecalculator_test.py::test_channel_ranges_for_image[edge5-16--1-ranges5-expected5] PASSED [ 95%]
02-Oct-2026 13:55:30 recipes/recipe_converter_test.py::test_get_recipe_dir PASSED             [ 95%]
02-Oct-2026 13:55:30 recipes/recipe_converter_test.py::test_get_cli_dir[hsd] PASSED           [ 95%]
02-Oct-2026 13:55:30 recipes/recipe_converter_test.py::test_get_cli_dir[hif] PASSED           [ 96%]
02-Oct-2026 13:55:30 recipes/recipe_converter_test.py::test_get_cli_dir[blah] PASSED          [ 96%]
02-Oct-2026 13:55:30 recipes/recipe_converter_test.py::test_get_element[<root><a><b>data</b></a></root>-b-1] PASSED [ 96%]
02-Oct-2026 13:55:30 recipes/recipe_converter_test.py::test_get_element[<root><a><b>data</b></a></root>-a-1] PASSED [ 96%]
02-Oct-2026 13:55:30 recipes/recipe_converter_test.py::test_get_element[<root><a><b>data</b></a></root>-c-0] PASSED [ 96%]
02-Oct-2026 13:55:30 recipes/recipe_converter_test.py::test_get_element[<root><a><b>data</b><b>data</b></a></root>-b-2] PASSED [ 96%]
02-Oct-2026 13:55:30 recipes/recipe_converter_test.py::test_get_data[<a>data</a>-data] PASSED [ 96%]
02-Oct-2026 13:55:30 recipes/recipe_converter_test.py::test_get_data[<a><b>data</b></a>-AttributeError] PASSED [ 96%]
02-Oct-2026 13:55:30 recipes/recipe_converter_test.py::test_parse_parameter[<root><Keyword>spw</Keyword><Value>0</Value></root>-expected0] PASSED [ 97%]
02-Oct-2026 13:55:30 recipes/recipe_converter_test.py::test_parse_command[<ProcessingCommand><Command>h_save</Command><ParameterSet></ParameterSet></ProcessingCommand>-expected0] PASSED [ 97%]
02-Oct-2026 13:55:30 recipes/recipe_converter_test.py::test_parse_command[<ProcessingCommand><Command>h_save</Command><ParameterSet><Parameter><Keyword>filename</Keyword><Value>output.context</Value></Parameter></ParameterSet></ProcessingCommand>-expected1] PASSED [ 97%]
02-Oct-2026 13:55:30 recipes/recipe_converter_test.py::test_parse_command[<ProcessingCommand><Command>breakpoint</Command><ParameterSet></ParameterSet></ProcessingCommand>-expected2] PASSED [ 97%]
02-Oct-2026 13:55:30 recipes/recipe_converter_test.py::test_parse_command[<ProcessingCommand><task><shortdescription>do something</shortdescription></task></ProcessingCommand>-AssertionError] PASSED [ 97%]
02-Oct-2026 13:55:30 recipes/recipe_converter_test.py::test_parse_command[<ProcessingCommand><Command>h_init</Command><ParameterSet></ParameterSet><Command>h_save</Command><ParameterSet></ParameterSet></ProcessingCommand>-AssertionError] PASSED [ 97%]
02-Oct-2026 13:55:30 recipes/recipe_converter_test.py::test_parse_command[<ProcessingCommand><Command>h_save</Command></ProcessingCommand>-AssertionError] PASSED [ 97%]
02-Oct-2026 13:55:30 recipes/recipe_converter_test.py::test_parse[<ProcessingProcedure></ProcessingProcedure>-AssertionError] PASSED [ 97%]
02-Oct-2026 13:55:30 recipes/recipe_converter_test.py::test_parse[<ProcessingProcedure><ProcedureTitle>h_test</ProcedureTitle><ProcessingCommand><Command>h_save</Command><ParameterSet></ParameterSet></ProcessingCommand></ProcessingProcedure>-expected1] PASSED [ 97%]
02-Oct-2026 13:55:30 recipes/recipe_converter_test.py::test_get_comment[breakpoint-config0-        #  ---- breakpoint ----] PASSED [ 98%]
02-Oct-2026 13:55:30 recipes/recipe_converter_test.py::test_get_comment[breakpoint-config1-        #  ---- breakpoint ----] PASSED [ 98%]
02-Oct-2026 13:55:30 recipes/recipe_converter_test.py::test_get_comment[hsd_baseline-config2-] PASSED [ 98%]
02-Oct-2026 13:55:30 recipes/recipe_converter_test.py::test_get_comment[hsd_baseline-config3-        # This is comment\n] PASSED [ 98%]
02-Oct-2026 13:55:30 recipes/recipe_converter_test.py::test_get_comment[hsd_baseline-config4-        # This is comment\n] PASSED [ 98%]
02-Oct-2026 13:55:30 recipes/recipe_converter_test.py::test_get_comment[hsd_baseline-config5-        # This is \n        # multi-line comment\n] PASSED [ 98%]
02-Oct-2026 13:55:30 recipes/recipe_converter_test.py::test_get_comment[hsd_baseline-config6-        # This is \n        # multi-line comment\n] PASSED [ 98%]
02-Oct-2026 13:55:30 recipes/recipe_converter_test.py::test_get_execution_command[breakpoint-config0-] PASSED [ 98%]
02-Oct-2026 13:55:30 recipes/recipe_converter_test.py::test_get_execution_command[hsd_baseline-config1-        hsd_baseline()] PASSED [ 99%]
02-Oct-2026 13:55:30 recipes/recipe_converter_test.py::test_get_execution_command[hsd_baseline-config2-        hsd_baseline(pstr='strval', pint=3)] PASSED [ 99%]
02-Oct-2026 13:55:30 recipes/recipe_converter_test.py::test_get_execution_command[hsd_importdata-config3-        hsd_importdata(vis=vislist)\n\n        if importonly:\n            raise Exception(IMPORT_ONLY)] PASSED [ 99%]
02-Oct-2026 13:55:30 recipes/recipe_converter_test.py::test_c2p PASSED                        [ 99%]
02-Oct-2026 13:55:30 recipes/recipe_converter_test.py::test_to_procedure PASSED               [ 99%]
02-Oct-2026 13:55:30 recipes/recipe_converter_test.py::test_export[False-] PASSED             [ 99%]
02-Oct-2026 13:55:30 recipes/recipe_converter_test.py::test_export[True-plotlevel='summary'] PASSED [ 99%]
02-Oct-2026 13:55:30 recipes/recipe_converter_test.py::test_main SKIPPED (Skip testing ma...) [ 99%]
02-Oct-2026 13:55:30 recipes/recipe_converter_test.py::test_generate_all SKIPPED (Skip te...) [100%]
02-Oct-2026 13:55:30
02-Oct-2026 13:55:30 =================================== FAILURES ===================================
02-Oct-2026 13:55:30 ________________________ test_get_taskhistory_fromimage ________________________
02-Oct-2026 13:55:30
02-Oct-2026 13:55:30 tmpdir = local('/tmp/pytest-of-casatest/pytest-0/test_get_taskhistory_fromimage0')
02-Oct-2026 13:55:30
02-Oct-2026 13:55:30     def test_get_taskhistory_fromimage(tmpdir):
02-Oct-2026 13:55:30         """Test get_taskhistory_fromimage()."""
02-Oct-2026 13:55:30    
02-Oct-2026 13:55:30         tclean_job_base = {'vis': 'uid___A002_Xc46ab2_X15ae_repSPW_spw16_17_small.ms',
02-Oct-2026 13:55:30                            'field': 'Uranus', 'spw': ['0'], 'antenna': ['0,1,2,3,4,5,6,7,8,9,10&'],
02-Oct-2026 13:55:30                            'scan': ['6'], 'intent': 'CALIBRATE_FLUX#ON_SOURCE', 'datacolumn': 'data',
02-Oct-2026 13:55:30                            'imagename': 'oussid.s21_0.Uranus_flux.spw0.mfs.I.iter0', 'imsize': [90, 90],
02-Oct-2026 13:55:30                            'cell': ['0.9arcsec'], 'phasecenter': 'TRACKFIELD', 'stokes': 'I', 'specmode': 'mfs',
02-Oct-2026 13:55:30                            'pblimit': 0.2, 'deconvolver': 'hogbom', 'restoringbeam': 'common', 'pbcor': False,
02-Oct-2026 13:55:30                            'weighting': 'briggs', 'robust': 0.5, 'npixels': 0, 'niter': 0, 'savemodel': 'none', 'parallel': False}
02-Oct-2026 13:55:30    
02-Oct-2026 13:55:30         tclean_job_list = [copy.deepcopy(tclean_job_base) for i in range(2)]
02-Oct-2026 13:55:30         tclean_job_list[1]['niter'] = 1
02-Oct-2026 13:55:30    
02-Oct-2026 13:55:30         for tclean_job_parameters in tclean_job_list:
02-Oct-2026 13:55:30             vis = casa_tools.utils.resolve(f"pl-unittest/{tclean_job_parameters['vis']}")
02-Oct-2026 13:55:30             tclean_job_parameters['vis'] = vis
02-Oct-2026 13:55:30             tclean_job_parameters['imagename'] = os.path.join(str(tmpdir), tclean_job_parameters['imagename'])
02-Oct-2026 13:55:30             job = casa_tasks.tclean(**tclean_job_parameters)
02-Oct-2026 13:55:30             job.execute()
02-Oct-2026 13:55:30    
02-Oct-2026 13:55:30 >       task_history_list = get_taskhistory_fromimage(tclean_job_parameters['imagename']+'.model')
02-Oct-2026 13:55:30                             ^^^^^^^^^^^^^^^^^^^^^^^^^^^^^^^^^^^^^^^^^^^^^^^^^^^^^^^^^^^^^^^^^^^^^^
02-Oct-2026 13:55:30
02-Oct-2026 13:55:30 infrastructure/utils/utils_test.py:282:
02-Oct-2026 13:55:30 _ _ _ _ _ _ _ _ _ _ _ _ _ _ _ _ _ _ _ _ _ _ _ _ _ _ _ _ _ _ _ _ _ _ _ _ _ _ _ _
02-Oct-2026 13:55:30 infrastructure/utils/utils.py:559: in get_taskhistory_fromimage
02-Oct-2026 13:55:30     with casa_tools.ImageReader(imagename) as image:
02-Oct-2026 13:55:30 ../../casa-6.7.4-9-py3.12.el8/lib/py/lib/python3.12/contextlib.py:137: in __enter__
02-Oct-2026 13:55:30     return next(self.gen)
02-Oct-2026 13:55:30            ^^^^^^^^^^^^^^
02-Oct-2026 13:55:30 _ _ _ _ _ _ _ _ _ _ _ _ _ _ _ _ _ _ _ _ _ _ _ _ _ _ _ _ _ _ _ _ _ _ _ _ _ _ _ _
02-Oct-2026 13:55:30
02-Oct-2026 13:55:30 filename = '/tmp/pytest-of-casatest/pytest-0/test_get_taskhistory_fromimage0/oussid.s21_0.Uranus_flux.spw0.mfs.I.iter0.model'
02-Oct-2026 13:55:30 kwargs = {}
02-Oct-2026 13:55:30
02-Oct-2026 13:55:30     @contextlib.contextmanager
02-Oct-2026 13:55:30     def f(filename, **kwargs):
02-Oct-2026 13:55:30         if not os.path.exists(filename):
02-Oct-2026 13:55:30 >           raise IOError('No such file or directory: {!r}'.format(filename))
02-Oct-2026 13:55:30 E           OSError: No such file or directory: '/tmp/pytest-of-casatest/pytest-0/test_get_taskhistory_fromimage0/oussid.s21_0.Uranus_flux.spw0.mfs.I.iter0.model'
02-Oct-2026 13:55:30
02-Oct-2026 13:55:30 infrastructure/casa_tools.py:176: OSError
02-Oct-2026 13:55:30 ----------------------------- Captured stdout call -----------------------------
02-Oct-2026 13:55:30 2026-10-02 17:55:18 WARNING: Removing unexpected keywords from JobRequest: ['vis', 'field', 'spw', 'antenna', 'scan', 'intent', 'datacolumn', 'imagename', 'imsize', 'cell', 'phasecenter', 'stokes', 'specmode', 'pblimit', 'deconvolver', 'restoringbeam', 'pbcor', 'weighting', 'robust', 'npixels', 'niter', 'savemodel']
02-Oct-2026 13:55:30 2026-10-02 17:55:18 INFO: Executing _tclean(parallel=False)
02-Oct-2026 13:55:30 2026-10-02 17:55:18 WARNING: Removing unexpected keywords from JobRequest: ['vis', 'field', 'spw', 'antenna', 'scan', 'intent', 'datacolumn', 'imagename', 'imsize', 'cell', 'phasecenter', 'stokes', 'specmode', 'pblimit', 'deconvolver', 'restoringbeam', 'pbcor', 'weighting', 'robust', 'npixels', 'niter', 'savemodel']
02-Oct-2026 13:55:30 2026-10-02 17:55:18 INFO: Executing _tclean(parallel=False)
02-Oct-2026 13:55:30 ----------------------------- Captured stderr call -----------------------------
02-Oct-2026 13:55:30 2026-10-02 17:55:19        WARN        pipeline::pipeline.infrastructure.jobrequest::casa        Removing unexpected keywords from JobRequest: ['vis', 'field', 'spw', 'antenna', 'scan', 'intent', 'datacolumn', 'imagename', 'imsize', 'cell', 'phasecenter', 'stokes', 'specmode', 'pblimit', 'deconvolver', 'restoringbeam', 'pbcor', 'weighting', 'robust', 'npixels', 'niter', 'savemodel']
02-Oct-2026 13:55:30 2026-10-02 17:55:19        WARN        pipeline::pipeline.infrastructure.jobrequest::casa        Removing unexpected keywords from JobRequest: ['vis', 'field', 'spw', 'antenna', 'scan', 'intent', 'datacolumn', 'imagename', 'imsize', 'cell', 'phasecenter', 'stokes', 'specmode', 'pblimit', 'deconvolver', 'restoringbeam', 'pbcor', 'weighting', 'robust', 'npixels', 'niter', 'savemodel']
02-Oct-2026 13:55:30 =============================== warnings summary ===============================
02-Oct-2026 13:55:30 ../../casa-6.7.4-9-py3.12.el8/lib/py/lib/python3.12/site-packages/google/protobuf/internal/well_known_types.py:91
02-Oct-2026 13:55:30   /home/casatest/casa-build-utils/pipeline/workdir/casa-6.7.4-9-py3.12.el8/lib/py/lib/python3.12/site-packages/google/protobuf/internal/well_known_types.py:91: DeprecationWarning: datetime.datetime.utcfromtimestamp() is deprecated and scheduled for removal in a future version. Use timezone-aware objects to represent datetimes in UTC: datetime.datetime.fromtimestamp(timestamp, datetime.UTC).
02-Oct-2026 13:55:30     _EPOCH_DATETIME_NAIVE = datetime.datetime.utcfromtimestamp(0)
02-Oct-2026 13:55:30
02-Oct-2026 13:55:30 ../../casa-6.7.4-9-py3.12.el8/lib/py/lib/python3.12/site-packages/casaplotms/private/plotms_pb2.py:19
02-Oct-2026 13:55:30   /home/casatest/casa-build-utils/pipeline/workdir/casa-6.7.4-9-py3.12.el8/lib/py/lib/python3.12/site-packages/casaplotms/private/plotms_pb2.py:19: DeprecationWarning: Call to deprecated create function FileDescriptor(). Note: Create unlinked descriptors is going to go away. Please use get/find descriptors from generated code or query the descriptor_pool.
02-Oct-2026 13:55:30     DESCRIPTOR = _descriptor.FileDescriptor(
02-Oct-2026 13:55:30
02-Oct-2026 13:55:30 ../../casa-6.7.4-9-py3.12.el8/lib/py/lib/python3.12/site-packages/casaplotms/private/plotms_pb2.py:38
02-Oct-2026 13:55:30   /home/casatest/casa-build-utils/pipeline/workdir/casa-6.7.4-9-py3.12.el8/lib/py/lib/python3.12/site-packages/casaplotms/private/plotms_pb2.py:38: DeprecationWarning: Call to deprecated create function FieldDescriptor(). Note: Create unlinked descriptors is going to go away. Please use get/find descriptors from generated code or query the descriptor_pool.
02-Oct-2026 13:55:30     _descriptor.FieldDescriptor(
02-Oct-2026 13:55:30
02-Oct-2026 13:55:30 ../../casa-6.7.4-9-py3.12.el8/lib/py/lib/python3.12/site-packages/casaplotms/private/plotms_pb2.py:31
02-Oct-2026 13:55:30   /home/casatest/casa-build-utils/pipeline/workdir/casa-6.7.4-9-py3.12.el8/lib/py/lib/python3.12/site-packages/casaplotms/private/plotms_pb2.py:31: DeprecationWarning: Call to deprecated create function Descriptor(). Note: Create unlinked descriptors is going to go away. Please use get/find descriptors from generated code or query the descriptor_pool.
02-Oct-2026 13:55:30     _PID = _descriptor.Descriptor(
02-Oct-2026 13:55:30
02-Oct-2026 13:55:30 ../../casa-6.7.4-9-py3.12.el8/lib/py/lib/python3.12/site-packages/casaplotms/private/plotms_pb2.py:69
02-Oct-2026 13:55:30   /home/casatest/casa-build-utils/pipeline/workdir/casa-6.7.4-9-py3.12.el8/lib/py/lib/python3.12/site-packages/casaplotms/private/plotms_pb2.py:69: DeprecationWarning: Call to deprecated create function FieldDescriptor(). Note: Create unlinked descriptors is going to go away. Please use get/find descriptors from generated code or query the descriptor_pool.
02-Oct-2026 13:55:30     _descriptor.FieldDescriptor(
02-Oct-2026 13:55:30
02-Oct-2026 13:55:30 ../../casa-6.7.4-9-py3.12.el8/lib/py/lib/python3.12/site-packages/casaplotms/private/plotms_pb2.py:62
02-Oct-2026 13:55:30   /home/casatest/casa-build-utils/pipeline/workdir/casa-6.7.4-9-py3.12.el8/lib/py/lib/python3.12/site-packages/casaplotms/private/plotms_pb2.py:62: DeprecationWarning: Call to deprecated create function Descriptor(). Note: Create unlinked descriptors is going to go away. Please use get/find descriptors from generated code or query the descriptor_pool.
02-Oct-2026 13:55:30     _NUMPLOTS = _descriptor.Descriptor(
02-Oct-2026 13:55:30
02-Oct-2026 13:55:30 ../../casa-6.7.4-9-py3.12.el8/lib/py/lib/python3.12/site-packages/casaplotms/private/plotms_pb2.py:100
02-Oct-2026 13:55:30   /home/casatest/casa-build-utils/pipeline/workdir/casa-6.7.4-9-py3.12.el8/lib/py/lib/python3.12/site-packages/casaplotms/private/plotms_pb2.py:100: DeprecationWarning: Call to deprecated create function FieldDescriptor(). Note: Create unlinked descriptors is going to go away. Please use get/find descriptors from generated code or query the descriptor_pool.
02-Oct-2026 13:55:30     _descriptor.FieldDescriptor(
02-Oct-2026 13:55:30
02-Oct-2026 13:55:30 ../../casa-6.7.4-9-py3.12.el8/lib/py/lib/python3.12/site-packages/casaplotms/private/plotms_pb2.py:93
02-Oct-2026 13:55:30   /home/casatest/casa-build-utils/pipeline/workdir/casa-6.7.4-9-py3.12.el8/lib/py/lib/python3.12/site-packages/casaplotms/private/plotms_pb2.py:93: DeprecationWarning: Call to deprecated create function Descriptor(). Note: Create unlinked descriptors is going to go away. Please use get/find descriptors from generated code or query the descriptor_pool.
02-Oct-2026 13:55:30     _TOGGLE = _descriptor.Descriptor(
02-Oct-2026 13:55:30
02-Oct-2026 13:55:30 ../../casa-6.7.4-9-py3.12.el8/lib/py/lib/python3.12/site-packages/casaplotms/private/plotms_pb2.py:131
02-Oct-2026 13:55:30   /home/casatest/casa-build-utils/pipeline/workdir/casa-6.7.4-9-py3.12.el8/lib/py/lib/python3.12/site-packages/casaplotms/private/plotms_pb2.py:131: DeprecationWarning: Call to deprecated create function FieldDescriptor(). Note: Create unlinked descriptors is going to go away. Please use get/find descriptors from generated code or query the descriptor_pool.
02-Oct-2026 13:55:30     _descriptor.FieldDescriptor(
02-Oct-2026 13:55:30
02-Oct-2026 13:55:30 ../../casa-6.7.4-9-py3.12.el8/lib/py/lib/python3.12/site-packages/casaplotms/private/plotms_pb2.py:138
02-Oct-2026 13:55:30   /home/casatest/casa-build-utils/pipeline/workdir/casa-6.7.4-9-py3.12.el8/lib/py/lib/python3.12/site-packages/casaplotms/private/plotms_pb2.py:138: DeprecationWarning: Call to deprecated create function FieldDescriptor(). Note: Create unlinked descriptors is going to go away. Please use get/find descriptors from generated code or query the descriptor_pool.
02-Oct-2026 13:55:30     _descriptor.FieldDescriptor(
02-Oct-2026 13:55:30
02-Oct-2026 13:55:30 ../../casa-6.7.4-9-py3.12.el8/lib/py/lib/python3.12/site-packages/casaplotms/private/plotms_pb2.py:124
02-Oct-2026 13:55:30   /home/casatest/casa-build-utils/pipeline/workdir/casa-6.7.4-9-py3.12.el8/lib/py/lib/python3.12/site-packages/casaplotms/private/plotms_pb2.py:124: DeprecationWarning: Call to deprecated create function Descriptor(). Note: Create unlinked descriptors is going to go away. Please use get/find descriptors from generated code or query the descriptor_pool.
02-Oct-2026 13:55:30     _GRIDSIZE = _descriptor.Descriptor(
02-Oct-2026 13:55:30
02-Oct-2026 13:55:30 ../../casa-6.7.4-9-py3.12.el8/lib/py/lib/python3.12/site-packages/casaplotms/private/plotms_pb2.py:169
02-Oct-2026 13:55:30   /home/casatest/casa-build-utils/pipeline/workdir/casa-6.7.4-9-py3.12.el8/lib/py/lib/python3.12/site-packages/casaplotms/private/plotms_pb2.py:169: DeprecationWarning: Call to deprecated create function FieldDescriptor(). Note: Create unlinked descriptors is going to go away. Please use get/find descriptors from generated code or query the descriptor_pool.
02-Oct-2026 13:55:30     _descriptor.FieldDescriptor(
02-Oct-2026 13:55:30
02-Oct-2026 13:55:30 ../../casa-6.7.4-9-py3.12.el8/lib/py/lib/python3.12/site-packages/casaplotms/private/plotms_pb2.py:176
02-Oct-2026 13:55:30   /home/casatest/casa-build-utils/pipeline/workdir/casa-6.7.4-9-py3.12.el8/lib/py/lib/python3.12/site-packages/casaplotms/private/plotms_pb2.py:176: DeprecationWarning: Call to deprecated create function FieldDescriptor(). Note: Create unlinked descriptors is going to go away. Please use get/find descriptors from generated code or query the descriptor_pool.
02-Oct-2026 13:55:30     _descriptor.FieldDescriptor(
02-Oct-2026 13:55:30
02-Oct-2026 13:55:30 ../../casa-6.7.4-9-py3.12.el8/lib/py/lib/python3.12/site-packages/casaplotms/private/plotms_pb2.py:183
02-Oct-2026 13:55:30   /home/casatest/casa-build-utils/pipeline/workdir/casa-6.7.4-9-py3.12.el8/lib/py/lib/python3.12/site-packages/casaplotms/private/plotms_pb2.py:183: DeprecationWarning: Call to deprecated create function FieldDescriptor(). Note: Create unlinked descriptors is going to go away. Please use get/find descriptors from generated code or query the descriptor_pool.
02-Oct-2026 13:55:30     _descriptor.FieldDescriptor(
02-Oct-2026 13:55:30
02-Oct-2026 13:55:30 ../../casa-6.7.4-9-py3.12.el8/lib/py/lib/python3.12/site-packages/casaplotms/private/plotms_pb2.py:162
02-Oct-2026 13:55:30   /home/casatest/casa-build-utils/pipeline/workdir/casa-6.7.4-9-py3.12.el8/lib/py/lib/python3.12/site-packages/casaplotms/private/plotms_pb2.py:162: DeprecationWarning: Call to deprecated create function Descriptor(). Note: Create unlinked descriptors is going to go away. Please use get/find descriptors from generated code or query the descriptor_pool.
02-Oct-2026 13:55:30     _SETVIS = _descriptor.Descriptor(
02-Oct-2026 13:55:30
02-Oct-2026 13:55:30 ../../casa-6.7.4-9-py3.12.el8/lib/py/lib/python3.12/site-packages/casaplotms/private/plotms_pb2.py:214
02-Oct-2026 13:55:30   /home/casatest/casa-build-utils/pipeline/workdir/casa-6.7.4-9-py3.12.el8/lib/py/lib/python3.12/site-packages/casaplotms/private/plotms_pb2.py:214: DeprecationWarning: Call to deprecated create function FieldDescriptor(). Note: Create unlinked descriptors is going to go away. Please use get/find descriptors from generated code or query the descriptor_pool.
02-Oct-2026 13:55:30     _descriptor.FieldDescriptor(
02-Oct-2026 13:55:30
02-Oct-2026 13:55:30 ../../casa-6.7.4-9-py3.12.el8/lib/py/lib/python3.12/site-packages/casaplotms/private/plotms_pb2.py:221
02-Oct-2026 13:55:30   /home/casatest/casa-build-utils/pipeline/workdir/casa-6.7.4-9-py3.12.el8/lib/py/lib/python3.12/site-packages/casaplotms/private/plotms_pb2.py:221: DeprecationWarning: Call to deprecated create function FieldDescriptor(). Note: Create unlinked descriptors is going to go away. Please use get/find descriptors from generated code or query the descriptor_pool.
02-Oct-2026 13:55:30     _descriptor.FieldDescriptor(
02-Oct-2026 13:55:30
02-Oct-2026 13:55:30 ../../casa-6.7.4-9-py3.12.el8/lib/py/lib/python3.12/site-packages/casaplotms/private/plotms_pb2.py:228
02-Oct-2026 13:55:30   /home/casatest/casa-build-utils/pipeline/workdir/casa-6.7.4-9-py3.12.el8/lib/py/lib/python3.12/site-packages/casaplotms/private/plotms_pb2.py:228: DeprecationWarning: Call to deprecated create function FieldDescriptor(). Note: Create unlinked descriptors is going to go away. Please use get/find descriptors from generated code or query the descriptor_pool.
02-Oct-2026 13:55:30     _descriptor.FieldDescriptor(
02-Oct-2026 13:55:30
02-Oct-2026 13:55:30 ../../casa-6.7.4-9-py3.12.el8/lib/py/lib/python3.12/site-packages/casaplotms/private/plotms_pb2.py:235
02-Oct-2026 13:55:30   /home/casatest/casa-build-utils/pipeline/workdir/casa-6.7.4-9-py3.12.el8/lib/py/lib/python3.12/site-packages/casaplotms/private/plotms_pb2.py:235: DeprecationWarning: Call to deprecated create function FieldDescriptor(). Note: Create unlinked descriptors is going to go away. Please use get/find descriptors from generated code or query the descriptor_pool.
02-Oct-2026 13:55:30     _descriptor.FieldDescriptor(
02-Oct-2026 13:55:30
02-Oct-2026 13:55:30 ../../casa-6.7.4-9-py3.12.el8/lib/py/lib/python3.12/site-packages/casaplotms/private/plotms_pb2.py:242
02-Oct-2026 13:55:30   /home/casatest/casa-build-utils/pipeline/workdir/casa-6.7.4-9-py3.12.el8/lib/py/lib/python3.12/site-packages/casaplotms/private/plotms_pb2.py:242: DeprecationWarning: Call to deprecated create function FieldDescriptor(). Note: Create unlinked descriptors is going to go away. Please use get/find descriptors from generated code or query the descriptor_pool.
02-Oct-2026 13:55:30     _descriptor.FieldDescriptor(
02-Oct-2026 13:55:30
02-Oct-2026 13:55:30 ../../casa-6.7.4-9-py3.12.el8/lib/py/lib/python3.12/site-packages/casaplotms/private/plotms_pb2.py:249
02-Oct-2026 13:55:30   /home/casatest/casa-build-utils/pipeline/workdir/casa-6.7.4-9-py3.12.el8/lib/py/lib/python3.12/site-packages/casaplotms/private/plotms_pb2.py:249: DeprecationWarning: Call to deprecated create function FieldDescriptor(). Note: Create unlinked descriptors is going to go away. Please use get/find descriptors from generated code or query the descriptor_pool.
02-Oct-2026 13:55:30     _descriptor.FieldDescriptor(
02-Oct-2026 13:55:30
02-Oct-2026 13:55:30 ../../casa-6.7.4-9-py3.12.el8/lib/py/lib/python3.12/site-packages/casaplotms/private/plotms_pb2.py:256
02-Oct-2026 13:55:30   /home/casatest/casa-build-utils/pipeline/workdir/casa-6.7.4-9-py3.12.el8/lib/py/lib/python3.12/site-packages/casaplotms/private/plotms_pb2.py:256: DeprecationWarning: Call to deprecated create function FieldDescriptor(). Note: Create unlinked descriptors is going to go away. Please use get/find descriptors from generated code or query the descriptor_pool.
02-Oct-2026 13:55:30     _descriptor.FieldDescriptor(
02-Oct-2026 13:55:30
02-Oct-2026 13:55:30 ../../casa-6.7.4-9-py3.12.el8/lib/py/lib/python3.12/site-packages/casaplotms/private/plotms_pb2.py:263
02-Oct-2026 13:55:30   /home/casatest/casa-build-utils/pipeline/workdir/casa-6.7.4-9-py3.12.el8/lib/py/lib/python3.12/site-packages/casaplotms/private/plotms_pb2.py:263: DeprecationWarning: Call to deprecated create function FieldDescriptor(). Note: Create unlinked descriptors is going to go away. Please use get/find descriptors from generated code or query the descriptor_pool.
02-Oct-2026 13:55:30     _descriptor.FieldDescriptor(
02-Oct-2026 13:55:30
02-Oct-2026 13:55:30 ../../casa-6.7.4-9-py3.12.el8/lib/py/lib/python3.12/site-packages/casaplotms/private/plotms_pb2.py:270
02-Oct-2026 13:55:30   /home/casatest/casa-build-utils/pipeline/workdir/casa-6.7.4-9-py3.12.el8/lib/py/lib/python3.12/site-packages/casaplotms/private/plotms_pb2.py:270: DeprecationWarning: Call to deprecated create function FieldDescriptor(). Note: Create unlinked descriptors is going to go away. Please use get/find descriptors from generated code or query the descriptor_pool.
02-Oct-2026 13:55:30     _descriptor.FieldDescriptor(
02-Oct-2026 13:55:30
02-Oct-2026 13:55:30 ../../casa-6.7.4-9-py3.12.el8/lib/py/lib/python3.12/site-packages/casaplotms/private/plotms_pb2.py:277
02-Oct-2026 13:55:30   /home/casatest/casa-build-utils/pipeline/workdir/casa-6.7.4-9-py3.12.el8/lib/py/lib/python3.12/site-packages/casaplotms/private/plotms_pb2.py:277: DeprecationWarning: Call to deprecated create function FieldDescriptor(). Note: Create unlinked descriptors is going to go away. Please use get/find descriptors from generated code or query the descriptor_pool.
02-Oct-2026 13:55:30     _descriptor.FieldDescriptor(
02-Oct-2026 13:55:30
02-Oct-2026 13:55:30 ../../casa-6.7.4-9-py3.12.el8/lib/py/lib/python3.12/site-packages/casaplotms/private/plotms_pb2.py:284
02-Oct-2026 13:55:30   /home/casatest/casa-build-utils/pipeline/workdir/casa-6.7.4-9-py3.12.el8/lib/py/lib/python3.12/site-packages/casaplotms/private/plotms_pb2.py:284: DeprecationWarning: Call to deprecated create function FieldDescriptor(). Note: Create unlinked descriptors is going to go away. Please use get/find descriptors from generated code or query the descriptor_pool.
02-Oct-2026 13:55:30     _descriptor.FieldDescriptor(
02-Oct-2026 13:55:30
02-Oct-2026 13:55:30 ../../casa-6.7.4-9-py3.12.el8/lib/py/lib/python3.12/site-packages/casaplotms/private/plotms_pb2.py:291
02-Oct-2026 13:55:30   /home/casatest/casa-build-utils/pipeline/workdir/casa-6.7.4-9-py3.12.el8/lib/py/lib/python3.12/site-packages/casaplotms/private/plotms_pb2.py:291: DeprecationWarning: Call to deprecated create function FieldDescriptor(). Note: Create unlinked descriptors is going to go away. Please use get/find descriptors from generated code or query the descriptor_pool.
02-Oct-2026 13:55:30     _descriptor.FieldDescriptor(
02-Oct-2026 13:55:30
02-Oct-2026 13:55:30 ../../casa-6.7.4-9-py3.12.el8/lib/py/lib/python3.12/site-packages/casaplotms/private/plotms_pb2.py:207
02-Oct-2026 13:55:30   /home/casatest/casa-build-utils/pipeline/workdir/casa-6.7.4-9-py3.12.el8/lib/py/lib/python3.12/site-packages/casaplotms/private/plotms_pb2.py:207: DeprecationWarning: Call to deprecated create function Descriptor(). Note: Create unlinked descriptors is going to go away. Please use get/find descriptors from generated code or query the descriptor_pool.
02-Oct-2026 13:55:30     _SETAXES = _descriptor.Descriptor(
02-Oct-2026 13:55:30
02-Oct-2026 13:55:30 ../../casa-6.7.4-9-py3.12.el8/lib/py/lib/python3.12/site-packages/casaplotms/private/plotms_pb2.py:322
02-Oct-2026 13:55:30   /home/casatest/casa-build-utils/pipeline/workdir/casa-6.7.4-9-py3.12.el8/lib/py/lib/python3.12/site-packages/casaplotms/private/plotms_pb2.py:322: DeprecationWarning: Call to deprecated create function FieldDescriptor(). Note: Create unlinked descriptors is going to go away. Please use get/find descriptors from generated code or query the descriptor_pool.
02-Oct-2026 13:55:30     _descriptor.FieldDescriptor(
02-Oct-2026 13:55:30
02-Oct-2026 13:55:30 ../../casa-6.7.4-9-py3.12.el8/lib/py/lib/python3.12/site-packages/casaplotms/private/plotms_pb2.py:329
02-Oct-2026 13:55:30   /home/casatest/casa-build-utils/pipeline/workdir/casa-6.7.4-9-py3.12.el8/lib/py/lib/python3.12/site-packages/casaplotms/private/plotms_pb2.py:329: DeprecationWarning: Call to deprecated create function FieldDescriptor(). Note: Create unlinked descriptors is going to go away. Please use get/find descriptors from generated code or query the descriptor_pool.
02-Oct-2026 13:55:30     _descriptor.FieldDescriptor(
02-Oct-2026 13:55:30
02-Oct-2026 13:55:30 ../../casa-6.7.4-9-py3.12.el8/lib/py/lib/python3.12/site-packages/casaplotms/private/plotms_pb2.py:336
02-Oct-2026 13:55:30   /home/casatest/casa-build-utils/pipeline/workdir/casa-6.7.4-9-py3.12.el8/lib/py/lib/python3.12/site-packages/casaplotms/private/plotms_pb2.py:336: DeprecationWarning: Call to deprecated create function FieldDescriptor(). Note: Create unlinked descriptors is going to go away. Please use get/find descriptors from generated code or query the descriptor_pool.
02-Oct-2026 13:55:30     _descriptor.FieldDescriptor(
02-Oct-2026 13:55:30
02-Oct-2026 13:55:30 ../../casa-6.7.4-9-py3.12.el8/lib/py/lib/python3.12/site-packages/casaplotms/private/plotms_pb2.py:315
02-Oct-2026 13:55:30   /home/casatest/casa-build-utils/pipeline/workdir/casa-6.7.4-9-py3.12.el8/lib/py/lib/python3.12/site-packages/casaplotms/private/plotms_pb2.py:315: DeprecationWarning: Call to deprecated create function Descriptor(). Note: Create unlinked descriptors is going to go away. Please use get/find descriptors from generated code or query the descriptor_pool.
02-Oct-2026 13:55:30     _SETTOGGLE = _descriptor.Descriptor(
02-Oct-2026 13:55:30
02-Oct-2026 13:55:30 ../../casa-6.7.4-9-py3.12.el8/lib/py/lib/python3.12/site-packages/casaplotms/private/plotms_pb2.py:367
02-Oct-2026 13:55:30   /home/casatest/casa-build-utils/pipeline/workdir/casa-6.7.4-9-py3.12.el8/lib/py/lib/python3.12/site-packages/casaplotms/private/plotms_pb2.py:367: DeprecationWarning: Call to deprecated create function FieldDescriptor(). Note: Create unlinked descriptors is going to go away. Please use get/find descriptors from generated code or query the descriptor_pool.
02-Oct-2026 13:55:30     _descriptor.FieldDescriptor(
02-Oct-2026 13:55:30
02-Oct-2026 13:55:30 ../../casa-6.7.4-9-py3.12.el8/lib/py/lib/python3.12/site-packages/casaplotms/private/plotms_pb2.py:374
02-Oct-2026 13:55:30   /home/casatest/casa-build-utils/pipeline/workdir/casa-6.7.4-9-py3.12.el8/lib/py/lib/python3.12/site-packages/casaplotms/private/plotms_pb2.py:374: DeprecationWarning: Call to deprecated create function FieldDescriptor(). Note: Create unlinked descriptors is going to go away. Please use get/find descriptors from generated code or query the descriptor_pool.
02-Oct-2026 13:55:30     _descriptor.FieldDescriptor(
02-Oct-2026 13:55:30
02-Oct-2026 13:55:30 ../../casa-6.7.4-9-py3.12.el8/lib/py/lib/python3.12/site-packages/casaplotms/private/plotms_pb2.py:381
02-Oct-2026 13:55:30   /home/casatest/casa-build-utils/pipeline/workdir/casa-6.7.4-9-py3.12.el8/lib/py/lib/python3.12/site-packages/casaplotms/private/plotms_pb2.py:381: DeprecationWarning: Call to deprecated create function FieldDescriptor(). Note: Create unlinked descriptors is going to go away. Please use get/find descriptors from generated code or query the descriptor_pool.
02-Oct-2026 13:55:30     _descriptor.FieldDescriptor(
02-Oct-2026 13:55:30
02-Oct-2026 13:55:30 ../../casa-6.7.4-9-py3.12.el8/lib/py/lib/python3.12/site-packages/casaplotms/private/plotms_pb2.py:388
02-Oct-2026 13:55:30   /home/casatest/casa-build-utils/pipeline/workdir/casa-6.7.4-9-py3.12.el8/lib/py/lib/python3.12/site-packages/casaplotms/private/plotms_pb2.py:388: DeprecationWarning: Call to deprecated create function FieldDescriptor(). Note: Create unlinked descriptors is going to go away. Please use get/find descriptors from generated code or query the descriptor_pool.
02-Oct-2026 13:55:30     _descriptor.FieldDescriptor(
02-Oct-2026 13:55:30
02-Oct-2026 13:55:30 ../../casa-6.7.4-9-py3.12.el8/lib/py/lib/python3.12/site-packages/casaplotms/private/plotms_pb2.py:395
02-Oct-2026 13:55:30   /home/casatest/casa-build-utils/pipeline/workdir/casa-6.7.4-9-py3.12.el8/lib/py/lib/python3.12/site-packages/casaplotms/private/plotms_pb2.py:395: DeprecationWarning: Call to deprecated create function FieldDescriptor(). Note: Create unlinked descriptors is going to go away. Please use get/find descriptors from generated code or query the descriptor_pool.
02-Oct-2026 13:55:30     _descriptor.FieldDescriptor(
02-Oct-2026 13:55:30
02-Oct-2026 13:55:30 ../../casa-6.7.4-9-py3.12.el8/lib/py/lib/python3.12/site-packages/casaplotms/private/plotms_pb2.py:402
02-Oct-2026 13:55:30   /home/casatest/casa-build-utils/pipeline/workdir/casa-6.7.4-9-py3.12.el8/lib/py/lib/python3.12/site-packages/casaplotms/private/plotms_pb2.py:402: DeprecationWarning: Call to deprecated create function FieldDescriptor(). Note: Create unlinked descriptors is going to go away. Please use get/find descriptors from generated code or query the descriptor_pool.
02-Oct-2026 13:55:30     _descriptor.FieldDescriptor(
02-Oct-2026 13:55:30
02-Oct-2026 13:55:30 ../../casa-6.7.4-9-py3.12.el8/lib/py/lib/python3.12/site-packages/casaplotms/private/plotms_pb2.py:409
02-Oct-2026 13:55:30   /home/casatest/casa-build-utils/pipeline/workdir/casa-6.7.4-9-py3.12.el8/lib/py/lib/python3.12/site-packages/casaplotms/private/plotms_pb2.py:409: DeprecationWarning: Call to deprecated create function FieldDescriptor(). Note: Create unlinked descriptors is going to go away. Please use get/find descriptors from generated code or query the descriptor_pool.
02-Oct-2026 13:55:30     _descriptor.FieldDescriptor(
02-Oct-2026 13:55:30
02-Oct-2026 13:55:30 ../../casa-6.7.4-9-py3.12.el8/lib/py/lib/python3.12/site-packages/casaplotms/private/plotms_pb2.py:416
02-Oct-2026 13:55:30   /home/casatest/casa-build-utils/pipeline/workdir/casa-6.7.4-9-py3.12.el8/lib/py/lib/python3.12/site-packages/casaplotms/private/plotms_pb2.py:416: DeprecationWarning: Call to deprecated create function FieldDescriptor(). Note: Create unlinked descriptors is going to go away. Please use get/find descriptors from generated code or query the descriptor_pool.
02-Oct-2026 13:55:30     _descriptor.FieldDescriptor(
02-Oct-2026 13:55:30
02-Oct-2026 13:55:30 ../../casa-6.7.4-9-py3.12.el8/lib/py/lib/python3.12/site-packages/casaplotms/private/plotms_pb2.py:423
02-Oct-2026 13:55:30   /home/casatest/casa-build-utils/pipeline/workdir/casa-6.7.4-9-py3.12.el8/lib/py/lib/python3.12/site-packages/casaplotms/private/plotms_pb2.py:423: DeprecationWarning: Call to deprecated create function FieldDescriptor(). Note: Create unlinked descriptors is going to go away. Please use get/find descriptors from generated code or query the descriptor_pool.
02-Oct-2026 13:55:30     _descriptor.FieldDescriptor(
02-Oct-2026 13:55:30
02-Oct-2026 13:55:30 ../../casa-6.7.4-9-py3.12.el8/lib/py/lib/python3.12/site-packages/casaplotms/private/plotms_pb2.py:430
02-Oct-2026 13:55:30   /home/casatest/casa-build-utils/pipeline/workdir/casa-6.7.4-9-py3.12.el8/lib/py/lib/python3.12/site-packages/casaplotms/private/plotms_pb2.py:430: DeprecationWarning: Call to deprecated create function FieldDescriptor(). Note: Create unlinked descriptors is going to go away. Please use get/find descriptors from generated code or query the descriptor_pool.
02-Oct-2026 13:55:30     _descriptor.FieldDescriptor(
02-Oct-2026 13:55:30
02-Oct-2026 13:55:30 ../../casa-6.7.4-9-py3.12.el8/lib/py/lib/python3.12/site-packages/casaplotms/private/plotms_pb2.py:437
02-Oct-2026 13:55:30   /home/casatest/casa-build-utils/pipeline/workdir/casa-6.7.4-9-py3.12.el8/lib/py/lib/python3.12/site-packages/casaplotms/private/plotms_pb2.py:437: DeprecationWarning: Call to deprecated create function FieldDescriptor(). Note: Create unlinked descriptors is going to go away. Please use get/find descriptors from generated code or query the descriptor_pool.
02-Oct-2026 13:55:30     _descriptor.FieldDescriptor(
02-Oct-2026 13:55:30
02-Oct-2026 13:55:30 ../../casa-6.7.4-9-py3.12.el8/lib/py/lib/python3.12/site-packages/casaplotms/private/plotms_pb2.py:444
02-Oct-2026 13:55:30   /home/casatest/casa-build-utils/pipeline/workdir/casa-6.7.4-9-py3.12.el8/lib/py/lib/python3.12/site-packages/casaplotms/private/plotms_pb2.py:444: DeprecationWarning: Call to deprecated create function FieldDescriptor(). Note: Create unlinked descriptors is going to go away. Please use get/find descriptors from generated code or query the descriptor_pool.
02-Oct-2026 13:55:30     _descriptor.FieldDescriptor(
02-Oct-2026 13:55:30
02-Oct-2026 13:55:30 ../../casa-6.7.4-9-py3.12.el8/lib/py/lib/python3.12/site-packages/casaplotms/private/plotms_pb2.py:451
02-Oct-2026 13:55:30   /home/casatest/casa-build-utils/pipeline/workdir/casa-6.7.4-9-py3.12.el8/lib/py/lib/python3.12/site-packages/casaplotms/private/plotms_pb2.py:451: DeprecationWarning: Call to deprecated create function FieldDescriptor(). Note: Create unlinked descriptors is going to go away. Please use get/find descriptors from generated code or query the descriptor_pool.
02-Oct-2026 13:55:30     _descriptor.FieldDescriptor(
02-Oct-2026 13:55:30
02-Oct-2026 13:55:30 ../../casa-6.7.4-9-py3.12.el8/lib/py/lib/python3.12/site-packages/casaplotms/private/plotms_pb2.py:458
02-Oct-2026 13:55:30   /home/casatest/casa-build-utils/pipeline/workdir/casa-6.7.4-9-py3.12.el8/lib/py/lib/python3.12/site-packages/casaplotms/private/plotms_pb2.py:458: DeprecationWarning: Call to deprecated create function FieldDescriptor(). Note: Create unlinked descriptors is going to go away. Please use get/find descriptors from generated code or query the descriptor_pool.
02-Oct-2026 13:55:30     _descriptor.FieldDescriptor(
02-Oct-2026 13:55:30
02-Oct-2026 13:55:30 ../../casa-6.7.4-9-py3.12.el8/lib/py/lib/python3.12/site-packages/casaplotms/private/plotms_pb2.py:465
02-Oct-2026 13:55:30   /home/casatest/casa-build-utils/pipeline/workdir/casa-6.7.4-9-py3.12.el8/lib/py/lib/python3.12/site-packages/casaplotms/private/plotms_pb2.py:465: DeprecationWarning: Call to deprecated create function FieldDescriptor(). Note: Create unlinked descriptors is going to go away. Please use get/find descriptors from generated code or query the descriptor_pool.
02-Oct-2026 13:55:30     _descriptor.FieldDescriptor(
02-Oct-2026 13:55:30
02-Oct-2026 13:55:30 ../../casa-6.7.4-9-py3.12.el8/lib/py/lib/python3.12/site-packages/casaplotms/private/plotms_pb2.py:360
02-Oct-2026 13:55:30   /home/casatest/casa-build-utils/pipeline/workdir/casa-6.7.4-9-py3.12.el8/lib/py/lib/python3.12/site-packages/casaplotms/private/plotms_pb2.py:360: DeprecationWarning: Call to deprecated create function Descriptor(). Note: Create unlinked descriptors is going to go away. Please use get/find descriptors from generated code or query the descriptor_pool.
02-Oct-2026 13:55:30     _SETSELECTION = _descriptor.Descriptor(
02-Oct-2026 13:55:30
02-Oct-2026 13:55:30 ../../casa-6.7.4-9-py3.12.el8/lib/py/lib/python3.12/site-packages/casaplotms/private/plotms_pb2.py:496
02-Oct-2026 13:55:30   /home/casatest/casa-build-utils/pipeline/workdir/casa-6.7.4-9-py3.12.el8/lib/py/lib/python3.12/site-packages/casaplotms/private/plotms_pb2.py:496: DeprecationWarning: Call to deprecated create function FieldDescriptor(). Note: Create unlinked descriptors is going to go away. Please use get/find descriptors from generated code or query the descriptor_pool.
02-Oct-2026 13:55:30     _descriptor.FieldDescriptor(
02-Oct-2026 13:55:30
02-Oct-2026 13:55:30 ../../casa-6.7.4-9-py3.12.el8/lib/py/lib/python3.12/site-packages/casaplotms/private/plotms_pb2.py:503
02-Oct-2026 13:55:30   /home/casatest/casa-build-utils/pipeline/workdir/casa-6.7.4-9-py3.12.el8/lib/py/lib/python3.12/site-packages/casaplotms/private/plotms_pb2.py:503: DeprecationWarning: Call to deprecated create function FieldDescriptor(). Note: Create unlinked descriptors is going to go away. Please use get/find descriptors from generated code or query the descriptor_pool.
02-Oct-2026 13:55:30     _descriptor.FieldDescriptor(
02-Oct-2026 13:55:30
02-Oct-2026 13:55:30 ../../casa-6.7.4-9-py3.12.el8/lib/py/lib/python3.12/site-packages/casaplotms/private/plotms_pb2.py:510
02-Oct-2026 13:55:30   /home/casatest/casa-build-utils/pipeline/workdir/casa-6.7.4-9-py3.12.el8/lib/py/lib/python3.12/site-packages/casaplotms/private/plotms_pb2.py:510: DeprecationWarning: Call to deprecated create function FieldDescriptor(). Note: Create unlinked descriptors is going to go away. Please use get/find descriptors from generated code or query the descriptor_pool.
02-Oct-2026 13:55:30     _descriptor.FieldDescriptor(
02-Oct-2026 13:55:30
02-Oct-2026 13:55:30 ../../casa-6.7.4-9-py3.12.el8/lib/py/lib/python3.12/site-packages/casaplotms/private/plotms_pb2.py:517
02-Oct-2026 13:55:30   /home/casatest/casa-build-utils/pipeline/workdir/casa-6.7.4-9-py3.12.el8/lib/py/lib/python3.12/site-packages/casaplotms/private/plotms_pb2.py:517: DeprecationWarning: Call to deprecated create function FieldDescriptor(). Note: Create unlinked descriptors is going to go away. Please use get/find descriptors from generated code or query the descriptor_pool.
02-Oct-2026 13:55:30     _descriptor.FieldDescriptor(
02-Oct-2026 13:55:30
02-Oct-2026 13:55:30 ../../casa-6.7.4-9-py3.12.el8/lib/py/lib/python3.12/site-packages/casaplotms/private/plotms_pb2.py:524
02-Oct-2026 13:55:30   /home/casatest/casa-build-utils/pipeline/workdir/casa-6.7.4-9-py3.12.el8/lib/py/lib/python3.12/site-packages/casaplotms/private/plotms_pb2.py:524: DeprecationWarning: Call to deprecated create function FieldDescriptor(). Note: Create unlinked descriptors is going to go away. Please use get/find descriptors from generated code or query the descriptor_pool.
02-Oct-2026 13:55:30     _descriptor.FieldDescriptor(
02-Oct-2026 13:55:30
02-Oct-2026 13:55:30 ../../casa-6.7.4-9-py3.12.el8/lib/py/lib/python3.12/site-packages/casaplotms/private/plotms_pb2.py:531
02-Oct-2026 13:55:30   /home/casatest/casa-build-utils/pipeline/workdir/casa-6.7.4-9-py3.12.el8/lib/py/lib/python3.12/site-packages/casaplotms/private/plotms_pb2.py:531: DeprecationWarning: Call to deprecated create function FieldDescriptor(). Note: Create unlinked descriptors is going to go away. Please use get/find descriptors from generated code or query the descriptor_pool.
02-Oct-2026 13:55:30     _descriptor.FieldDescriptor(
02-Oct-2026 13:55:30
02-Oct-2026 13:55:30 ../../casa-6.7.4-9-py3.12.el8/lib/py/lib/python3.12/site-packages/casaplotms/private/plotms_pb2.py:538
02-Oct-2026 13:55:30   /home/casatest/casa-build-utils/pipeline/workdir/casa-6.7.4-9-py3.12.el8/lib/py/lib/python3.12/site-packages/casaplotms/private/plotms_pb2.py:538: DeprecationWarning: Call to deprecated create function FieldDescriptor(). Note: Create unlinked descriptors is going to go away. Please use get/find descriptors from generated code or query the descriptor_pool.
02-Oct-2026 13:55:30     _descriptor.FieldDescriptor(
02-Oct-2026 13:55:30
02-Oct-2026 13:55:30 ../../casa-6.7.4-9-py3.12.el8/lib/py/lib/python3.12/site-packages/casaplotms/private/plotms_pb2.py:545
02-Oct-2026 13:55:30   /home/casatest/casa-build-utils/pipeline/workdir/casa-6.7.4-9-py3.12.el8/lib/py/lib/python3.12/site-packages/casaplotms/private/plotms_pb2.py:545: DeprecationWarning: Call to deprecated create function FieldDescriptor(). Note: Create unlinked descriptors is going to go away. Please use get/find descriptors from generated code or query the descriptor_pool.
02-Oct-2026 13:55:30     _descriptor.FieldDescriptor(
02-Oct-2026 13:55:30
02-Oct-2026 13:55:30 ../../casa-6.7.4-9-py3.12.el8/lib/py/lib/python3.12/site-packages/casaplotms/private/plotms_pb2.py:552
02-Oct-2026 13:55:30   /home/casatest/casa-build-utils/pipeline/workdir/casa-6.7.4-9-py3.12.el8/lib/py/lib/python3.12/site-packages/casaplotms/private/plotms_pb2.py:552: DeprecationWarning: Call to deprecated create function FieldDescriptor(). Note: Create unlinked descriptors is going to go away. Please use get/find descriptors from generated code or query the descriptor_pool.
02-Oct-2026 13:55:30     _descriptor.FieldDescriptor(
02-Oct-2026 13:55:30
02-Oct-2026 13:55:30 ../../casa-6.7.4-9-py3.12.el8/lib/py/lib/python3.12/site-packages/casaplotms/private/plotms_pb2.py:559
02-Oct-2026 13:55:30   /home/casatest/casa-build-utils/pipeline/workdir/casa-6.7.4-9-py3.12.el8/lib/py/lib/python3.12/site-packages/casaplotms/private/plotms_pb2.py:559: DeprecationWarning: Call to deprecated create function FieldDescriptor(). Note: Create unlinked descriptors is going to go away. Please use get/find descriptors from generated code or query the descriptor_pool.
02-Oct-2026 13:55:30     _descriptor.FieldDescriptor(
02-Oct-2026 13:55:30
02-Oct-2026 13:55:30 ../../casa-6.7.4-9-py3.12.el8/lib/py/lib/python3.12/site-packages/casaplotms/private/plotms_pb2.py:489
02-Oct-2026 13:55:30   /home/casatest/casa-build-utils/pipeline/workdir/casa-6.7.4-9-py3.12.el8/lib/py/lib/python3.12/site-packages/casaplotms/private/plotms_pb2.py:489: DeprecationWarning: Call to deprecated create function Descriptor(). Note: Create unlinked descriptors is going to go away. Please use get/find descriptors from generated code or query the descriptor_pool.
02-Oct-2026 13:55:30     _SETAVERAGING = _descriptor.Descriptor(
02-Oct-2026 13:55:30
02-Oct-2026 13:55:30 ../../casa-6.7.4-9-py3.12.el8/lib/py/lib/python3.12/site-packages/casaplotms/private/plotms_pb2.py:590
02-Oct-2026 13:55:30   /home/casatest/casa-build-utils/pipeline/workdir/casa-6.7.4-9-py3.12.el8/lib/py/lib/python3.12/site-packages/casaplotms/private/plotms_pb2.py:590: DeprecationWarning: Call to deprecated create function FieldDescriptor(). Note: Create unlinked descriptors is going to go away. Please use get/find descriptors from generated code or query the descriptor_pool.
02-Oct-2026 13:55:30     _descriptor.FieldDescriptor(
02-Oct-2026 13:55:30
02-Oct-2026 13:55:30 ../../casa-6.7.4-9-py3.12.el8/lib/py/lib/python3.12/site-packages/casaplotms/private/plotms_pb2.py:597
02-Oct-2026 13:55:30   /home/casatest/casa-build-utils/pipeline/workdir/casa-6.7.4-9-py3.12.el8/lib/py/lib/python3.12/site-packages/casaplotms/private/plotms_pb2.py:597: DeprecationWarning: Call to deprecated create function FieldDescriptor(). Note: Create unlinked descriptors is going to go away. Please use get/find descriptors from generated code or query the descriptor_pool.
02-Oct-2026 13:55:30     _descriptor.FieldDescriptor(
02-Oct-2026 13:55:30
02-Oct-2026 13:55:30 ../../casa-6.7.4-9-py3.12.el8/lib/py/lib/python3.12/site-packages/casaplotms/private/plotms_pb2.py:604
02-Oct-2026 13:55:30   /home/casatest/casa-build-utils/pipeline/workdir/casa-6.7.4-9-py3.12.el8/lib/py/lib/python3.12/site-packages/casaplotms/private/plotms_pb2.py:604: DeprecationWarning: Call to deprecated create function FieldDescriptor(). Note: Create unlinked descriptors is going to go away. Please use get/find descriptors from generated code or query the descriptor_pool.
02-Oct-2026 13:55:30     _descriptor.FieldDescriptor(
02-Oct-2026 13:55:30
02-Oct-2026 13:55:30 ../../casa-6.7.4-9-py3.12.el8/lib/py/lib/python3.12/site-packages/casaplotms/private/plotms_pb2.py:611
02-Oct-2026 13:55:30   /home/casatest/casa-build-utils/pipeline/workdir/casa-6.7.4-9-py3.12.el8/lib/py/lib/python3.12/site-packages/casaplotms/private/plotms_pb2.py:611: DeprecationWarning: Call to deprecated create function FieldDescriptor(). Note: Create unlinked descriptors is going to go away. Please use get/find descriptors from generated code or query the descriptor_pool.
02-Oct-2026 13:55:30     _descriptor.FieldDescriptor(
02-Oct-2026 13:55:30
02-Oct-2026 13:55:30 ../../casa-6.7.4-9-py3.12.el8/lib/py/lib/python3.12/site-packages/casaplotms/private/plotms_pb2.py:618
02-Oct-2026 13:55:30   /home/casatest/casa-build-utils/pipeline/workdir/casa-6.7.4-9-py3.12.el8/lib/py/lib/python3.12/site-packages/casaplotms/private/plotms_pb2.py:618: DeprecationWarning: Call to deprecated create function FieldDescriptor(). Note: Create unlinked descriptors is going to go away. Please use get/find descriptors from generated code or query the descriptor_pool.
02-Oct-2026 13:55:30     _descriptor.FieldDescriptor(
02-Oct-2026 13:55:30
02-Oct-2026 13:55:30 ../../casa-6.7.4-9-py3.12.el8/lib/py/lib/python3.12/site-packages/casaplotms/private/plotms_pb2.py:625
02-Oct-2026 13:55:30   /home/casatest/casa-build-utils/pipeline/workdir/casa-6.7.4-9-py3.12.el8/lib/py/lib/python3.12/site-packages/casaplotms/private/plotms_pb2.py:625: DeprecationWarning: Call to deprecated create function FieldDescriptor(). Note: Create unlinked descriptors is going to go away. Please use get/find descriptors from generated code or query the descriptor_pool.
02-Oct-2026 13:55:30     _descriptor.FieldDescriptor(
02-Oct-2026 13:55:30
02-Oct-2026 13:55:30 ../../casa-6.7.4-9-py3.12.el8/lib/py/lib/python3.12/site-packages/casaplotms/private/plotms_pb2.py:583
02-Oct-2026 13:55:30   /home/casatest/casa-build-utils/pipeline/workdir/casa-6.7.4-9-py3.12.el8/lib/py/lib/python3.12/site-packages/casaplotms/private/plotms_pb2.py:583: DeprecationWarning: Call to deprecated create function Descriptor(). Note: Create unlinked descriptors is going to go away. Please use get/find descriptors from generated code or query the descriptor_pool.
02-Oct-2026 13:55:30     _SETTRANSFORM = _descriptor.Descriptor(
02-Oct-2026 13:55:30
02-Oct-2026 13:55:30 ../../casa-6.7.4-9-py3.12.el8/lib/py/lib/python3.12/site-packages/casaplotms/private/plotms_pb2.py:656
02-Oct-2026 13:55:30   /home/casatest/casa-build-utils/pipeline/workdir/casa-6.7.4-9-py3.12.el8/lib/py/lib/python3.12/site-packages/casaplotms/private/plotms_pb2.py:656: DeprecationWarning: Call to deprecated create function FieldDescriptor(). Note: Create unlinked descriptors is going to go away. Please use get/find descriptors from generated code or query the descriptor_pool.
02-Oct-2026 13:55:30     _descriptor.FieldDescriptor(
02-Oct-2026 13:55:30
02-Oct-2026 13:55:30 ../../casa-6.7.4-9-py3.12.el8/lib/py/lib/python3.12/site-packages/casaplotms/private/plotms_pb2.py:663
02-Oct-2026 13:55:30   /home/casatest/casa-build-utils/pipeline/workdir/casa-6.7.4-9-py3.12.el8/lib/py/lib/python3.12/site-packages/casaplotms/private/plotms_pb2.py:663: DeprecationWarning: Call to deprecated create function FieldDescriptor(). Note: Create unlinked descriptors is going to go away. Please use get/find descriptors from generated code or query the descriptor_pool.
02-Oct-2026 13:55:30     _descriptor.FieldDescriptor(
02-Oct-2026 13:55:30
02-Oct-2026 13:55:30 ../../casa-6.7.4-9-py3.12.el8/lib/py/lib/python3.12/site-packages/casaplotms/private/plotms_pb2.py:670
02-Oct-2026 13:55:30   /home/casatest/casa-build-utils/pipeline/workdir/casa-6.7.4-9-py3.12.el8/lib/py/lib/python3.12/site-packages/casaplotms/private/plotms_pb2.py:670: DeprecationWarning: Call to deprecated create function FieldDescriptor(). Note: Create unlinked descriptors is going to go away. Please use get/find descriptors from generated code or query the descriptor_pool.
02-Oct-2026 13:55:30     _descriptor.FieldDescriptor(
02-Oct-2026 13:55:30
02-Oct-2026 13:55:30 ../../casa-6.7.4-9-py3.12.el8/lib/py/lib/python3.12/site-packages/casaplotms/private/plotms_pb2.py:677
02-Oct-2026 13:55:30   /home/casatest/casa-build-utils/pipeline/workdir/casa-6.7.4-9-py3.12.el8/lib/py/lib/python3.12/site-packages/casaplotms/private/plotms_pb2.py:677: DeprecationWarning: Call to deprecated create function FieldDescriptor(). Note: Create unlinked descriptors is going to go away. Please use get/find descriptors from generated code or query the descriptor_pool.
02-Oct-2026 13:55:30     _descriptor.FieldDescriptor(
02-Oct-2026 13:55:30
02-Oct-2026 13:55:30 ../../casa-6.7.4-9-py3.12.el8/lib/py/lib/python3.12/site-packages/casaplotms/private/plotms_pb2.py:649
02-Oct-2026 13:55:30   /home/casatest/casa-build-utils/pipeline/workdir/casa-6.7.4-9-py3.12.el8/lib/py/lib/python3.12/site-packages/casaplotms/private/plotms_pb2.py:649: DeprecationWarning: Call to deprecated create function Descriptor(). Note: Create unlinked descriptors is going to go away. Please use get/find descriptors from generated code or query the descriptor_pool.
02-Oct-2026 13:55:30     _SETCALIBRATION = _descriptor.Descriptor(
02-Oct-2026 13:55:30
02-Oct-2026 13:55:30 ../../casa-6.7.4-9-py3.12.el8/lib/py/lib/python3.12/site-packages/casaplotms/private/plotms_pb2.py:708
02-Oct-2026 13:55:30   /home/casatest/casa-build-utils/pipeline/workdir/casa-6.7.4-9-py3.12.el8/lib/py/lib/python3.12/site-packages/casaplotms/private/plotms_pb2.py:708: DeprecationWarning: Call to deprecated create function FieldDescriptor(). Note: Create unlinked descriptors is going to go away. Please use get/find descriptors from generated code or query the descriptor_pool.
02-Oct-2026 13:55:30     _descriptor.FieldDescriptor(
02-Oct-2026 13:55:30
02-Oct-2026 13:55:30 ../../casa-6.7.4-9-py3.12.el8/lib/py/lib/python3.12/site-packages/casaplotms/private/plotms_pb2.py:715
02-Oct-2026 13:55:30   /home/casatest/casa-build-utils/pipeline/workdir/casa-6.7.4-9-py3.12.el8/lib/py/lib/python3.12/site-packages/casaplotms/private/plotms_pb2.py:715: DeprecationWarning: Call to deprecated create function FieldDescriptor(). Note: Create unlinked descriptors is going to go away. Please use get/find descriptors from generated code or query the descriptor_pool.
02-Oct-2026 13:55:30     _descriptor.FieldDescriptor(
02-Oct-2026 13:55:30
02-Oct-2026 13:55:30 ../../casa-6.7.4-9-py3.12.el8/lib/py/lib/python3.12/site-packages/casaplotms/private/plotms_pb2.py:722
02-Oct-2026 13:55:30   /home/casatest/casa-build-utils/pipeline/workdir/casa-6.7.4-9-py3.12.el8/lib/py/lib/python3.12/site-packages/casaplotms/private/plotms_pb2.py:722: DeprecationWarning: Call to deprecated create function FieldDescriptor(). Note: Create unlinked descriptors is going to go away. Please use get/find descriptors from generated code or query the descriptor_pool.
02-Oct-2026 13:55:30     _descriptor.FieldDescriptor(
02-Oct-2026 13:55:30
02-Oct-2026 13:55:30 ../../casa-6.7.4-9-py3.12.el8/lib/py/lib/python3.12/site-packages/casaplotms/private/plotms_pb2.py:729
02-Oct-2026 13:55:30   /home/casatest/casa-build-utils/pipeline/workdir/casa-6.7.4-9-py3.12.el8/lib/py/lib/python3.12/site-packages/casaplotms/private/plotms_pb2.py:729: DeprecationWarning: Call to deprecated create function FieldDescriptor(). Note: Create unlinked descriptors is going to go away. Please use get/find descriptors from generated code or query the descriptor_pool.
02-Oct-2026 13:55:30     _descriptor.FieldDescriptor(
02-Oct-2026 13:55:30
02-Oct-2026 13:55:30 ../../casa-6.7.4-9-py3.12.el8/lib/py/lib/python3.12/site-packages/casaplotms/private/plotms_pb2.py:736
02-Oct-2026 13:55:30   /home/casatest/casa-build-utils/pipeline/workdir/casa-6.7.4-9-py3.12.el8/lib/py/lib/python3.12/site-packages/casaplotms/private/plotms_pb2.py:736: DeprecationWarning: Call to deprecated create function FieldDescriptor(). Note: Create unlinked descriptors is going to go away. Please use get/find descriptors from generated code or query the descriptor_pool.
02-Oct-2026 13:55:30     _descriptor.FieldDescriptor(
02-Oct-2026 13:55:30
02-Oct-2026 13:55:30 ../../casa-6.7.4-9-py3.12.el8/lib/py/lib/python3.12/site-packages/casaplotms/private/plotms_pb2.py:743
02-Oct-2026 13:55:30   /home/casatest/casa-build-utils/pipeline/workdir/casa-6.7.4-9-py3.12.el8/lib/py/lib/python3.12/site-packages/casaplotms/private/plotms_pb2.py:743: DeprecationWarning: Call to deprecated create function FieldDescriptor(). Note: Create unlinked descriptors is going to go away. Please use get/find descriptors from generated code or query the descriptor_pool.
02-Oct-2026 13:55:30     _descriptor.FieldDescriptor(
02-Oct-2026 13:55:30
02-Oct-2026 13:55:30 ../../casa-6.7.4-9-py3.12.el8/lib/py/lib/python3.12/site-packages/casaplotms/private/plotms_pb2.py:750
02-Oct-2026 13:55:30   /home/casatest/casa-build-utils/pipeline/workdir/casa-6.7.4-9-py3.12.el8/lib/py/lib/python3.12/site-packages/casaplotms/private/plotms_pb2.py:750: DeprecationWarning: Call to deprecated create function FieldDescriptor(). Note: Create unlinked descriptors is going to go away. Please use get/find descriptors from generated code or query the descriptor_pool.
02-Oct-2026 13:55:30     _descriptor.FieldDescriptor(
02-Oct-2026 13:55:30
02-Oct-2026 13:55:30 ../../casa-6.7.4-9-py3.12.el8/lib/py/lib/python3.12/site-packages/casaplotms/private/plotms_pb2.py:757
02-Oct-2026 13:55:30   /home/casatest/casa-build-utils/pipeline/workdir/casa-6.7.4-9-py3.12.el8/lib/py/lib/python3.12/site-packages/casaplotms/private/plotms_pb2.py:757: DeprecationWarning: Call to deprecated create function FieldDescriptor(). Note: Create unlinked descriptors is going to go away. Please use get/find descriptors from generated code or query the descriptor_pool.
02-Oct-2026 13:55:30     _descriptor.FieldDescriptor(
02-Oct-2026 13:55:30
02-Oct-2026 13:55:30 ../../casa-6.7.4-9-py3.12.el8/lib/py/lib/python3.12/site-packages/casaplotms/private/plotms_pb2.py:764
02-Oct-2026 13:55:30   /home/casatest/casa-build-utils/pipeline/workdir/casa-6.7.4-9-py3.12.el8/lib/py/lib/python3.12/site-packages/casaplotms/private/plotms_pb2.py:764: DeprecationWarning: Call to deprecated create function FieldDescriptor(). Note: Create unlinked descriptors is going to go away. Please use get/find descriptors from generated code or query the descriptor_pool.
02-Oct-2026 13:55:30     _descriptor.FieldDescriptor(
02-Oct-2026 13:55:30
02-Oct-2026 13:55:30 ../../casa-6.7.4-9-py3.12.el8/lib/py/lib/python3.12/site-packages/casaplotms/private/plotms_pb2.py:771
02-Oct-2026 13:55:30   /home/casatest/casa-build-utils/pipeline/workdir/casa-6.7.4-9-py3.12.el8/lib/py/lib/python3.12/site-packages/casaplotms/private/plotms_pb2.py:771: DeprecationWarning: Call to deprecated create function FieldDescriptor(). Note: Create unlinked descriptors is going to go away. Please use get/find descriptors from generated code or query the descriptor_pool.
02-Oct-2026 13:55:30     _descriptor.FieldDescriptor(
02-Oct-2026 13:55:30
02-Oct-2026 13:55:30 ../../casa-6.7.4-9-py3.12.el8/lib/py/lib/python3.12/site-packages/casaplotms/private/plotms_pb2.py:701
02-Oct-2026 13:55:30   /home/casatest/casa-build-utils/pipeline/workdir/casa-6.7.4-9-py3.12.el8/lib/py/lib/python3.12/site-packages/casaplotms/private/plotms_pb2.py:701: DeprecationWarning: Call to deprecated create function Descriptor(). Note: Create unlinked descriptors is going to go away. Please use get/find descriptors from generated code or query the descriptor_pool.
02-Oct-2026 13:55:30     _SETFLAGEXTENSION = _descriptor.Descriptor(
02-Oct-2026 13:55:30
02-Oct-2026 13:55:30 ../../casa-6.7.4-9-py3.12.el8/lib/py/lib/python3.12/site-packages/casaplotms/private/plotms_pb2.py:802
02-Oct-2026 13:55:30   /home/casatest/casa-build-utils/pipeline/workdir/casa-6.7.4-9-py3.12.el8/lib/py/lib/python3.12/site-packages/casaplotms/private/plotms_pb2.py:802: DeprecationWarning: Call to deprecated create function FieldDescriptor(). Note: Create unlinked descriptors is going to go away. Please use get/find descriptors from generated code or query the descriptor_pool.
02-Oct-2026 13:55:30     _descriptor.FieldDescriptor(
02-Oct-2026 13:55:30
02-Oct-2026 13:55:30 ../../casa-6.7.4-9-py3.12.el8/lib/py/lib/python3.12/site-packages/casaplotms/private/plotms_pb2.py:795
02-Oct-2026 13:55:30   /home/casatest/casa-build-utils/pipeline/workdir/casa-6.7.4-9-py3.12.el8/lib/py/lib/python3.12/site-packages/casaplotms/private/plotms_pb2.py:795: DeprecationWarning: Call to deprecated create function Descriptor(). Note: Create unlinked descriptors is going to go away. Please use get/find descriptors from generated code or query the descriptor_pool.
02-Oct-2026 13:55:30     _EXPORTRANGE = _descriptor.Descriptor(
02-Oct-2026 13:55:30
02-Oct-2026 13:55:30 ../../casa-6.7.4-9-py3.12.el8/lib/py/lib/python3.12/site-packages/casaplotms/private/plotms_pb2.py:833
02-Oct-2026 13:55:30   /home/casatest/casa-build-utils/pipeline/workdir/casa-6.7.4-9-py3.12.el8/lib/py/lib/python3.12/site-packages/casaplotms/private/plotms_pb2.py:833: DeprecationWarning: Call to deprecated create function FieldDescriptor(). Note: Create unlinked descriptors is going to go away. Please use get/find descriptors from generated code or query the descriptor_pool.
02-Oct-2026 13:55:30     _descriptor.FieldDescriptor(
02-Oct-2026 13:55:30
02-Oct-2026 13:55:30 ../../casa-6.7.4-9-py3.12.el8/lib/py/lib/python3.12/site-packages/casaplotms/private/plotms_pb2.py:840
02-Oct-2026 13:55:30   /home/casatest/casa-build-utils/pipeline/workdir/casa-6.7.4-9-py3.12.el8/lib/py/lib/python3.12/site-packages/casaplotms/private/plotms_pb2.py:840: DeprecationWarning: Call to deprecated create function FieldDescriptor(). Note: Create unlinked descriptors is going to go away. Please use get/find descriptors from generated code or query the descriptor_pool.
02-Oct-2026 13:55:30     _descriptor.FieldDescriptor(
02-Oct-2026 13:55:30
02-Oct-2026 13:55:30 ../../casa-6.7.4-9-py3.12.el8/lib/py/lib/python3.12/site-packages/casaplotms/private/plotms_pb2.py:847
02-Oct-2026 13:55:30   /home/casatest/casa-build-utils/pipeline/workdir/casa-6.7.4-9-py3.12.el8/lib/py/lib/python3.12/site-packages/casaplotms/private/plotms_pb2.py:847: DeprecationWarning: Call to deprecated create function FieldDescriptor(). Note: Create unlinked descriptors is going to go away. Please use get/find descriptors from generated code or query the descriptor_pool.
02-Oct-2026 13:55:30     _descriptor.FieldDescriptor(
02-Oct-2026 13:55:30
02-Oct-2026 13:55:30 ../../casa-6.7.4-9-py3.12.el8/lib/py/lib/python3.12/site-packages/casaplotms/private/plotms_pb2.py:854
02-Oct-2026 13:55:30   /home/casatest/casa-build-utils/pipeline/workdir/casa-6.7.4-9-py3.12.el8/lib/py/lib/python3.12/site-packages/casaplotms/private/plotms_pb2.py:854: DeprecationWarning: Call to deprecated create function FieldDescriptor(). Note: Create unlinked descriptors is going to go away. Please use get/find descriptors from generated code or query the descriptor_pool.
02-Oct-2026 13:55:30     _descriptor.FieldDescriptor(
02-Oct-2026 13:55:30
02-Oct-2026 13:55:30 ../../casa-6.7.4-9-py3.12.el8/lib/py/lib/python3.12/site-packages/casaplotms/private/plotms_pb2.py:861
02-Oct-2026 13:55:30   /home/casatest/casa-build-utils/pipeline/workdir/casa-6.7.4-9-py3.12.el8/lib/py/lib/python3.12/site-packages/casaplotms/private/plotms_pb2.py:861: DeprecationWarning: Call to deprecated create function FieldDescriptor(). Note: Create unlinked descriptors is going to go away. Please use get/find descriptors from generated code or query the descriptor_pool.
02-Oct-2026 13:55:30     _descriptor.FieldDescriptor(
02-Oct-2026 13:55:30
02-Oct-2026 13:55:30 ../../casa-6.7.4-9-py3.12.el8/lib/py/lib/python3.12/site-packages/casaplotms/private/plotms_pb2.py:868
02-Oct-2026 13:55:30   /home/casatest/casa-build-utils/pipeline/workdir/casa-6.7.4-9-py3.12.el8/lib/py/lib/python3.12/site-packages/casaplotms/private/plotms_pb2.py:868: DeprecationWarning: Call to deprecated create function FieldDescriptor(). Note: Create unlinked descriptors is going to go away. Please use get/find descriptors from generated code or query the descriptor_pool.
02-Oct-2026 13:55:30     _descriptor.FieldDescriptor(
02-Oct-2026 13:55:30
02-Oct-2026 13:55:30 ../../casa-6.7.4-9-py3.12.el8/lib/py/lib/python3.12/site-packages/casaplotms/private/plotms_pb2.py:875
02-Oct-2026 13:55:30   /home/casatest/casa-build-utils/pipeline/workdir/casa-6.7.4-9-py3.12.el8/lib/py/lib/python3.12/site-packages/casaplotms/private/plotms_pb2.py:875: DeprecationWarning: Call to deprecated create function FieldDescriptor(). Note: Create unlinked descriptors is going to go away. Please use get/find descriptors from generated code or query the descriptor_pool.
02-Oct-2026 13:55:30     _descriptor.FieldDescriptor(
02-Oct-2026 13:55:30
02-Oct-2026 13:55:30 ../../casa-6.7.4-9-py3.12.el8/lib/py/lib/python3.12/site-packages/casaplotms/private/plotms_pb2.py:882
02-Oct-2026 13:55:30   /home/casatest/casa-build-utils/pipeline/workdir/casa-6.7.4-9-py3.12.el8/lib/py/lib/python3.12/site-packages/casaplotms/private/plotms_pb2.py:882: DeprecationWarning: Call to deprecated create function FieldDescriptor(). Note: Create unlinked descriptors is going to go away. Please use get/find descriptors from generated code or query the descriptor_pool.
02-Oct-2026 13:55:30     _descriptor.FieldDescriptor(
02-Oct-2026 13:55:30
02-Oct-2026 13:55:30 ../../casa-6.7.4-9-py3.12.el8/lib/py/lib/python3.12/site-packages/casaplotms/private/plotms_pb2.py:889
02-Oct-2026 13:55:30   /home/casatest/casa-build-utils/pipeline/workdir/casa-6.7.4-9-py3.12.el8/lib/py/lib/python3.12/site-packages/casaplotms/private/plotms_pb2.py:889: DeprecationWarning: Call to deprecated create function FieldDescriptor(). Note: Create unlinked descriptors is going to go away. Please use get/find descriptors from generated code or query the descriptor_pool.
02-Oct-2026 13:55:30     _descriptor.FieldDescriptor(
02-Oct-2026 13:55:30
02-Oct-2026 13:55:30 ../../casa-6.7.4-9-py3.12.el8/lib/py/lib/python3.12/site-packages/casaplotms/private/plotms_pb2.py:826
02-Oct-2026 13:55:30   /home/casatest/casa-build-utils/pipeline/workdir/casa-6.7.4-9-py3.12.el8/lib/py/lib/python3.12/site-packages/casaplotms/private/plotms_pb2.py:826: DeprecationWarning: Call to deprecated create function Descriptor(). Note: Create unlinked descriptors is going to go away. Please use get/find descriptors from generated code or query the descriptor_pool.
02-Oct-2026 13:55:30     _SETITERATE = _descriptor.Descriptor(
02-Oct-2026 13:55:30
02-Oct-2026 13:55:30 ../../casa-6.7.4-9-py3.12.el8/lib/py/lib/python3.12/site-packages/casaplotms/private/plotms_pb2.py:920
02-Oct-2026 13:55:30   /home/casatest/casa-build-utils/pipeline/workdir/casa-6.7.4-9-py3.12.el8/lib/py/lib/python3.12/site-packages/casaplotms/private/plotms_pb2.py:920: DeprecationWarning: Call to deprecated create function FieldDescriptor(). Note: Create unlinked descriptors is going to go away. Please use get/find descriptors from generated code or query the descriptor_pool.
02-Oct-2026 13:55:30     _descriptor.FieldDescriptor(
02-Oct-2026 13:55:30
02-Oct-2026 13:55:30 ../../casa-6.7.4-9-py3.12.el8/lib/py/lib/python3.12/site-packages/casaplotms/private/plotms_pb2.py:927
02-Oct-2026 13:55:30   /home/casatest/casa-build-utils/pipeline/workdir/casa-6.7.4-9-py3.12.el8/lib/py/lib/python3.12/site-packages/casaplotms/private/plotms_pb2.py:927: DeprecationWarning: Call to deprecated create function FieldDescriptor(). Note: Create unlinked descriptors is going to go away. Please use get/find descriptors from generated code or query the descriptor_pool.
02-Oct-2026 13:55:30     _descriptor.FieldDescriptor(
02-Oct-2026 13:55:30
02-Oct-2026 13:55:30 ../../casa-6.7.4-9-py3.12.el8/lib/py/lib/python3.12/site-packages/casaplotms/private/plotms_pb2.py:934
02-Oct-2026 13:55:30   /home/casatest/casa-build-utils/pipeline/workdir/casa-6.7.4-9-py3.12.el8/lib/py/lib/python3.12/site-packages/casaplotms/private/plotms_pb2.py:934: DeprecationWarning: Call to deprecated create function FieldDescriptor(). Note: Create unlinked descriptors is going to go away. Please use get/find descriptors from generated code or query the descriptor_pool.
02-Oct-2026 13:55:30     _descriptor.FieldDescriptor(
02-Oct-2026 13:55:30
02-Oct-2026 13:55:30 ../../casa-6.7.4-9-py3.12.el8/lib/py/lib/python3.12/site-packages/casaplotms/private/plotms_pb2.py:913
02-Oct-2026 13:55:30   /home/casatest/casa-build-utils/pipeline/workdir/casa-6.7.4-9-py3.12.el8/lib/py/lib/python3.12/site-packages/casaplotms/private/plotms_pb2.py:913: DeprecationWarning: Call to deprecated create function Descriptor(). Note: Create unlinked descriptors is going to go away. Please use get/find descriptors from generated code or query the descriptor_pool.
02-Oct-2026 13:55:30     _SETSTRING = _descriptor.Descriptor(
02-Oct-2026 13:55:30
02-Oct-2026 13:55:30 ../../casa-6.7.4-9-py3.12.el8/lib/py/lib/python3.12/site-packages/casaplotms/private/plotms_pb2.py:965
02-Oct-2026 13:55:30   /home/casatest/casa-build-utils/pipeline/workdir/casa-6.7.4-9-py3.12.el8/lib/py/lib/python3.12/site-packages/casaplotms/private/plotms_pb2.py:965: DeprecationWarning: Call to deprecated create function FieldDescriptor(). Note: Create unlinked descriptors is going to go away. Please use get/find descriptors from generated code or query the descriptor_pool.
02-Oct-2026 13:55:30     _descriptor.FieldDescriptor(
02-Oct-2026 13:55:30
02-Oct-2026 13:55:30 ../../casa-6.7.4-9-py3.12.el8/lib/py/lib/python3.12/site-packages/casaplotms/private/plotms_pb2.py:972
02-Oct-2026 13:55:30   /home/casatest/casa-build-utils/pipeline/workdir/casa-6.7.4-9-py3.12.el8/lib/py/lib/python3.12/site-packages/casaplotms/private/plotms_pb2.py:972: DeprecationWarning: Call to deprecated create function FieldDescriptor(). Note: Create unlinked descriptors is going to go away. Please use get/find descriptors from generated code or query the descriptor_pool.
02-Oct-2026 13:55:30     _descriptor.FieldDescriptor(
02-Oct-2026 13:55:30
02-Oct-2026 13:55:30 ../../casa-6.7.4-9-py3.12.el8/lib/py/lib/python3.12/site-packages/casaplotms/private/plotms_pb2.py:979
02-Oct-2026 13:55:30   /home/casatest/casa-build-utils/pipeline/workdir/casa-6.7.4-9-py3.12.el8/lib/py/lib/python3.12/site-packages/casaplotms/private/plotms_pb2.py:979: DeprecationWarning: Call to deprecated create function FieldDescriptor(). Note: Create unlinked descriptors is going to go away. Please use get/find descriptors from generated code or query the descriptor_pool.
02-Oct-2026 13:55:30     _descriptor.FieldDescriptor(
02-Oct-2026 13:55:30
02-Oct-2026 13:55:30 pipeline/hifa/tasks/applycal/ampphase_vs_freq_qa_test.py::test_score_all_scans
02-Oct-2026 13:55:30   /home/casatest/casa-build-utils/pipeline/workdir/casa-6.7.4-9-py3.12.el8/lib/py/lib/python3.12/site-packages/numpy/ma/core.py:498: ComplexWarning: Casting complex values to real discards the imaginary part
02-Oct-2026 13:55:30     fill_value = np.asarray(fill_value, dtype=ndtype)
02-Oct-2026 13:55:30
02-Oct-2026 13:55:30 pipeline/hifv/heuristics/standard_test.py: 21 warnings
02-Oct-2026 13:55:30 pipeline/infrastructure/utils/conversion_test.py: 4 warnings
02-Oct-2026 13:55:30   /home/casatest/casa-build-utils/pipeline/workdir/pipeline/pipeline/infrastructure/utils/conversion.py:427: DeprecationWarning: 'parseString' deprecated - use 'parse_string'
02-Oct-2026 13:55:30     return pyparsing.pyparsing_common.comma_separated_list.parseString(str(fields)).asList()
02-Oct-2026 13:55:30
02-Oct-2026 13:55:30 pipeline/infrastructure/utils/conversion_test.py::test_range_to_list[1-expected1]
02-Oct-2026 13:55:30 pipeline/infrastructure/utils/conversion_test.py::test_range_to_list[1,2-expected2]
02-Oct-2026 13:55:30 pipeline/infrastructure/utils/conversion_test.py::test_range_to_list[1~3,5,7~9-expected3]
02-Oct-2026 13:55:30   /home/casatest/casa-build-utils/pipeline/workdir/pipeline/pipeline/infrastructure/utils/conversion.py:243: DeprecationWarning: 'setParseAction' deprecated - use 'set_parse_action'
02-Oct-2026 13:55:30     number = pyparsing.Word(pyparsing.nums).setParseAction(lambda tokens: int(tokens[0]))
02-Oct-2026 13:55:30
02-Oct-2026 13:55:30 pipeline/infrastructure/utils/conversion_test.py::test_range_to_list[1-expected1]
02-Oct-2026 13:55:30 pipeline/infrastructure/utils/conversion_test.py::test_range_to_list[1,2-expected2]
02-Oct-2026 13:55:30 pipeline/infrastructure/utils/conversion_test.py::test_range_to_list[1~3,5,7~9-expected3]
02-Oct-2026 13:55:30   /home/casatest/casa-build-utils/pipeline/workdir/pipeline/pipeline/infrastructure/utils/conversion.py:247: DeprecationWarning: 'setParseAction' deprecated - use 'set_parse_action'
02-Oct-2026 13:55:30     rangeExpr.setParseAction(lambda tokens: list(range(tokens.start, tokens.end + 1)))
02-Oct-2026 13:55:30
02-Oct-2026 13:55:30 pipeline/infrastructure/utils/conversion_test.py::test_range_to_list[1-expected1]
02-Oct-2026 13:55:30 pipeline/infrastructure/utils/conversion_test.py::test_range_to_list[1,2-expected2]
02-Oct-2026 13:55:30 pipeline/infrastructure/utils/conversion_test.py::test_range_to_list[1~3,5,7~9-expected3]
02-Oct-2026 13:55:30   /home/casatest/casa-build-utils/pipeline/workdir/pipeline/pipeline/infrastructure/utils/conversion.py:257: DeprecationWarning: 'delimitedList' deprecated - use 'DelimitedList'
02-Oct-2026 13:55:30     atoms = pyparsing.delimitedList(atomExpr, delim=',')('atoms')
02-Oct-2026 13:55:30
02-Oct-2026 13:55:30 pipeline/infrastructure/utils/conversion_test.py::test_range_to_list[1-expected1]
02-Oct-2026 13:55:30 pipeline/infrastructure/utils/conversion_test.py::test_range_to_list[1,2-expected2]
02-Oct-2026 13:55:30 pipeline/infrastructure/utils/conversion_test.py::test_range_to_list[1~3,5,7~9-expected3]
02-Oct-2026 13:55:30   /home/casatest/casa-build-utils/pipeline/workdir/pipeline/pipeline/infrastructure/utils/conversion.py:259: DeprecationWarning: 'parseString' deprecated - use 'parse_string'
02-Oct-2026 13:55:30     return atoms.parseString(str(arg)).asList()
02-Oct-2026 13:55:30
02-Oct-2026 13:55:30 pipeline/infrastructure/utils/conversion_test.py: 14 warnings
02-Oct-2026 13:55:30   /home/casatest/casa-build-utils/pipeline/workdir/pipeline/pipeline/infrastructure/utils/conversion.py:666: DeprecationWarning: 'setParseAction' deprecated - use 'set_parse_action'
02-Oct-2026 13:55:30     number = pyparsing.Word(pyparsing.nums).setParseAction(lambda tokens: int(tokens[0]))
02-Oct-2026 13:55:30
02-Oct-2026 13:55:30 pipeline/infrastructure/utils/conversion_test.py: 14 warnings
02-Oct-2026 13:55:30   /home/casatest/casa-build-utils/pipeline/workdir/pipeline/pipeline/infrastructure/utils/conversion.py:670: DeprecationWarning: 'setParseAction' deprecated - use 'set_parse_action'
02-Oct-2026 13:55:30     rangeExpr.setParseAction(lambda tokens: list(range(tokens.start, tokens.end + 1)))
02-Oct-2026 13:55:30
02-Oct-2026 13:55:30 pipeline/infrastructure/utils/conversion_test.py: 14 warnings
02-Oct-2026 13:55:30   /home/casatest/casa-build-utils/pipeline/workdir/pipeline/pipeline/infrastructure/utils/conversion.py:690: DeprecationWarning: 'setParseAction' deprecated - use 'set_parse_action'
02-Oct-2026 13:55:30     antenna_name.setParseAction(get_antenna)
02-Oct-2026 13:55:30
02-Oct-2026 13:55:30 pipeline/infrastructure/utils/conversion_test.py: 14 warnings
02-Oct-2026 13:55:30   /home/casatest/casa-build-utils/pipeline/workdir/pipeline/pipeline/infrastructure/utils/conversion.py:698: DeprecationWarning: 'parseString' deprecated - use 'parse_string'
02-Oct-2026 13:55:30     for substr in pyparsing.pyparsing_common.comma_separated_list.parseString(str(task_arg)):
02-Oct-2026 13:55:30
02-Oct-2026 13:55:30 pipeline/infrastructure/utils/conversion_test.py: 19 warnings
02-Oct-2026 13:55:30   /home/casatest/casa-build-utils/pipeline/workdir/pipeline/pipeline/infrastructure/utils/conversion.py:699: DeprecationWarning: 'parseString' deprecated - use 'parse_string'
02-Oct-2026 13:55:30     atoms = atomExpr.parseString(substr)
02-Oct-2026 13:55:30
02-Oct-2026 13:55:30 pipeline/infrastructure/utils/conversion_test.py: 14 warnings
02-Oct-2026 13:55:30   /home/casatest/casa-build-utils/pipeline/workdir/pipeline/pipeline/infrastructure/utils/conversion.py:615: DeprecationWarning: 'setParseAction' deprecated - use 'set_parse_action'
02-Oct-2026 13:55:30     number = pyparsing.Word(pyparsing.nums).setParseAction(lambda tokens: int(tokens[0]))
02-Oct-2026 13:55:30
02-Oct-2026 13:55:30 pipeline/infrastructure/utils/conversion_test.py: 14 warnings
02-Oct-2026 13:55:30   /home/casatest/casa-build-utils/pipeline/workdir/pipeline/pipeline/infrastructure/utils/conversion.py:619: DeprecationWarning: 'setParseAction' deprecated - use 'set_parse_action'
02-Oct-2026 13:55:30     rangeExpr.setParseAction(lambda tokens: list(range(tokens.start, tokens.end + 1)))
02-Oct-2026 13:55:30
02-Oct-2026 13:55:30 pipeline/infrastructure/utils/conversion_test.py: 14 warnings
02-Oct-2026 13:55:31   /home/casatest/casa-build-utils/pipeline/workdir/pipeline/pipeline/infrastructure/utils/conversion.py:635: DeprecationWarning: 'setParseAction' deprecated - use 'set_parse_action'
02-Oct-2026 13:55:31     field_name.setParseAction(get_ids_for_matching)
02-Oct-2026 13:55:31
02-Oct-2026 13:55:31 pipeline/infrastructure/utils/conversion_test.py: 14 warnings
02-Oct-2026 13:55:31   /home/casatest/casa-build-utils/pipeline/workdir/pipeline/pipeline/infrastructure/utils/conversion.py:638: DeprecationWarning: 'parseString' deprecated - use 'parse_string'
02-Oct-2026 13:55:31     for atom in pyparsing.pyparsing_common.comma_separated_list.parseString(str(task_arg)):
02-Oct-2026 13:55:31
02-Oct-2026 13:55:31 pipeline/infrastructure/utils/conversion_test.py: 38 warnings
02-Oct-2026 13:55:31   /home/casatest/casa-build-utils/pipeline/workdir/pipeline/pipeline/infrastructure/utils/conversion.py:640: DeprecationWarning: 'searchString' deprecated - use 'search_string'
02-Oct-2026 13:55:31     for match in parser.searchString(atom):
02-Oct-2026 13:55:31
02-Oct-2026 13:55:31 pipeline/infrastructure/utils/conversion_test.py: 10 warnings
02-Oct-2026 13:55:31   /home/casatest/casa-build-utils/pipeline/workdir/pipeline/pipeline/infrastructure/utils/conversion.py:549: DeprecationWarning: 'setParseAction' deprecated - use 'set_parse_action'
02-Oct-2026 13:55:31     number = pyparsing.Word(pyparsing.nums).setParseAction(lambda tokens: int(tokens[0]))
02-Oct-2026 13:55:31
02-Oct-2026 13:55:31 pipeline/infrastructure/utils/conversion_test.py: 10 warnings
02-Oct-2026 13:55:31   /home/casatest/casa-build-utils/pipeline/workdir/pipeline/pipeline/infrastructure/utils/conversion.py:553: DeprecationWarning: 'setParseAction' deprecated - use 'set_parse_action'
02-Oct-2026 13:55:31     rangeExpr.setParseAction(lambda tokens: list(range(tokens.start, tokens.end + 1)))
02-Oct-2026 13:55:31
02-Oct-2026 13:55:31 pipeline/infrastructure/utils/conversion_test.py: 10 warnings
02-Oct-2026 13:55:31   /home/casatest/casa-build-utils/pipeline/workdir/pipeline/pipeline/infrastructure/utils/conversion.py:557: DeprecationWarning: 'setParseAction' deprecated - use 'set_parse_action'
02-Oct-2026 13:55:31     rangeWithStepExpr.setParseAction(lambda tokens: list(range(tokens.start, tokens.end + 1, tokens.step)))
02-Oct-2026 13:55:31
02-Oct-2026 13:55:31 pipeline/infrastructure/utils/conversion_test.py: 10 warnings
02-Oct-2026 13:55:31   /home/casatest/casa-build-utils/pipeline/workdir/pipeline/pipeline/infrastructure/utils/conversion.py:561: DeprecationWarning: 'setParseAction' deprecated - use 'set_parse_action'
02-Oct-2026 13:55:31     ltExpr.setParseAction(lambda tokens: list(range(0, tokens.max)))
02-Oct-2026 13:55:31
02-Oct-2026 13:55:31 pipeline/infrastructure/utils/conversion_test.py: 10 warnings
02-Oct-2026 13:55:31   /home/casatest/casa-build-utils/pipeline/workdir/pipeline/pipeline/infrastructure/utils/conversion.py:564: DeprecationWarning: 'setParseAction' deprecated - use 'set_parse_action'
02-Oct-2026 13:55:31     allExpr = ASTERISK.setParseAction(lambda tokens: all_spw_ids)
02-Oct-2026 13:55:31
02-Oct-2026 13:55:31 pipeline/infrastructure/utils/conversion_test.py: 10 warnings
02-Oct-2026 13:55:31   /home/casatest/casa-build-utils/pipeline/workdir/pipeline/pipeline/infrastructure/utils/conversion.py:570: DeprecationWarning: 'delimitedList' deprecated - use 'DelimitedList'
02-Oct-2026 13:55:31     channelsExpr = pyparsing.Group(pyparsing.delimitedList(numExpr, delim=';'))
02-Oct-2026 13:55:31
02-Oct-2026 13:55:31 pipeline/infrastructure/utils/conversion_test.py: 10 warnings
02-Oct-2026 13:55:31   /home/casatest/casa-build-utils/pipeline/workdir/pipeline/pipeline/infrastructure/utils/conversion.py:579: DeprecationWarning: 'delimitedList' deprecated - use 'DelimitedList'
02-Oct-2026 13:55:31     finalExpr = pyparsing.delimitedList(atomExpr('atom'), delim=',')('result')
02-Oct-2026 13:55:31
02-Oct-2026 13:55:31 pipeline/infrastructure/utils/conversion_test.py: 10 warnings
02-Oct-2026 13:55:31   /home/casatest/casa-build-utils/pipeline/workdir/pipeline/pipeline/infrastructure/utils/conversion.py:581: DeprecationWarning: 'parseString' deprecated - use 'parse_string'
02-Oct-2026 13:55:31     parse_result = finalExpr.parseString(str(task_arg))
02-Oct-2026 13:55:31
02-Oct-2026 13:55:31 -- Docs: https://docs.pytest.org/en/stable/how-to/capture-warnings.html
02-Oct-2026 13:55:31 - generated xml file: /home/casatest/casa-build-utils/pipeline/workdir/pipeline_test_result.xml -
02-Oct-2026 13:55:31 =========================== short test summary info ============================
02-Oct-2026 13:55:31 SKIPPED [2] h/tasks/common/atmutil_test.py:218: need_vis
02-Oct-2026 13:55:31 SKIPPED [3] h/tasks/common/atmutil_test.py:238: need_vis
02-Oct-2026 13:55:31 SKIPPED [2] h/tasks/common/atmutil_test.py:256: need_vis
02-Oct-2026 13:55:31 SKIPPED [1] infrastructure/daskhelpers_test.py:87: dask not installed
02-Oct-2026 13:55:31 SKIPPED [1] infrastructure/daskhelpers_test.py:153: dask not installed
02-Oct-2026 13:55:31 SKIPPED [1] infrastructure/daskhelpers_test.py:202: dask not installed
02-Oct-2026 13:55:31 SKIPPED [1] infrastructure/prefect_adapter_test.py:33: prefect not installed
02-Oct-2026 13:55:31 SKIPPED [1] recipes/recipe_converter_test.py:382: Skip testing main. Its output must be carefully examined by developer.
02-Oct-2026 13:55:31 SKIPPED [1] recipes/recipe_converter_test.py:387: Skip testing generate_all. Its output must be carefully examined by developer.
02-Oct-2026 13:55:31 FAILED infrastructure/utils/utils_test.py::test_get_taskhistory_fromimage - O...
02-Oct-2026 13:55:31 ===== 1 failed, 829 passed, 13 skipped, 388 warnings in 516.52s (0:08:36) ======
02-Oct-2026 13:55:31 1
02-Oct-2026 13:55:31 mkdir: cannot create directory 'workdir': File exists
02-Oct-2026 13:55:32 Finished task 'Test' with result: Success
02-Oct-2026 13:55:32 All conditions for task 'JUnit Parser' were met. Conditions: Variable bamboo.repository.pr.targetBranch matches pattern main
02-Oct-2026 13:55:32 Starting task 'JUnit Parser' of type 'com.atlassian.bamboo.plugins.testresultparser:task.testresultparser.junit'
02-Oct-2026 13:55:32 Parsing test results under /opt/ci_workspace/casa/bamboo/agent7/xml-data/build-dir/PIPESPECS-PPRT559-PPRT674...
02-Oct-2026 13:55:32 Failing task since 1 failing test cases were found.
02-Oct-2026 13:55:32 Finished task 'JUnit Parser' with result: Failed
02-Oct-2026 13:55:32
Substituting variable: ${bamboo.agentId} with 153550855
02-Oct-2026 13:55:32
Substituting variable: ${bamboo.agentId} with 153550855
02-Oct-2026 13:55:32
Substituting variable: ${bamboo.agentId} with 153550855
02-Oct-2026 13:55:32 Starting task 'Cleanup' of type 'com.atlassian.bamboo.plugins.scripttask:task.builder.script'
02-Oct-2026 13:55:32
Beginning to execute external process for build 'PIPESPECS - Pipeline Pull Request Test - PIPE-3073-prefect-workflow-task-adapter-and-tier0future-backend-improvement - Pipeline PR Test 6.7.4 #33 (PIPESPECS-PPRT559-PPRT674-33)'
... running command line:
/opt/ci_workspace/casa/bamboo/agent7/temp/PIPESPECS-PPRT559-PPRT674-33-ScriptBuildTask-11675699136691773010.sh
... in: /opt/ci_workspace/casa/bamboo/agent7/xml-data/build-dir/PIPESPECS-PPRT559-PPRT674
02-Oct-2026 13:55:32 Starting cleanup
02-Oct-2026 13:55:33 Removed pipelinetest-153550855
02-Oct-2026 13:55:33 Finished task 'Cleanup' with result: Success
02-Oct-2026 13:55:33 Running post build plugin 'Docker Container Cleanup'
02-Oct-2026 13:55:33
Beginning to execute external process for build 'PIPESPECS - Pipeline Pull Request Test - PIPE-3073-prefect-workflow-task-adapter-and-tier0future-backend-improvement - Pipeline PR Test 6.7.4 #33 (PIPESPECS-PPRT559-PPRT674-33)'
... running command line:
/usr/bin/docker rm -f pipelinetest-153550855
... in: /opt/ci_workspace/casa/bamboo/agent7/xml-data/build-dir/PIPESPECS-PPRT559-PPRT674
02-Oct-2026 13:55:33 Running post build plugin 'NCover Results Collector'
02-Oct-2026 13:55:33 Running post build plugin 'Build Results Label Collector'
02-Oct-2026 13:55:33 Running post build plugin 'Clover Results Collector'
02-Oct-2026 13:55:33 Running post build plugin 'npm Cache Cleanup'
02-Oct-2026 13:55:33 Running post build plugin 'Artifact Copier'
02-Oct-2026 13:55:33 Publishing an artifact: Result xml
02-Oct-2026 13:55:33 Finished publishing of artifact Non required job artifact Http Compression On : [Result xml], patterns: [pipeline_test_result.xml] anchored at: [pkgout] in 51.44 ms
02-Oct-2026 13:55:33 Finalising the build...
02-Oct-2026 13:55:33 Stopping timer.
02-Oct-2026 13:55:33 Build PIPESPECS-PPRT559-PPRT674-33 completed.
02-Oct-2026 13:02:24 Running on server: post build plugin 'Build Hanging Detection Configuration'
02-Oct-2026 13:02:24 Running on server: post build plugin 'NCover Results Collector'
02-Oct-2026 13:02:24 Running on server: post build plugin 'Build Labeller'
02-Oct-2026 13:02:24 Running on server: post build plugin 'Clover Delta Calculator'
02-Oct-2026 13:02:24 Running on server: post build plugin 'Maven Dependencies Postprocessor'
02-Oct-2026 13:02:24 All post build plugins have finished
02-Oct-2026 13:02:24 Generating build results summary...
02-Oct-2026 13:02:25 Saving build results to disk...
02-Oct-2026 13:02:25 Store variable context...
02-Oct-2026 13:02:25 Finished building PIPESPECS-PPRT559-PPRT674-33.