Build: #195 failed
Job: Build ManyLinux 2.28 Python 3.12 failed
Job result summary
- Completed
- Duration
- 1 minute
Error summary
The build generated some errors. See the full build log for more details.
# open-bitbucket.nrao.edu:7999 SSH-2.0-APACHE-SSHD-2.12.1
Warning: Permanently added the RSA host key for IP address '[192.33.115.69]:7999' to the list of known hosts.
WARNING: Running pip install with root privileges is generally not a good idea. Try `pip3 install --user` instead.
Traceback (most recent call last):
File "pipeline/infrastructure/version.py", line 30, in <module>
def get_version(cwd: str | None = None) -> tuple[str, ...]:
TypeError: unsupported operand type(s) for |: 'type' and 'NoneType'
Traceback (most recent call last):
File "packagepipeline.py", line 24, in <module>
repack.repack (args.casapkg, args.workdir, args.branch, args.elems, args.signature)
File "/casa-build-utils/pipeline/repack.py", line 70, in repack
out = subprocess.check_output([sys.executable, '-I', 'pipeline/infrastructure/version.py'], cwd=work_dir + "/pipeline").decode("utf-8").strip()
File "/usr/lib64/python3.8/subprocess.py", line 415, in check_output
return run(*popenargs, stdout=PIPE, timeout=timeout, check=True,
File "/usr/lib64/python3.8/subprocess.py", line 516, in run
raise CalledProcessError(retcode, process.args,
subprocess.CalledProcessError: Command '['/usr/bin/python3', '-I', 'pipeline/infrastructure/version.py']' returned non-zero exit status 1.
cp: cannot stat '/casa-build-utils/pipeline/workdir/casa-*pipeline*.xz': No such file or directory
Warning: Permanently added the RSA host key for IP address '[192.33.115.69]:7999' to the list of known hosts.
WARNING: Running pip install with root privileges is generally not a good idea. Try `pip3 install --user` instead.
Traceback (most recent call last):
File "pipeline/infrastructure/version.py", line 30, in <module>
def get_version(cwd: str | None = None) -> tuple[str, ...]:
TypeError: unsupported operand type(s) for |: 'type' and 'NoneType'
Traceback (most recent call last):
File "packagepipeline.py", line 24, in <module>
repack.repack (args.casapkg, args.workdir, args.branch, args.elems, args.signature)
File "/casa-build-utils/pipeline/repack.py", line 70, in repack
out = subprocess.check_output([sys.executable, '-I', 'pipeline/infrastructure/version.py'], cwd=work_dir + "/pipeline").decode("utf-8").strip()
File "/usr/lib64/python3.8/subprocess.py", line 415, in check_output
return run(*popenargs, stdout=PIPE, timeout=timeout, check=True,
File "/usr/lib64/python3.8/subprocess.py", line 516, in run
raise CalledProcessError(retcode, process.args,
subprocess.CalledProcessError: Command '['/usr/bin/python3', '-I', 'pipeline/infrastructure/version.py']' returned non-zero exit status 1.
cp: cannot stat '/casa-build-utils/pipeline/workdir/casa-*pipeline*.xz': No such file or directory