Build: #10 failed

Job: Package macOS 15 Python 3.12 ARM failed

Build log

The build generated 125,286 lines of output.   The output is too long and has been truncated to the last 1,000 lines. Download or view full build log.

29-Sep-2026 10:34:50 1
29-Sep-2026 10:34:50 stderr: error: The specified item could not be found in the keychain.
29-Sep-2026 10:34:50 1
29-Sep-2026 10:34:50 stderr: error: The specified item could not be found in the keychain.
29-Sep-2026 10:34:50 1
29-Sep-2026 10:34:50 stderr: error: The specified item could not be found in the keychain.
29-Sep-2026 10:34:50 1
29-Sep-2026 10:34:50 stderr: error: The specified item could not be found in the keychain.
29-Sep-2026 10:34:50 1
29-Sep-2026 10:34:50 stderr: error: The specified item could not be found in the keychain.
29-Sep-2026 10:34:50 1
29-Sep-2026 10:34:50 stderr: error: The specified item could not be found in the keychain.
29-Sep-2026 10:34:50 1
29-Sep-2026 10:34:50 stderr: error: The specified item could not be found in the keychain.
29-Sep-2026 10:34:50 1
29-Sep-2026 10:34:50 stderr: error: The specified item could not be found in the keychain.
29-Sep-2026 10:34:50 1
29-Sep-2026 10:34:50 stderr: error: The specified item could not be found in the keychain.
29-Sep-2026 10:34:50 1
29-Sep-2026 10:34:50 stderr: error: The specified item could not be found in the keychain.
29-Sep-2026 10:34:50 1
29-Sep-2026 10:34:50 stderr: error: The specified item could not be found in the keychain.
29-Sep-2026 10:34:50 1
29-Sep-2026 10:34:50 stderr: error: The specified item could not be found in the keychain.
29-Sep-2026 10:34:50 1
29-Sep-2026 10:34:50 stderr: error: The specified item could not be found in the keychain.
29-Sep-2026 10:34:50 1
29-Sep-2026 10:34:50 stderr: error: The specified item could not be found in the keychain.
29-Sep-2026 10:34:50 1
29-Sep-2026 10:34:50 stderr: error: The specified item could not be found in the keychain.
29-Sep-2026 10:34:50 1
29-Sep-2026 10:34:50 stderr: error: The specified item could not be found in the keychain.
29-Sep-2026 10:34:50 1
29-Sep-2026 10:34:50 stderr: error: The specified item could not be found in the keychain.
29-Sep-2026 10:34:50 1
29-Sep-2026 10:34:50 stderr: error: The specified item could not be found in the keychain.
29-Sep-2026 10:34:50 1
29-Sep-2026 10:34:50 stderr: error: The specified item could not be found in the keychain.
29-Sep-2026 10:34:50 1
29-Sep-2026 10:34:50 stderr: error: The specified item could not be found in the keychain.
29-Sep-2026 10:34:50 1
29-Sep-2026 10:34:50 stderr: error: The specified item could not be found in the keychain.
29-Sep-2026 10:34:50 1
29-Sep-2026 10:34:50 stderr: error: The specified item could not be found in the keychain.
29-Sep-2026 10:34:50 1
29-Sep-2026 10:34:50 stderr: error: The specified item could not be found in the keychain.
29-Sep-2026 10:34:50 1
29-Sep-2026 10:34:50 stderr: error: The specified item could not be found in the keychain.
29-Sep-2026 10:34:50 1
29-Sep-2026 10:34:50 stderr: error: The specified item could not be found in the keychain.
29-Sep-2026 10:34:50 1
29-Sep-2026 10:34:50 stderr: error: The specified item could not be found in the keychain.
29-Sep-2026 10:34:50 1
29-Sep-2026 10:34:50 stderr: error: The specified item could not be found in the keychain.
29-Sep-2026 10:34:50 1
29-Sep-2026 10:34:50 stderr: error: The specified item could not be found in the keychain.
29-Sep-2026 10:34:50 1
29-Sep-2026 10:34:50 stderr: error: The specified item could not be found in the keychain.
29-Sep-2026 10:34:50 1
29-Sep-2026 10:34:50 stderr: error: The specified item could not be found in the keychain.
29-Sep-2026 10:34:50 1
29-Sep-2026 10:34:50 stderr: error: The specified item could not be found in the keychain.
29-Sep-2026 10:34:50 1
29-Sep-2026 10:34:50 stderr: error: The specified item could not be found in the keychain.
29-Sep-2026 10:34:50 1
29-Sep-2026 10:34:50 stderr: error: The specified item could not be found in the keychain.
29-Sep-2026 10:34:50 1
29-Sep-2026 10:34:50 stderr: error: The specified item could not be found in the keychain.
29-Sep-2026 10:34:50 1
29-Sep-2026 10:34:51 stderr: error: The specified item could not be found in the keychain.
29-Sep-2026 10:34:51 1
29-Sep-2026 10:34:51 stderr: error: The specified item could not be found in the keychain.
29-Sep-2026 10:34:51 1
29-Sep-2026 10:34:51 stderr: error: The specified item could not be found in the keychain.
29-Sep-2026 10:34:51 1
29-Sep-2026 10:34:51 stderr: error: The specified item could not be found in the keychain.
29-Sep-2026 10:34:51 1
29-Sep-2026 10:34:51 stderr: error: The specified item could not be found in the keychain.
29-Sep-2026 10:34:51 1
29-Sep-2026 10:34:51 stderr: error: The specified item could not be found in the keychain.
29-Sep-2026 10:34:51 1
29-Sep-2026 10:34:51 stderr: error: The specified item could not be found in the keychain.
29-Sep-2026 10:34:51 1
29-Sep-2026 10:34:51 stderr: error: The specified item could not be found in the keychain.
29-Sep-2026 10:34:51 1
29-Sep-2026 10:34:51 stderr: error: The specified item could not be found in the keychain.
29-Sep-2026 10:34:51 1
29-Sep-2026 10:34:51 stderr: error: The specified item could not be found in the keychain.
29-Sep-2026 10:34:51 1
29-Sep-2026 10:34:51 stderr: error: The specified item could not be found in the keychain.
29-Sep-2026 10:34:51 1
29-Sep-2026 10:34:51 stderr: error: The specified item could not be found in the keychain.
29-Sep-2026 10:34:51 1
29-Sep-2026 10:34:51 stderr: error: The specified item could not be found in the keychain.
29-Sep-2026 10:34:51 1
29-Sep-2026 10:34:51 stderr: error: The specified item could not be found in the keychain.
29-Sep-2026 10:34:51 1
29-Sep-2026 10:34:51 stderr: error: The specified item could not be found in the keychain.
29-Sep-2026 10:34:51 1
29-Sep-2026 10:34:51 stderr: error: The specified item could not be found in the keychain.
29-Sep-2026 10:34:51 1
29-Sep-2026 10:34:51 stderr: error: The specified item could not be found in the keychain.
29-Sep-2026 10:34:51 1
29-Sep-2026 10:34:51 stderr: error: The specified item could not be found in the keychain.
29-Sep-2026 10:34:51 1
29-Sep-2026 10:34:51 stderr: error: The specified item could not be found in the keychain.
29-Sep-2026 10:34:51 1
29-Sep-2026 10:34:51 stderr: error: The specified item could not be found in the keychain.
29-Sep-2026 10:34:51 1
29-Sep-2026 10:34:51 stderr: error: The specified item could not be found in the keychain.
29-Sep-2026 10:34:51 1
29-Sep-2026 10:34:51 stderr: error: The specified item could not be found in the keychain.
29-Sep-2026 10:34:51 1
29-Sep-2026 10:34:51 stderr: error: The specified item could not be found in the keychain.
29-Sep-2026 10:34:51 1
29-Sep-2026 10:34:51 stderr: error: The specified item could not be found in the keychain.
29-Sep-2026 10:34:51 1
29-Sep-2026 10:34:51 stderr: error: The specified item could not be found in the keychain.
29-Sep-2026 10:34:51 1
29-Sep-2026 10:34:51 stderr: error: The specified item could not be found in the keychain.
29-Sep-2026 10:34:51 1
29-Sep-2026 10:34:51 stderr: error: The specified item could not be found in the keychain.
29-Sep-2026 10:34:51 1
29-Sep-2026 10:34:51 stderr: error: The specified item could not be found in the keychain.
29-Sep-2026 10:34:51 1
29-Sep-2026 10:34:51 stderr: error: The specified item could not be found in the keychain.
29-Sep-2026 10:34:51 1
29-Sep-2026 10:34:51 stderr: error: The specified item could not be found in the keychain.
29-Sep-2026 10:34:51 1
29-Sep-2026 10:34:51 stderr: error: The specified item could not be found in the keychain.
29-Sep-2026 10:34:51 1
29-Sep-2026 10:34:51 stderr: error: The specified item could not be found in the keychain.
29-Sep-2026 10:34:51 1
29-Sep-2026 10:34:51 stderr: error: The specified item could not be found in the keychain.
29-Sep-2026 10:34:51 1
29-Sep-2026 10:34:51 stderr: error: The specified item could not be found in the keychain.
29-Sep-2026 10:34:51 1
29-Sep-2026 10:34:51 stderr: error: The specified item could not be found in the keychain.
29-Sep-2026 10:34:51 1
29-Sep-2026 10:34:51 stderr: error: The specified item could not be found in the keychain.
29-Sep-2026 10:34:51 1
29-Sep-2026 10:34:51 stderr: error: The specified item could not be found in the keychain.
29-Sep-2026 10:34:51 1
29-Sep-2026 10:34:51 stderr: error: The specified item could not be found in the keychain.
29-Sep-2026 10:34:51 1
29-Sep-2026 10:34:51 stderr: error: The specified item could not be found in the keychain.
29-Sep-2026 10:34:51 1
29-Sep-2026 10:34:51 stderr: error: The specified item could not be found in the keychain.
29-Sep-2026 10:34:51 1
29-Sep-2026 10:34:51 stderr: error: The specified item could not be found in the keychain.
29-Sep-2026 10:34:51 1
29-Sep-2026 10:34:51 stderr: error: The specified item could not be found in the keychain.
29-Sep-2026 10:34:51 1
29-Sep-2026 10:34:51 stderr: error: The specified item could not be found in the keychain.
29-Sep-2026 10:34:51 1
29-Sep-2026 10:34:51 stderr: error: The specified item could not be found in the keychain.
29-Sep-2026 10:34:51 1
29-Sep-2026 10:34:51 stderr: error: The specified item could not be found in the keychain.
29-Sep-2026 10:34:51 1
29-Sep-2026 10:34:51 stderr: error: The specified item could not be found in the keychain.
29-Sep-2026 10:34:51 1
29-Sep-2026 10:34:51 stderr: error: The specified item could not be found in the keychain.
29-Sep-2026 10:34:51 1
29-Sep-2026 10:34:51 stderr: error: The specified item could not be found in the keychain.
29-Sep-2026 10:34:51 1
29-Sep-2026 10:34:51 stderr: error: The specified item could not be found in the keychain.
29-Sep-2026 10:34:51 1
29-Sep-2026 10:34:51 stderr: error: The specified item could not be found in the keychain.
29-Sep-2026 10:34:51 1
29-Sep-2026 10:34:51 stderr: error: The specified item could not be found in the keychain.
29-Sep-2026 10:34:51 1
29-Sep-2026 10:34:51 stderr: error: The specified item could not be found in the keychain.
29-Sep-2026 10:34:51 1
29-Sep-2026 10:34:51 stderr: error: The specified item could not be found in the keychain.
29-Sep-2026 10:34:51 1
29-Sep-2026 10:34:51 stderr: error: The specified item could not be found in the keychain.
29-Sep-2026 10:34:51 1
29-Sep-2026 10:34:51 stderr: error: The specified item could not be found in the keychain.
29-Sep-2026 10:34:51 1
29-Sep-2026 10:34:51 stderr: error: The specified item could not be found in the keychain.
29-Sep-2026 10:34:51 1
29-Sep-2026 10:34:51 stderr: error: The specified item could not be found in the keychain.
29-Sep-2026 10:34:51 1
29-Sep-2026 10:34:51 stderr: error: The specified item could not be found in the keychain.
29-Sep-2026 10:34:51 1
29-Sep-2026 10:34:51 stderr: error: The specified item could not be found in the keychain.
29-Sep-2026 10:34:51 1
29-Sep-2026 10:34:51 stderr: error: The specified item could not be found in the keychain.
29-Sep-2026 10:34:51 1
29-Sep-2026 10:34:51 stderr: error: The specified item could not be found in the keychain.
29-Sep-2026 10:34:51 1
29-Sep-2026 10:34:51 stderr: error: The specified item could not be found in the keychain.
29-Sep-2026 10:34:51 1
29-Sep-2026 10:34:51 stderr: error: The specified item could not be found in the keychain.
29-Sep-2026 10:34:51 1
29-Sep-2026 10:34:51 stderr: error: The specified item could not be found in the keychain.
29-Sep-2026 10:34:51 1
29-Sep-2026 10:34:51 stderr: error: The specified item could not be found in the keychain.
29-Sep-2026 10:34:51 1
29-Sep-2026 10:34:51 stderr: error: The specified item could not be found in the keychain.
29-Sep-2026 10:34:51 1
29-Sep-2026 10:34:51 stderr: error: The specified item could not be found in the keychain.
29-Sep-2026 10:34:51 1
29-Sep-2026 10:34:51 stderr: error: The specified item could not be found in the keychain.
29-Sep-2026 10:34:51 1
29-Sep-2026 10:34:51 stderr: error: The specified item could not be found in the keychain.
29-Sep-2026 10:34:51 1
29-Sep-2026 10:34:51 stderr: error: The specified item could not be found in the keychain.
29-Sep-2026 10:34:51 1
29-Sep-2026 10:34:51 stderr: error: The specified item could not be found in the keychain.
29-Sep-2026 10:34:51 1
29-Sep-2026 10:34:51 stderr: error: The specified item could not be found in the keychain.
29-Sep-2026 10:34:51 1
29-Sep-2026 10:34:51 stderr: error: The specified item could not be found in the keychain.
29-Sep-2026 10:34:51 1
29-Sep-2026 10:34:51 stderr: error: The specified item could not be found in the keychain.
29-Sep-2026 10:34:51 1
29-Sep-2026 10:34:51 stderr: error: The specified item could not be found in the keychain.
29-Sep-2026 10:34:51 1
29-Sep-2026 10:34:51 stderr: error: The specified item could not be found in the keychain.
29-Sep-2026 10:34:51 1
29-Sep-2026 10:34:51 stderr: error: The specified item could not be found in the keychain.
29-Sep-2026 10:34:51 1
29-Sep-2026 10:34:51 stderr: error: The specified item could not be found in the keychain.
29-Sep-2026 10:34:51 1
29-Sep-2026 10:34:51 stderr: error: The specified item could not be found in the keychain.
29-Sep-2026 10:34:51 1
29-Sep-2026 10:34:51 stderr: error: The specified item could not be found in the keychain.
29-Sep-2026 10:34:51 1
29-Sep-2026 10:34:51 stderr: error: The specified item could not be found in the keychain.
29-Sep-2026 10:34:51 1
29-Sep-2026 10:34:51 stderr: error: The specified item could not be found in the keychain.
29-Sep-2026 10:34:51 1
29-Sep-2026 10:34:51 stderr: error: The specified item could not be found in the keychain.
29-Sep-2026 10:34:51 1
29-Sep-2026 10:34:51 stderr: error: The specified item could not be found in the keychain.
29-Sep-2026 10:34:51 1
29-Sep-2026 10:34:51 stderr: error: The specified item could not be found in the keychain.
29-Sep-2026 10:34:51 1
29-Sep-2026 10:34:51 stderr: error: The specified item could not be found in the keychain.
29-Sep-2026 10:34:51 1
29-Sep-2026 10:34:51 stderr: error: The specified item could not be found in the keychain.
29-Sep-2026 10:34:51 1
29-Sep-2026 10:34:51 stderr: error: The specified item could not be found in the keychain.
29-Sep-2026 10:34:51 1
29-Sep-2026 10:34:51 stderr: error: The specified item could not be found in the keychain.
29-Sep-2026 10:34:51 1
29-Sep-2026 10:34:51 stderr: error: The specified item could not be found in the keychain.
29-Sep-2026 10:34:51 1
29-Sep-2026 10:34:51 stderr: error: The specified item could not be found in the keychain.
29-Sep-2026 10:34:51 1
29-Sep-2026 10:34:51 stderr: error: The specified item could not be found in the keychain.
29-Sep-2026 10:34:51 1
29-Sep-2026 10:34:51 stderr: error: The specified item could not be found in the keychain.
29-Sep-2026 10:34:51 1
29-Sep-2026 10:34:51 stderr: error: The specified item could not be found in the keychain.
29-Sep-2026 10:34:51 1
29-Sep-2026 10:34:51 stderr: error: The specified item could not be found in the keychain.
29-Sep-2026 10:34:51 1
29-Sep-2026 10:34:51 stderr: error: The specified item could not be found in the keychain.
29-Sep-2026 10:34:51 1
29-Sep-2026 10:34:51 stderr: error: The specified item could not be found in the keychain.
29-Sep-2026 10:34:51 1
29-Sep-2026 10:34:51 stderr: error: The specified item could not be found in the keychain.
29-Sep-2026 10:34:51 1
29-Sep-2026 10:34:51 stderr: error: The specified item could not be found in the keychain.
29-Sep-2026 10:34:51 1
29-Sep-2026 10:34:51 stderr: error: The specified item could not be found in the keychain.
29-Sep-2026 10:34:51 1
29-Sep-2026 10:34:51 stderr: error: The specified item could not be found in the keychain.
29-Sep-2026 10:34:51 1
29-Sep-2026 10:34:51 stderr: error: The specified item could not be found in the keychain.
29-Sep-2026 10:34:51 1
29-Sep-2026 10:34:51 stderr: error: The specified item could not be found in the keychain.
29-Sep-2026 10:34:51 1
29-Sep-2026 10:34:51 stderr: error: The specified item could not be found in the keychain.
29-Sep-2026 10:34:51 1
29-Sep-2026 10:34:51 stderr: error: The specified item could not be found in the keychain.
29-Sep-2026 10:34:51 1
29-Sep-2026 10:34:51 stderr: error: The specified item could not be found in the keychain.
29-Sep-2026 10:34:51 1
29-Sep-2026 10:34:51 stderr: error: The specified item could not be found in the keychain.
29-Sep-2026 10:34:51 1
29-Sep-2026 10:34:51 stderr: error: The specified item could not be found in the keychain.
29-Sep-2026 10:34:51 1
29-Sep-2026 10:34:51 stderr: error: The specified item could not be found in the keychain.
29-Sep-2026 10:34:51 1
29-Sep-2026 10:34:51 stderr: error: The specified item could not be found in the keychain.
29-Sep-2026 10:34:51 1
29-Sep-2026 10:34:51 stderr: error: The specified item could not be found in the keychain.
29-Sep-2026 10:34:51 1
29-Sep-2026 10:34:51 stderr: error: The specified item could not be found in the keychain.
29-Sep-2026 10:34:51 1
29-Sep-2026 10:34:51 stderr: error: The specified item could not be found in the keychain.
29-Sep-2026 10:34:51 1
29-Sep-2026 10:34:51 stderr: error: The specified item could not be found in the keychain.
29-Sep-2026 10:34:51 1
29-Sep-2026 10:34:53 stderr: error: The specified item could not be found in the keychain.
29-Sep-2026 10:34:53 1
29-Sep-2026 10:34:53 stderr: error: The specified item could not be found in the keychain.
29-Sep-2026 10:34:53 1
29-Sep-2026 10:34:53 stderr: error: The specified item could not be found in the keychain.
29-Sep-2026 10:34:53 1
29-Sep-2026 10:34:53 stderr: error: The specified item could not be found in the keychain.
29-Sep-2026 10:34:53 1
29-Sep-2026 10:34:53 stderr: error: The specified item could not be found in the keychain.
29-Sep-2026 10:34:53 1
29-Sep-2026 10:34:53 stderr: error: The specified item could not be found in the keychain.
29-Sep-2026 10:34:53 1
29-Sep-2026 10:34:53 stderr: error: The specified item could not be found in the keychain.
29-Sep-2026 10:34:53 1
29-Sep-2026 10:34:53 stderr: error: The specified item could not be found in the keychain.
29-Sep-2026 10:34:53 1
29-Sep-2026 10:34:53 stderr: error: The specified item could not be found in the keychain.
29-Sep-2026 10:34:53 1
29-Sep-2026 10:34:53 stderr: error: The specified item could not be found in the keychain.
29-Sep-2026 10:34:53 1
29-Sep-2026 10:34:53 stderr: error: The specified item could not be found in the keychain.
29-Sep-2026 10:34:53 1
29-Sep-2026 10:34:53 stderr: error: The specified item could not be found in the keychain.
29-Sep-2026 10:34:53 1
29-Sep-2026 10:34:53 stderr: error: The specified item could not be found in the keychain.
29-Sep-2026 10:34:53 1
29-Sep-2026 10:34:53 stderr: error: The specified item could not be found in the keychain.
29-Sep-2026 10:34:53 1
29-Sep-2026 10:34:53 stderr: error: The specified item could not be found in the keychain.
29-Sep-2026 10:34:53 1
29-Sep-2026 10:34:53 stderr: error: The specified item could not be found in the keychain.
29-Sep-2026 10:34:53 1
29-Sep-2026 10:34:53 stderr: error: The specified item could not be found in the keychain.
29-Sep-2026 10:34:53 1
29-Sep-2026 10:34:53 stderr: error: The specified item could not be found in the keychain.
29-Sep-2026 10:34:53 1
29-Sep-2026 10:34:53 stderr: error: The specified item could not be found in the keychain.
29-Sep-2026 10:34:53 1
29-Sep-2026 10:34:53 stderr: error: The specified item could not be found in the keychain.
29-Sep-2026 10:34:53 1
29-Sep-2026 10:34:53 stderr: error: The specified item could not be found in the keychain.
29-Sep-2026 10:34:53 1
29-Sep-2026 10:34:53 stderr: error: The specified item could not be found in the keychain.
29-Sep-2026 10:34:53 1
29-Sep-2026 10:34:53 stderr: error: The specified item could not be found in the keychain.
29-Sep-2026 10:34:53 1
29-Sep-2026 10:34:53 stderr: error: The specified item could not be found in the keychain.
29-Sep-2026 10:34:53 1
29-Sep-2026 10:34:53 stderr: error: The specified item could not be found in the keychain.
29-Sep-2026 10:34:53 1
29-Sep-2026 10:34:53 stderr: error: The specified item could not be found in the keychain.
29-Sep-2026 10:34:53 1
29-Sep-2026 10:34:53 stderr: error: The specified item could not be found in the keychain.
29-Sep-2026 10:34:53 1
29-Sep-2026 10:34:53 stderr: error: The specified item could not be found in the keychain.
29-Sep-2026 10:34:53 1
29-Sep-2026 10:34:53 stderr: error: The specified item could not be found in the keychain.
29-Sep-2026 10:34:53 1
29-Sep-2026 10:34:53 stderr: error: The specified item could not be found in the keychain.
29-Sep-2026 10:34:53 1
29-Sep-2026 10:34:53 stderr: error: The specified item could not be found in the keychain.
29-Sep-2026 10:34:53 1
29-Sep-2026 10:34:53 stderr: error: The specified item could not be found in the keychain.
29-Sep-2026 10:34:53 1
29-Sep-2026 10:34:53 stderr: error: The specified item could not be found in the keychain.
29-Sep-2026 10:34:53 1
29-Sep-2026 10:34:53 stderr: error: The specified item could not be found in the keychain.
29-Sep-2026 10:34:53 1
29-Sep-2026 10:34:53 stderr: error: The specified item could not be found in the keychain.
29-Sep-2026 10:34:53 1
29-Sep-2026 10:34:53 stderr: error: The specified item could not be found in the keychain.
29-Sep-2026 10:34:53 1
29-Sep-2026 10:34:53 stderr: error: The specified item could not be found in the keychain.
29-Sep-2026 10:34:53 1
29-Sep-2026 10:34:53 stderr: error: The specified item could not be found in the keychain.
29-Sep-2026 10:34:53 1
29-Sep-2026 10:34:53 stderr: error: The specified item could not be found in the keychain.
29-Sep-2026 10:34:53 1
29-Sep-2026 10:34:53 stderr: error: The specified item could not be found in the keychain.
29-Sep-2026 10:34:53 1
29-Sep-2026 10:34:53 stderr: error: The specified item could not be found in the keychain.
29-Sep-2026 10:34:53 1
29-Sep-2026 10:34:53 stderr: error: The specified item could not be found in the keychain.
29-Sep-2026 10:34:53 1
29-Sep-2026 10:34:53 stderr: error: The specified item could not be found in the keychain.
29-Sep-2026 10:34:53 1
29-Sep-2026 10:34:53 stderr: error: The specified item could not be found in the keychain.
29-Sep-2026 10:34:53 1
29-Sep-2026 10:34:53 stderr: error: The specified item could not be found in the keychain.
29-Sep-2026 10:34:53 1
29-Sep-2026 10:34:53 stderr: error: The specified item could not be found in the keychain.
29-Sep-2026 10:34:53 1
29-Sep-2026 10:34:53 stderr: error: The specified item could not be found in the keychain.
29-Sep-2026 10:34:53 1
29-Sep-2026 10:34:53 stderr: error: The specified item could not be found in the keychain.
29-Sep-2026 10:34:53 1
29-Sep-2026 10:34:53 stderr: error: The specified item could not be found in the keychain.
29-Sep-2026 10:34:53 1
29-Sep-2026 10:34:53 stderr: error: The specified item could not be found in the keychain.
29-Sep-2026 10:34:53 1
29-Sep-2026 10:34:53 stderr: error: The specified item could not be found in the keychain.
29-Sep-2026 10:34:53 1
29-Sep-2026 10:34:53 stderr: error: The specified item could not be found in the keychain.
29-Sep-2026 10:34:53 1
29-Sep-2026 10:34:53 stderr: error: The specified item could not be found in the keychain.
29-Sep-2026 10:34:53 1
29-Sep-2026 10:34:53 stderr: error: The specified item could not be found in the keychain.
29-Sep-2026 10:34:53 1
29-Sep-2026 10:34:53 stderr: error: The specified item could not be found in the keychain.
29-Sep-2026 10:34:53 1
29-Sep-2026 10:34:53 stderr: error: The specified item could not be found in the keychain.
29-Sep-2026 10:34:53 1
29-Sep-2026 10:34:53 stderr: error: The specified item could not be found in the keychain.
29-Sep-2026 10:34:53 1
29-Sep-2026 10:34:53 stderr: error: The specified item could not be found in the keychain.
29-Sep-2026 10:34:53 1
29-Sep-2026 10:34:53 stderr: error: The specified item could not be found in the keychain.
29-Sep-2026 10:34:53 1
29-Sep-2026 10:34:53 stderr: error: The specified item could not be found in the keychain.
29-Sep-2026 10:34:53 1
29-Sep-2026 10:34:53 stderr: error: The specified item could not be found in the keychain.
29-Sep-2026 10:34:53 1
29-Sep-2026 10:34:53 stderr: error: The specified item could not be found in the keychain.
29-Sep-2026 10:34:53 1
29-Sep-2026 10:34:53 stderr: error: The specified item could not be found in the keychain.
29-Sep-2026 10:34:53 1
29-Sep-2026 10:34:53 stderr: error: The specified item could not be found in the keychain.
29-Sep-2026 10:34:53 1
29-Sep-2026 10:34:53 stderr: error: The specified item could not be found in the keychain.
29-Sep-2026 10:34:53 1
29-Sep-2026 10:34:53 stderr: error: The specified item could not be found in the keychain.
29-Sep-2026 10:34:53 1
29-Sep-2026 10:34:53 stderr: error: The specified item could not be found in the keychain.
29-Sep-2026 10:34:53 1
29-Sep-2026 10:34:53 stderr: error: The specified item could not be found in the keychain.
29-Sep-2026 10:34:53 1
29-Sep-2026 10:34:53 stderr: error: The specified item could not be found in the keychain.
29-Sep-2026 10:34:53 1
29-Sep-2026 10:34:53 stderr: error: The specified item could not be found in the keychain.
29-Sep-2026 10:34:53 1
29-Sep-2026 10:34:53 stderr: error: The specified item could not be found in the keychain.
29-Sep-2026 10:34:53 1
29-Sep-2026 10:34:53 stderr: error: The specified item could not be found in the keychain.
29-Sep-2026 10:34:53 1
29-Sep-2026 10:34:53 stderr: error: The specified item could not be found in the keychain.
29-Sep-2026 10:34:53 1
29-Sep-2026 10:34:53 stderr: error: The specified item could not be found in the keychain.
29-Sep-2026 10:34:53 1
29-Sep-2026 10:34:53 stderr: error: The specified item could not be found in the keychain.
29-Sep-2026 10:34:53 1
29-Sep-2026 10:34:53 stderr: error: The specified item could not be found in the keychain.
29-Sep-2026 10:34:53 1
29-Sep-2026 10:34:53 stderr: error: The specified item could not be found in the keychain.
29-Sep-2026 10:34:53 1
29-Sep-2026 10:34:53 stderr: error: The specified item could not be found in the keychain.
29-Sep-2026 10:34:53 1
29-Sep-2026 10:34:53 stderr: error: The specified item could not be found in the keychain.
29-Sep-2026 10:34:53 1
29-Sep-2026 10:34:53 stderr: error: The specified item could not be found in the keychain.
29-Sep-2026 10:34:53 1
29-Sep-2026 10:34:53 stderr: error: The specified item could not be found in the keychain.
29-Sep-2026 10:34:53 1
29-Sep-2026 10:34:53 stderr: error: The specified item could not be found in the keychain.
29-Sep-2026 10:34:53 1
29-Sep-2026 10:34:53 stderr: error: The specified item could not be found in the keychain.
29-Sep-2026 10:34:53 1
29-Sep-2026 10:34:53 stderr: error: The specified item could not be found in the keychain.
29-Sep-2026 10:34:53 1
29-Sep-2026 10:34:53 stderr: error: The specified item could not be found in the keychain.
29-Sep-2026 10:34:53 1
29-Sep-2026 10:34:53 stderr: error: The specified item could not be found in the keychain.
29-Sep-2026 10:34:53 1
29-Sep-2026 10:34:53 stderr: error: The specified item could not be found in the keychain.
29-Sep-2026 10:34:53 1
29-Sep-2026 10:34:53 stderr: error: The specified item could not be found in the keychain.
29-Sep-2026 10:34:53 1
29-Sep-2026 10:34:53 stderr: error: The specified item could not be found in the keychain.
29-Sep-2026 10:34:53 1
29-Sep-2026 10:34:53 stderr: error: The specified item could not be found in the keychain.
29-Sep-2026 10:34:53 1
29-Sep-2026 10:34:53 stderr: error: The specified item could not be found in the keychain.
29-Sep-2026 10:34:53 1
29-Sep-2026 10:34:53 stderr: error: The specified item could not be found in the keychain.
29-Sep-2026 10:34:53 1
29-Sep-2026 10:34:53 stderr: error: The specified item could not be found in the keychain.
29-Sep-2026 10:34:53 1
29-Sep-2026 10:34:53 stderr: error: The specified item could not be found in the keychain.
29-Sep-2026 10:34:53 1
29-Sep-2026 10:34:53 stderr: error: The specified item could not be found in the keychain.
29-Sep-2026 10:34:53 1
29-Sep-2026 10:34:53 stderr: error: The specified item could not be found in the keychain.
29-Sep-2026 10:34:53 1
29-Sep-2026 10:34:53 stderr: error: The specified item could not be found in the keychain.
29-Sep-2026 10:34:53 1
29-Sep-2026 10:34:53 stderr: error: The specified item could not be found in the keychain.
29-Sep-2026 10:34:53 1
29-Sep-2026 10:34:53 stderr: error: The specified item could not be found in the keychain.
29-Sep-2026 10:34:53 1
29-Sep-2026 10:34:53 stderr: error: The specified item could not be found in the keychain.
29-Sep-2026 10:34:53 1
29-Sep-2026 10:34:53 stderr: error: The specified item could not be found in the keychain.
29-Sep-2026 10:34:53 1
29-Sep-2026 10:34:53 stderr: error: The specified item could not be found in the keychain.
29-Sep-2026 10:34:53 1
29-Sep-2026 10:34:53 stderr: error: The specified item could not be found in the keychain.
29-Sep-2026 10:34:53 1
29-Sep-2026 10:34:53 stderr: error: The specified item could not be found in the keychain.
29-Sep-2026 10:34:53 1
29-Sep-2026 10:34:53 stderr: error: The specified item could not be found in the keychain.
29-Sep-2026 10:34:53 1
29-Sep-2026 10:34:53 stderr: error: The specified item could not be found in the keychain.
29-Sep-2026 10:34:53 1
29-Sep-2026 10:34:53 stderr: error: The specified item could not be found in the keychain.
29-Sep-2026 10:34:53 1
29-Sep-2026 10:34:53 stderr: error: The specified item could not be found in the keychain.
29-Sep-2026 10:34:53 1
29-Sep-2026 10:34:53 stderr: error: The specified item could not be found in the keychain.
29-Sep-2026 10:34:53 1
29-Sep-2026 10:34:53 stderr: error: The specified item could not be found in the keychain.
29-Sep-2026 10:34:53 1
29-Sep-2026 10:34:53 stderr: error: The specified item could not be found in the keychain.
29-Sep-2026 10:34:53 1
29-Sep-2026 10:34:53 stderr: error: The specified item could not be found in the keychain.
29-Sep-2026 10:34:53 1
29-Sep-2026 10:34:53 stderr: error: The specified item could not be found in the keychain.
29-Sep-2026 10:34:53 1
29-Sep-2026 10:34:53 stderr: error: The specified item could not be found in the keychain.
29-Sep-2026 10:34:53 1
29-Sep-2026 10:36:25 stderr: error: The specified item could not be found in the keychain.
29-Sep-2026 10:36:25 1
29-Sep-2026 10:36:25 stderr: error: The specified item could not be found in the keychain.
29-Sep-2026 10:36:25 1
29-Sep-2026 10:36:25 stderr: error: The specified item could not be found in the keychain.
29-Sep-2026 10:36:25 1
29-Sep-2026 10:36:25 stderr: error: The specified item could not be found in the keychain.
29-Sep-2026 10:36:25 1
29-Sep-2026 10:36:25 stderr: error: The specified item could not be found in the keychain.
29-Sep-2026 10:36:25 1
29-Sep-2026 10:36:25 stderr: error: The specified item could not be found in the keychain.
29-Sep-2026 10:36:25 1
29-Sep-2026 10:36:25 stderr: error: The specified item could not be found in the keychain.
29-Sep-2026 10:36:25 1
29-Sep-2026 10:36:25 stderr: error: The specified item could not be found in the keychain.
29-Sep-2026 10:36:25 1
29-Sep-2026 10:36:25 stderr: error: The specified item could not be found in the keychain.
29-Sep-2026 10:36:25 1
29-Sep-2026 10:36:25 stderr: error: The specified item could not be found in the keychain.
29-Sep-2026 10:36:25 1
29-Sep-2026 10:36:25 stderr: error: The specified item could not be found in the keychain.
29-Sep-2026 10:36:25 1
29-Sep-2026 10:36:25 stderr: error: The specified item could not be found in the keychain.
29-Sep-2026 10:36:25 1
29-Sep-2026 10:36:25 stderr: error: The specified item could not be found in the keychain.
29-Sep-2026 10:36:25 1
29-Sep-2026 10:36:25 stderr: error: The specified item could not be found in the keychain.
29-Sep-2026 10:36:25 1
29-Sep-2026 10:36:25 stderr: error: The specified item could not be found in the keychain.
29-Sep-2026 10:36:25 1
29-Sep-2026 10:36:25 stderr: error: The specified item could not be found in the keychain.
29-Sep-2026 10:36:25 1
29-Sep-2026 10:36:25 stderr: error: The specified item could not be found in the keychain.
29-Sep-2026 10:36:25 1
29-Sep-2026 10:36:25 stderr: error: The specified item could not be found in the keychain.
29-Sep-2026 10:36:25 1
29-Sep-2026 10:36:25 stderr: error: The specified item could not be found in the keychain.
29-Sep-2026 10:36:25 1
29-Sep-2026 10:36:25 stderr: error: The specified item could not be found in the keychain.
29-Sep-2026 10:36:25 1
29-Sep-2026 10:36:25 stderr: error: The specified item could not be found in the keychain.
29-Sep-2026 10:36:25 1
29-Sep-2026 10:36:25 stderr: error: The specified item could not be found in the keychain.
29-Sep-2026 10:36:25 1
29-Sep-2026 10:36:25 stderr: error: The specified item could not be found in the keychain.
29-Sep-2026 10:36:25 1
29-Sep-2026 10:36:25 stderr: error: The specified item could not be found in the keychain.
29-Sep-2026 10:36:25 1
29-Sep-2026 10:36:25 stderr: error: The specified item could not be found in the keychain.
29-Sep-2026 10:36:25 1
29-Sep-2026 10:36:25 stderr: error: The specified item could not be found in the keychain.
29-Sep-2026 10:36:25 1
29-Sep-2026 10:36:25 stderr: error: The specified item could not be found in the keychain.
29-Sep-2026 10:36:25 1
29-Sep-2026 10:36:25 stderr: error: The specified item could not be found in the keychain.
29-Sep-2026 10:36:25 1
29-Sep-2026 10:36:25 stderr: error: The specified item could not be found in the keychain.
29-Sep-2026 10:36:25 1
29-Sep-2026 10:36:25 stderr: error: The specified item could not be found in the keychain.
29-Sep-2026 10:36:25 1
29-Sep-2026 10:36:25 stderr: error: The specified item could not be found in the keychain.
29-Sep-2026 10:36:25 1
29-Sep-2026 10:36:25 stderr: error: The specified item could not be found in the keychain.
29-Sep-2026 10:36:25 1
29-Sep-2026 10:36:25 stderr: error: The specified item could not be found in the keychain.
29-Sep-2026 10:36:25 1
29-Sep-2026 10:36:25 stderr: error: The specified item could not be found in the keychain.
29-Sep-2026 10:36:25 1
29-Sep-2026 10:36:25 stderr: error: The specified item could not be found in the keychain.
29-Sep-2026 10:36:25 1
29-Sep-2026 10:36:25 stderr: error: The specified item could not be found in the keychain.
29-Sep-2026 10:36:25 1
29-Sep-2026 10:36:25 stderr: error: The specified item could not be found in the keychain.
29-Sep-2026 10:36:25 1
29-Sep-2026 10:36:25 stderr: error: The specified item could not be found in the keychain.
29-Sep-2026 10:36:25 1
29-Sep-2026 10:36:25 stderr: error: The specified item could not be found in the keychain.
29-Sep-2026 10:36:25 1
29-Sep-2026 10:36:25 stderr: error: The specified item could not be found in the keychain.
29-Sep-2026 10:36:25 1
29-Sep-2026 10:36:25 stderr: error: The specified item could not be found in the keychain.
29-Sep-2026 10:36:25 1
29-Sep-2026 10:36:25 stderr: error: The specified item could not be found in the keychain.
29-Sep-2026 10:36:25 1
29-Sep-2026 10:36:25 stderr: error: The specified item could not be found in the keychain.
29-Sep-2026 10:36:25 1
29-Sep-2026 10:36:25 stderr: error: The specified item could not be found in the keychain.
29-Sep-2026 10:36:25 1
29-Sep-2026 10:36:25 stderr: error: The specified item could not be found in the keychain.
29-Sep-2026 10:36:25 1
29-Sep-2026 10:36:25 stderr: error: The specified item could not be found in the keychain.
29-Sep-2026 10:36:25 1
29-Sep-2026 10:36:25 stderr: error: The specified item could not be found in the keychain.
29-Sep-2026 10:36:25 1
29-Sep-2026 10:36:25 stderr: error: The specified item could not be found in the keychain.
29-Sep-2026 10:36:25 1
29-Sep-2026 10:36:25 stderr: error: The specified item could not be found in the keychain.
29-Sep-2026 10:36:25 1
29-Sep-2026 10:36:25 stderr: error: The specified item could not be found in the keychain.
29-Sep-2026 10:36:25 1
29-Sep-2026 10:36:25 stderr: error: The specified item could not be found in the keychain.
29-Sep-2026 10:36:25 1
29-Sep-2026 10:36:25 stderr: error: The specified item could not be found in the keychain.
29-Sep-2026 10:36:25 1
29-Sep-2026 10:36:25 stderr: error: The specified item could not be found in the keychain.
29-Sep-2026 10:36:25 1
29-Sep-2026 10:36:25 stderr: error: The specified item could not be found in the keychain.
29-Sep-2026 10:36:25 1
29-Sep-2026 10:36:25 stderr: error: The specified item could not be found in the keychain.
29-Sep-2026 10:36:25 1
29-Sep-2026 10:36:25 stderr: error: The specified item could not be found in the keychain.
29-Sep-2026 10:36:25 1
29-Sep-2026 10:36:25 stderr: error: The specified item could not be found in the keychain.
29-Sep-2026 10:36:25 1
29-Sep-2026 10:36:25 stderr: error: The specified item could not be found in the keychain.
29-Sep-2026 10:36:25 1
29-Sep-2026 10:36:25 stderr: error: The specified item could not be found in the keychain.
29-Sep-2026 10:36:25 1
29-Sep-2026 10:36:25 stderr: error: The specified item could not be found in the keychain.
29-Sep-2026 10:36:25 1
29-Sep-2026 10:36:25 stderr: error: The specified item could not be found in the keychain.
29-Sep-2026 10:36:25 1
29-Sep-2026 10:36:25 stderr: error: The specified item could not be found in the keychain.
29-Sep-2026 10:36:25 1
29-Sep-2026 10:36:25 stderr: error: The specified item could not be found in the keychain.
29-Sep-2026 10:36:25 1
29-Sep-2026 10:36:25 stderr: error: The specified item could not be found in the keychain.
29-Sep-2026 10:36:25 1
29-Sep-2026 10:36:25 stderr: error: The specified item could not be found in the keychain.
29-Sep-2026 10:36:25 1
29-Sep-2026 10:36:25 stderr: error: The specified item could not be found in the keychain.
29-Sep-2026 10:36:25 1
29-Sep-2026 10:36:25 stderr: error: The specified item could not be found in the keychain.
29-Sep-2026 10:36:25 1
29-Sep-2026 10:36:25 stderr: error: The specified item could not be found in the keychain.
29-Sep-2026 10:36:25 1
29-Sep-2026 10:36:25 stderr: error: The specified item could not be found in the keychain.
29-Sep-2026 10:36:25 1
29-Sep-2026 10:36:25 stderr: error: The specified item could not be found in the keychain.
29-Sep-2026 10:36:25 1
29-Sep-2026 10:36:25 stderr: error: The specified item could not be found in the keychain.
29-Sep-2026 10:36:25 1
29-Sep-2026 10:36:25 stderr: error: The specified item could not be found in the keychain.
29-Sep-2026 10:36:25 1
29-Sep-2026 10:36:25 stderr: error: The specified item could not be found in the keychain.
29-Sep-2026 10:36:25 1
29-Sep-2026 10:36:25 stderr: error: The specified item could not be found in the keychain.
29-Sep-2026 10:36:25 1
29-Sep-2026 10:36:25 stderr: error: The specified item could not be found in the keychain.
29-Sep-2026 10:36:25 1
29-Sep-2026 10:36:25 stderr: error: The specified item could not be found in the keychain.
29-Sep-2026 10:36:25 1
29-Sep-2026 10:36:25 stderr: error: The specified item could not be found in the keychain.
29-Sep-2026 10:36:25 1
29-Sep-2026 10:36:25 stderr: error: The specified item could not be found in the keychain.
29-Sep-2026 10:36:25 1
29-Sep-2026 10:36:25 stderr: error: The specified item could not be found in the keychain.
29-Sep-2026 10:36:25 1
29-Sep-2026 10:36:25 stderr: error: The specified item could not be found in the keychain.
29-Sep-2026 10:36:25 1
29-Sep-2026 10:36:25 stderr: error: The specified item could not be found in the keychain.
29-Sep-2026 10:36:25 1
29-Sep-2026 10:36:25 stderr: error: The specified item could not be found in the keychain.
29-Sep-2026 10:36:25 1
29-Sep-2026 10:36:25 stderr: error: The specified item could not be found in the keychain.
29-Sep-2026 10:36:25 1
29-Sep-2026 10:36:25 stderr: error: The specified item could not be found in the keychain.
29-Sep-2026 10:36:25 1
29-Sep-2026 10:36:25 stderr: error: The specified item could not be found in the keychain.
29-Sep-2026 10:36:25 1
29-Sep-2026 10:36:25 stderr: error: The specified item could not be found in the keychain.
29-Sep-2026 10:36:25 1
29-Sep-2026 10:36:25 stderr: error: The specified item could not be found in the keychain.
29-Sep-2026 10:36:25 1
29-Sep-2026 10:36:25 stderr: error: The specified item could not be found in the keychain.
29-Sep-2026 10:36:25 1
29-Sep-2026 10:36:25 stderr: error: The specified item could not be found in the keychain.
29-Sep-2026 10:36:25 1
29-Sep-2026 10:36:25 stderr: error: The specified item could not be found in the keychain.
29-Sep-2026 10:36:25 1
29-Sep-2026 10:36:25 stderr: error: The specified item could not be found in the keychain.
29-Sep-2026 10:36:25 1
29-Sep-2026 10:36:25 stderr: error: The specified item could not be found in the keychain.
29-Sep-2026 10:36:25 1
29-Sep-2026 10:36:25 stderr: error: The specified item could not be found in the keychain.
29-Sep-2026 10:36:25 1
29-Sep-2026 10:36:25 stderr: error: The specified item could not be found in the keychain.
29-Sep-2026 10:36:25 1
29-Sep-2026 10:36:25 stderr: error: The specified item could not be found in the keychain.
29-Sep-2026 10:36:25 1
29-Sep-2026 10:36:25 stderr: error: The specified item could not be found in the keychain.
29-Sep-2026 10:36:25 1
29-Sep-2026 10:36:25 stderr: error: The specified item could not be found in the keychain.
29-Sep-2026 10:36:25 1
29-Sep-2026 10:36:25 stderr: error: The specified item could not be found in the keychain.
29-Sep-2026 10:36:25 1
29-Sep-2026 10:36:25 stderr: error: The specified item could not be found in the keychain.
29-Sep-2026 10:36:25 1
29-Sep-2026 10:36:25 stderr: error: The specified item could not be found in the keychain.
29-Sep-2026 10:36:25 1
29-Sep-2026 10:36:25 stderr: error: The specified item could not be found in the keychain.
29-Sep-2026 10:36:25 1
29-Sep-2026 10:36:25 stderr: error: The specified item could not be found in the keychain.
29-Sep-2026 10:36:25 1
29-Sep-2026 10:36:25 stderr: error: The specified item could not be found in the keychain.
29-Sep-2026 10:36:25 1
29-Sep-2026 10:36:25 stderr: error: The specified item could not be found in the keychain.
29-Sep-2026 10:36:25 1
29-Sep-2026 10:36:25 stderr: error: The specified item could not be found in the keychain.
29-Sep-2026 10:36:25 1
29-Sep-2026 10:36:25 stderr: error: The specified item could not be found in the keychain.
29-Sep-2026 10:36:25 1
29-Sep-2026 10:36:25 stderr: error: The specified item could not be found in the keychain.
29-Sep-2026 10:36:25 1
29-Sep-2026 10:36:25 stderr: error: The specified item could not be found in the keychain.
29-Sep-2026 10:36:25 1
29-Sep-2026 10:36:25 stderr: error: The specified item could not be found in the keychain.
29-Sep-2026 10:36:25 1
29-Sep-2026 10:36:25 stderr: error: The specified item could not be found in the keychain.
29-Sep-2026 10:36:25 1
29-Sep-2026 10:36:25 stderr: error: The specified item could not be found in the keychain.
29-Sep-2026 10:36:25 1
29-Sep-2026 10:36:25 stderr: error: The specified item could not be found in the keychain.
29-Sep-2026 10:36:25 1
29-Sep-2026 10:36:25 stderr: error: The specified item could not be found in the keychain.
29-Sep-2026 10:36:25 1
29-Sep-2026 10:36:25 stderr: error: The specified item could not be found in the keychain.
29-Sep-2026 10:36:25 1
29-Sep-2026 10:45:39 stderr: error: The specified item could not be found in the keychain.
29-Sep-2026 10:45:39 1
29-Sep-2026 10:45:39 stderr: error: The specified item could not be found in the keychain.
29-Sep-2026 10:45:39 1
29-Sep-2026 10:45:39 stderr: error: The specified item could not be found in the keychain.
29-Sep-2026 10:45:39 1
29-Sep-2026 10:45:39 stderr: error: The specified item could not be found in the keychain.
29-Sep-2026 10:45:39 1
29-Sep-2026 10:45:39 stderr: error: The specified item could not be found in the keychain.
29-Sep-2026 10:45:39 1
29-Sep-2026 10:45:39 stderr: error: The specified item could not be found in the keychain.
29-Sep-2026 10:45:39 1
29-Sep-2026 10:45:39 stderr: error: The specified item could not be found in the keychain.
29-Sep-2026 10:45:39 1
29-Sep-2026 10:45:39 stderr: error: The specified item could not be found in the keychain.
29-Sep-2026 10:45:39 1
29-Sep-2026 10:45:39 stderr: error: The specified item could not be found in the keychain.
29-Sep-2026 10:45:39 1
29-Sep-2026 10:45:39 stderr: error: The specified item could not be found in the keychain.
29-Sep-2026 10:45:39 1
29-Sep-2026 10:45:39 stderr: error: The specified item could not be found in the keychain.
29-Sep-2026 10:45:39 1
29-Sep-2026 10:45:39 stderr: error: The specified item could not be found in the keychain.
29-Sep-2026 10:45:39 1
29-Sep-2026 10:45:39 stderr: error: The specified item could not be found in the keychain.
29-Sep-2026 10:45:39 1
29-Sep-2026 10:45:39 stderr: error: The specified item could not be found in the keychain.
29-Sep-2026 10:45:39 1
29-Sep-2026 10:45:39 stderr: error: The specified item could not be found in the keychain.
29-Sep-2026 10:45:39 1
29-Sep-2026 10:45:39 stderr: error: The specified item could not be found in the keychain.
29-Sep-2026 10:45:39 1
29-Sep-2026 10:45:39 stderr: error: The specified item could not be found in the keychain.
29-Sep-2026 10:45:39 1
29-Sep-2026 10:45:39 stderr: error: The specified item could not be found in the keychain.
29-Sep-2026 10:45:39 1
29-Sep-2026 10:45:39 stderr: error: The specified item could not be found in the keychain.
29-Sep-2026 10:45:39 1
29-Sep-2026 10:45:39 stderr: error: The specified item could not be found in the keychain.
29-Sep-2026 10:45:39 1
29-Sep-2026 10:45:39 stderr: error: The specified item could not be found in the keychain.
29-Sep-2026 10:45:39 1
29-Sep-2026 10:45:39 stderr: error: The specified item could not be found in the keychain.
29-Sep-2026 10:45:39 1
29-Sep-2026 10:45:39 stderr: error: The specified item could not be found in the keychain.
29-Sep-2026 10:45:39 1
29-Sep-2026 10:45:39 stderr: error: The specified item could not be found in the keychain.
29-Sep-2026 10:45:39 1
29-Sep-2026 10:45:39 stderr: error: The specified item could not be found in the keychain.
29-Sep-2026 10:45:39 1
29-Sep-2026 10:45:39 stderr: error: The specified item could not be found in the keychain.
29-Sep-2026 10:45:39 1
29-Sep-2026 10:45:39 stderr: error: The specified item could not be found in the keychain.
29-Sep-2026 10:45:39 1
29-Sep-2026 10:45:39 stderr: error: The specified item could not be found in the keychain.
29-Sep-2026 10:45:39 1
29-Sep-2026 10:45:39 stderr: error: The specified item could not be found in the keychain.
29-Sep-2026 10:45:39 1
29-Sep-2026 10:45:39 stderr: error: The specified item could not be found in the keychain.
29-Sep-2026 10:45:39 1
29-Sep-2026 10:45:39 stderr: error: The specified item could not be found in the keychain.
29-Sep-2026 10:45:39 1
29-Sep-2026 10:45:39 stderr: error: The specified item could not be found in the keychain.
29-Sep-2026 10:45:39 1
29-Sep-2026 10:45:39 stderr: error: The specified item could not be found in the keychain.
29-Sep-2026 10:45:39 1
29-Sep-2026 10:45:39 stderr: error: The specified item could not be found in the keychain.
29-Sep-2026 10:45:39 1
29-Sep-2026 10:45:39 stderr: error: The specified item could not be found in the keychain.
29-Sep-2026 10:45:39 1
29-Sep-2026 10:45:39 stderr: error: The specified item could not be found in the keychain.
29-Sep-2026 10:45:39 1
29-Sep-2026 10:45:39 stderr: error: The specified item could not be found in the keychain.
29-Sep-2026 10:45:39 1
29-Sep-2026 10:45:39 stderr: error: The specified item could not be found in the keychain.
29-Sep-2026 10:45:39 1
29-Sep-2026 10:45:39 stderr: error: The specified item could not be found in the keychain.
29-Sep-2026 10:45:39 1
29-Sep-2026 10:45:39 stderr: error: The specified item could not be found in the keychain.
29-Sep-2026 10:45:39 1
29-Sep-2026 10:45:39 stderr: error: The specified item could not be found in the keychain.
29-Sep-2026 10:45:39 1
29-Sep-2026 10:45:39 stderr: error: The specified item could not be found in the keychain.
29-Sep-2026 10:45:39 1
29-Sep-2026 10:45:39 stderr: error: The specified item could not be found in the keychain.
29-Sep-2026 10:45:39 1
29-Sep-2026 10:45:39 stderr: error: The specified item could not be found in the keychain.
29-Sep-2026 10:45:39 1
29-Sep-2026 10:45:39 stderr: error: The specified item could not be found in the keychain.
29-Sep-2026 10:45:39 1
29-Sep-2026 10:45:39 stderr: error: The specified item could not be found in the keychain.
29-Sep-2026 10:45:39 1
29-Sep-2026 10:45:39 stderr: error: The specified item could not be found in the keychain.
29-Sep-2026 10:45:39 1
29-Sep-2026 10:45:39 stderr: error: The specified item could not be found in the keychain.
29-Sep-2026 10:45:39 1
29-Sep-2026 10:45:39 stderr: error: The specified item could not be found in the keychain.
29-Sep-2026 10:45:39 1
29-Sep-2026 10:45:39 stderr: error: The specified item could not be found in the keychain.
29-Sep-2026 10:45:39 1
29-Sep-2026 10:45:39 stderr: error: The specified item could not be found in the keychain.
29-Sep-2026 10:45:39 1
29-Sep-2026 10:45:39 stderr: error: The specified item could not be found in the keychain.
29-Sep-2026 10:45:39 1
29-Sep-2026 10:45:39 stderr: error: The specified item could not be found in the keychain.
29-Sep-2026 10:45:39 1
29-Sep-2026 10:45:39 stderr: error: The specified item could not be found in the keychain.
29-Sep-2026 10:45:39 1
29-Sep-2026 10:45:39 stderr: error: The specified item could not be found in the keychain.
29-Sep-2026 10:45:39 1
29-Sep-2026 10:45:39 stderr: error: The specified item could not be found in the keychain.
29-Sep-2026 10:45:39 1
29-Sep-2026 10:45:39 stderr: error: The specified item could not be found in the keychain.
29-Sep-2026 10:45:39 1
29-Sep-2026 10:45:39 stderr: error: The specified item could not be found in the keychain.
29-Sep-2026 10:45:39 1
29-Sep-2026 10:45:39 stderr: error: The specified item could not be found in the keychain.
29-Sep-2026 10:45:39 1
29-Sep-2026 10:45:39 stderr: error: The specified item could not be found in the keychain.
29-Sep-2026 10:45:39 1
29-Sep-2026 10:45:39 stderr: error: The specified item could not be found in the keychain.
29-Sep-2026 10:45:39 1
29-Sep-2026 10:45:39 stderr: error: The specified item could not be found in the keychain.
29-Sep-2026 10:45:39 1
29-Sep-2026 10:45:39 Sign casaviewer executable
29-Sep-2026 10:45:39 Executing: ['codesign', '--timestamp', '--options=runtime', '-f', '--signature-size', '10240', '--entitlements', '/Users/casaci/bamboohome/xml-data/build-dir/PIPESPECS-PIPE202621CASA674-PMARM/casa-build-utils/notarization/ent.plist', '-s', '3116870A355D5035B7A1486D75B5396BAFC8FADE', 'Contents/Frameworks/Python.framework/Versions/3.12/lib/python3.12/site-packages/casaviewer/__bin__/casaviewer.app/Contents/MacOS/casaviewer']
29-Sep-2026 10:45:39 stderr: error: The specified item could not be found in the keychain.
29-Sep-2026 10:45:39 1
29-Sep-2026 10:45:39 Sign casaplotms executable
29-Sep-2026 10:45:39 Executing: ['codesign', '--timestamp', '--options=runtime', '-f', '--signature-size', '10240', '--entitlements', '/Users/casaci/bamboohome/xml-data/build-dir/PIPESPECS-PIPE202621CASA674-PMARM/casa-build-utils/notarization/ent.plist', '-s', '3116870A355D5035B7A1486D75B5396BAFC8FADE', 'Contents/Frameworks/Python.framework/Versions/3.12/lib/python3.12/site-packages/casaplotms/__bin__/casaplotms.app/Contents/MacOS/casaplotms']
29-Sep-2026 10:45:39 stderr: error: The specified item could not be found in the keychain.
29-Sep-2026 10:45:39 1
29-Sep-2026 10:45:39 Sign casaplotserver executable
29-Sep-2026 10:45:39 Executing: ['codesign', '--timestamp', '--options=runtime', '-f', '--signature-size', '10240', '--entitlements', '/Users/casaci/bamboohome/xml-data/build-dir/PIPESPECS-PIPE202621CASA674-PMARM/casa-build-utils/notarization/ent.plist', '-s', '3116870A355D5035B7A1486D75B5396BAFC8FADE', 'Contents/Frameworks/Python.framework/Versions/3.12/lib/python3.12/site-packages/casaplotserver/__bin__/casaplotserver.app/Contents/MacOS/casaplotserver']
29-Sep-2026 10:45:39 stderr: error: The specified item could not be found in the keychain.
29-Sep-2026 10:45:39 1
29-Sep-2026 10:45:39 Sign casafeather executable
29-Sep-2026 10:45:39 Executing: ['codesign', '--timestamp', '--options=runtime', '-f', '--signature-size', '10240', '--entitlements', '/Users/casaci/bamboohome/xml-data/build-dir/PIPESPECS-PIPE202621CASA674-PMARM/casa-build-utils/notarization/ent.plist', '-s', '3116870A355D5035B7A1486D75B5396BAFC8FADE', 'Contents/Frameworks/Python.framework/Versions/3.12/lib/python3.12/site-packages/casafeather/__bin__/casafeather.app/Contents/MacOS/casafeather']
29-Sep-2026 10:45:39 stderr: error: The specified item could not be found in the keychain.
29-Sep-2026 10:45:39 1
29-Sep-2026 10:45:39 Sign casalogger executable
29-Sep-2026 10:45:39 Executing: ['codesign', '--timestamp', '--options=runtime', '-f', '--signature-size', '10240', '--entitlements', '/Users/casaci/bamboohome/xml-data/build-dir/PIPESPECS-PIPE202621CASA674-PMARM/casa-build-utils/notarization/ent.plist', '-s', '3116870A355D5035B7A1486D75B5396BAFC8FADE', 'Contents/Frameworks/Python.framework/Versions/3.12/lib/python3.12/site-packages/casalogger/__bin__/casalogger.app/Contents/MacOS/casalogger']
29-Sep-2026 10:45:39 stderr: error: The specified item could not be found in the keychain.
29-Sep-2026 10:45:39 1
29-Sep-2026 10:45:39 Sign casatablebrowser executable
29-Sep-2026 10:45:39 Executing: ['codesign', '--timestamp', '--options=runtime', '-f', '--signature-size', '10240', '--entitlements', '/Users/casaci/bamboohome/xml-data/build-dir/PIPESPECS-PIPE202621CASA674-PMARM/casa-build-utils/notarization/ent.plist', '-s', '3116870A355D5035B7A1486D75B5396BAFC8FADE', 'Contents/Frameworks/Python.framework/Versions/3.12/lib/python3.12/site-packages/casatablebrowser/__bin__/casatablebrowser.app/Contents/MacOS/casatablebrowser']
29-Sep-2026 10:45:39 stderr: error: The specified item could not be found in the keychain.
29-Sep-2026 10:45:39 1
29-Sep-2026 10:45:39 Sign applet
29-Sep-2026 10:45:39 Signing applet
29-Sep-2026 10:45:39 stderr: error: The specified item could not be found in the keychain.
29-Sep-2026 10:45:39 1
29-Sep-2026 10:45:39 Sign breakpad
29-Sep-2026 10:45:39 Signing breakpad
29-Sep-2026 10:45:39 stderr: error: The specified item could not be found in the keychain.
29-Sep-2026 10:45:39 1
29-Sep-2026 10:45:39 Sign python
29-Sep-2026 10:45:39 Signing python
29-Sep-2026 10:45:39 stderr: error: The specified item could not be found in the keychain.
29-Sep-2026 10:45:39 1
29-Sep-2026 10:45:39 Sign CASA.app (again)
29-Sep-2026 10:45:39 stderr: error: The specified item could not be found in the keychain.
29-Sep-2026 10:45:39 1
29-Sep-2026 10:45:39 Create zip
29-Sep-2026 10:45:39 Executing: ['ditto', '-ck', '--sequesterRsrc', '--keepParent', 'CASA.app', 'CASA.zip']
29-Sep-2026 10:45:39 0
29-Sep-2026 10:45:39 Submit app notarytool
29-Sep-2026 10:45:39 /tmp/notarize_work
29-Sep-2026 10:45:39 0
29-Sep-2026 10:45:39 >>>>Conducting pre-submission checks for CASA.zip and initiating connection to the Apple notary service...
29-Sep-2026 10:45:39 >>>>Submission ID received
29-Sep-2026 10:45:39 >>>>  id: 07d9fc9f-9502-4819-955e-b2280b5f42f0
29-Sep-2026 10:45:39 >>>>Successfully uploaded file
29-Sep-2026 10:45:39 >>>>  id: 07d9fc9f-9502-4819-955e-b2280b5f42f0
29-Sep-2026 10:45:39 >>>>  path: /tmp/notarize_work/CASA.zip
29-Sep-2026 10:45:39 >>>>Waiting for processing to complete.
29-Sep-2026 10:45:39 >>>>
29-Sep-2026 10:45:39 Current status: In Progress...
29-Sep-2026 10:45:39 Current status: In Progress....
29-Sep-2026 10:45:39 Current status: In Progress.....
29-Sep-2026 10:45:39 Current status: In Progress......
29-Sep-2026 10:45:39 Current status: In Progress.......
29-Sep-2026 10:45:39 Current status: In Progress........
29-Sep-2026 10:45:39 Current status: In Progress.........
29-Sep-2026 10:45:39 Current status: In Progress..........
29-Sep-2026 10:45:39 Current status: In Progress...........
29-Sep-2026 10:45:39 Current status: In Progress............
29-Sep-2026 10:45:39 Current status: In Progress.............
29-Sep-2026 10:45:39 Current status: In Progress..............
29-Sep-2026 10:45:39 Current status: In Progress...............
29-Sep-2026 10:45:39 Current status: In Progress................
29-Sep-2026 10:45:39 Current status: In Progress.................
29-Sep-2026 10:45:39 Current status: In Progress..................
29-Sep-2026 10:45:39 Current status: In Progress...................
29-Sep-2026 10:45:39 Current status: In Progress....................
29-Sep-2026 10:45:39 Current status: In Progress.....................
29-Sep-2026 10:45:39 Current status: In Progress......................
29-Sep-2026 10:45:39 Current status: In Progress.......................
29-Sep-2026 10:45:39 Current status: In Progress........................
29-Sep-2026 10:45:39 Current status: In Progress.........................
29-Sep-2026 10:45:39 Current status: In Progress..........................
29-Sep-2026 10:45:39 Current status: In Progress...........................
29-Sep-2026 10:45:39 Current status: In Progress............................
29-Sep-2026 10:45:39 Current status: In Progress.............................
29-Sep-2026 10:45:39 Current status: In Progress..............................
29-Sep-2026 10:45:39 Current status: In Progress...............................
29-Sep-2026 10:45:39 Current status: In Progress................................
29-Sep-2026 10:45:39 Current status: In Progress.................................
29-Sep-2026 10:45:39 Current status: In Progress..................................
29-Sep-2026 10:45:39 Current status: In Progress...................................
29-Sep-2026 10:45:39 Current status: In Progress....................................
29-Sep-2026 10:45:39 Current status: In Progress.....................................
29-Sep-2026 10:45:39 Current status: Invalid......................................Processing complete
29-Sep-2026 10:45:39 Found status: In Progress...
29-Sep-2026 10:45:39 Current status
29-Sep-2026 10:45:39 >>>>  id: 07d9fc9f-9502-4819-955e-b2280b5f42f0
29-Sep-2026 10:45:39 >>>>  status: Invalid
29-Sep-2026 10:45:39 Found status: Invalid
29-Sep-2026 10:45:39 >>>>
29-Sep-2026 10:45:39 0
29-Sep-2026 10:45:39 Final status: Invalid
29-Sep-2026 10:45:39 Failing task since return code of [/Users/casaci/bamboohome/temp/PIPESPECS-PIPE202621CASA674-PMARM-10-ScriptBuildTask-2115658370148917472.sh] was 1 while expected 0
29-Sep-2026 10:45:40 Finished task 'Notarize' with result: Failed
29-Sep-2026 10:45:40 Running post build plugin 'Docker Container Cleanup'
29-Sep-2026 10:45:40 Running post build plugin 'NCover Results Collector'
29-Sep-2026 10:45:40 Running post build plugin 'Build Results Label Collector'
29-Sep-2026 10:45:40 Running post build plugin 'Clover Results Collector'
29-Sep-2026 10:45:40 Running post build plugin 'npm Cache Cleanup'
29-Sep-2026 10:45:40 Running post build plugin 'Artifact Copier'
29-Sep-2026 10:45:40 Publishing an artifact: Notarized macOS 15 py312 ARM Pipeline DMG
29-Sep-2026 10:45:40 Failing as no matching files has been found and empty artifacts are not allowed.
29-Sep-2026 10:45:40 Unable to publish artifact [Notarized macOS 15 py312 ARM Pipeline DMG]:
29-Sep-2026 10:45:40 The artifact is required, build will now fail.
29-Sep-2026 10:45:40 The artifact hasn't been successfully published after 152.8 ms
29-Sep-2026 10:45:40 Finalising the build...
29-Sep-2026 10:45:40 Stopping timer.
29-Sep-2026 10:45:40 Build PIPESPECS-PIPE202621CASA674-PMARM-10 completed.
29-Sep-2026 10:45:40 Running on server: post build plugin 'Build Hanging Detection Configuration'
29-Sep-2026 10:45:40 Running on server: post build plugin 'NCover Results Collector'
29-Sep-2026 10:45:40 Running on server: post build plugin 'Build Labeller'
29-Sep-2026 10:45:40 Running on server: post build plugin 'Clover Delta Calculator'
29-Sep-2026 10:45:40 Running on server: post build plugin 'Maven Dependencies Postprocessor'
29-Sep-2026 10:45:40 All post build plugins have finished
29-Sep-2026 10:45:40 Generating build results summary...
29-Sep-2026 10:45:40 Saving build results to disk...
29-Sep-2026 10:45:40 Store variable context...
29-Sep-2026 10:45:40 Finished building PIPESPECS-PIPE202621CASA674-PMARM-10.