Build: #128 failed

Job: Package Macos 11 Py3.6 was successful

Job result summary

Completed
Duration
43 minutes

Error summary

The build generated some errors. See the full build log for more details.

Cloning into 'casa-build-utils'...
Task exception was never retrieved
future: <Task finished coro=<_read_stream() done, defined at /Users/casaci/bamboohome/xml-data/build-dir/PIPE-P64P1-PM11P36/casa-build-utils/pipeline/shell_runner.py:10> exception=UnicodeEncodeError('ascii', 'Checksumming Protective Master Boot Record (MBR : 0)\u2026', 52, 53, 'ordinal not in range(128)')>
Traceback (most recent call last):
  File "/Users/casaci/bamboohome/xml-data/build-dir/PIPE-P64P1-PM11P36/casa-build-utils/pipeline/shell_runner.py", line 14, in _read_stream
    cb(line)
  File "/Users/casaci/bamboohome/xml-data/build-dir/PIPE-P64P1-PM11P36/casa-build-utils/pipeline/shell_runner.py", line 75, in <lambda>
    lambda x: process_stdout(x),
  File "/Users/casaci/bamboohome/xml-data/build-dir/PIPE-P64P1-PM11P36/casa-build-utils/pipeline/shell_runner.py", line 55, in process_stdout
    print("%s" % message)
UnicodeEncodeError: 'ascii' codec can't encode character '\u2026' in position 52: ordinal not in range(128)
Task exception was never retrieved
future: <Task finished coro=<_read_stream() done, defined at /Users/casaci/bamboohome/xml-data/build-dir/PIPE-P64P1-PM11P36/casa-build-utils/pipeline/shell_runner.py:10> exception=UnicodeEncodeError('ascii', 'Reading Protective Master Boot Record (MBR : 0)\u2026', 47, 48, 'ordinal not in range(128)')>
Traceback (most recent call last):
  File "/Users/casaci/bamboohome/xml-data/build-dir/PIPE-P64P1-PM11P36/casa-build-utils/pipeline/shell_runner.py", line 14, in _read_stream
    cb(line)
  File "/Users/casaci/bamboohome/xml-data/build-dir/PIPE-P64P1-PM11P36/casa-build-utils/pipeline/shell_runner.py", line 75, in <lambda>
    lambda x: process_stdout(x),
  File "/Users/casaci/bamboohome/xml-data/build-dir/PIPE-P64P1-PM11P36/casa-build-utils/pipeline/shell_runner.py", line 55, in process_stdout
    print("%s" % message)
UnicodeEncodeError: 'ascii' codec can't encode character '\u2026' in position 47: ordinal not in range(128)
fatal: destination path 'casa-build-utils' already exists and is not an empty directory.
Task exception was never retrieved
future: <Task finished coro=<_read_stream() done, defined at /Users/casaci/bamboohome/xml-data/build-dir/PIPE-P64P1-PM11P36/casa-build-utils/notarization/shell_runner.py:10> exception=UnicodeEncodeError('ascii', 'Checksumming Protective Master Boot Record (MBR : 0)\u2026', 52, 53, 'ordinal not in range(128)')>
Traceback (most recent call last):
  File "/Users/casaci/bamboohome/xml-data/build-dir/PIPE-P64P1-PM11P36/casa-build-utils/notarization/shell_runner.py", line 14, in _read_stream
    cb(line)
  File "/Users/casaci/bamboohome/xml-data/build-dir/PIPE-P64P1-PM11P36/casa-build-utils/notarization/shell_runner.py", line 73, in <lambda>
    lambda x: process_stdout(x),
  File "/Users/casaci/bamboohome/xml-data/build-dir/PIPE-P64P1-PM11P36/casa-build-utils/notarization/shell_runner.py", line 53, in process_stdout
    print("%s" % message)
UnicodeEncodeError: 'ascii' codec can't encode character '\u2026' in position 52: ordinal not in range(128)
Task exception was never retrieved
future: <Task finished coro=<_read_stream() done, defined at /Users/casaci/bamboohome/xml-data/build-dir/PIPE-P64P1-PM11P36/casa-build-utils/notarization/shell_runner.py:10> exception=UnicodeEncodeError('ascii', 'Reading Protective Master Boot Record (MBR : 0)\u2026', 47, 48, 'ordinal not in range(128)')>
Traceback (most recent call last):
  File "/Users/casaci/bamboohome/xml-data/build-dir/PIPE-P64P1-PM11P36/casa-build-utils/notarization/shell_runner.py", line 14, in _read_stream
    cb(line)
  File "/Users/casaci/bamboohome/xml-data/build-dir/PIPE-P64P1-PM11P36/casa-build-utils/notarization/shell_runner.py", line 73, in <lambda>
    lambda x: process_stdout(x),
  File "/Users/casaci/bamboohome/xml-data/build-dir/PIPE-P64P1-PM11P36/casa-build-utils/notarization/shell_runner.py", line 53, in process_stdout
    print("%s" % message)
UnicodeEncodeError: 'ascii' codec can't encode character '\u2026' in position 47: ordinal not in range(128)