Build: #1 failed First build for this plan

Build result summary

Details

Completed
Queue duration
2 seconds
Duration
582 minutes
Labels
None
Revision
9ad00efe86dd924754722ea8981b6561fdd68f0d
Total tests
8753

Tests

Responsible

  • Kumar Golap Kumar Golap Automatically assigned

Code commits

Author Commit Message Commit date
Kumar Golap Kumar Golap 9ad00efe86dd924754722ea8981b6561fdd68f0d Merge branch 'master' into CAS-14812

Tests

New test failures 2
Status Test View job Duration
Collapse Failed test_task_tclean test_widefield.test_widefield_mvc_squint_awp2
Test Tasks Many Linux 2.28 Python3.12 34 mins
AssertionError: False is not true
test_task_tclean.py:4341: in test_widefield_mvc_squint_awp2
    self.assertTrue(self.check_final(report))
E   AssertionError: False is not true
Collapse Failed test_task_tclean test_widefield.test_widefield_mvc_squint_awp2
Test Tasks macOS15 4 mins
AssertionError: False is not true
test_task_tclean.py:4341: in test_widefield_mvc_squint_awp2
    self.assertTrue(self.check_final(report))
E   AssertionError: False is not true

Jira issues

IssueDescriptionStatus
Unknown Issue TypeCAS-14812Could not obtain issue details from Jira