Build: #294 failed Child of CASASPECS-MASTERBUILDCASALITH-293
Build result summary
Details
- Completed
- Queue duration
- 1 second
- Duration
- 804 minutes
- Labels
- None
- Revision
-
621bee1f61cc596727495c37db44c514cc2a29b7
- Total tests
- 3737
- Failing since
- #293 (Child of CASASPECS-MASTERBUILDCASALITH-292 – )
Tests
- 0 New failures
- 1 Existing failures
- 0 Fixed
- 143 Quarantined / skipped
Responsible
-
Des Small
Automatically assigned
-
Victor de Souza Magalhaes
Automatically assigned
Code commits
Tests
| Status | Test | Failing since | View job | Duration | |
|---|---|---|---|---|---|
|
test_widefield
test_widefield_mvc_squint_awp2
|
Test Tasks Many Linux 2.34 CasaShell Rocky 9.5 | 19 mins | |||
AssertionError: False is not true
Traceback (most recent call last):
File "/home/casatest/casa6/casatasks/tests/casashell_tests/test_task_tclean_casashell.py", line 4339, in test_widefield_mvc_squint_awp2
self.assertTrue(self.check_final(report))
AssertionError: False is not true
|
|||||
Jira issues
| Issue | Description | Status | |
|---|---|---|---|
| Unknown Issue Type | CAS-14850 | Could not obtain issue details from Jira | |