Build: #1 failed Manual run by Akeem Wells
Build result summary
Details
- Completed
- Queue duration
- 3 seconds
- Duration
- 219 minutes
- Labels
- None
- Revisions
-
- CASA6
-
59e2b2b9af28a28c1cf1143b03d41343f9dda3ac
- OPEN-CASA-PKG
-
e5285e68467f01199807a1f1a978aec8a4781be7
- Total tests
- 8753
- Fixed in
- #2 (Manual run by Akeem Wells)
Tests
- 2 New failures
- 0 Existing failures
- 0 Fixed
- 297 Quarantined / skipped
Responsible
-
Takeshi Nakazato
Automatically assigned
Code commits
| Author | Commit | Commit date | |
|---|---|---|---|
|
|
Takeshi Nakazato |
59e2b2b9af28a28c1cf1143b03d41343f9dda3ac
|
|
Configuration changes
Some of the jobs or stages referenced by this result no longer exist.
Tests
| Status | Test | View job | Duration | |
|---|---|---|---|---|
| Collapse |
test_task_pccor
pccor_test_solutionValues.test_solutionValues
|
Test Tasks Many Linux 2.28 3.12 | 5 secs | |
AssertionError: False is not true : Current solutions differs from reference solution. max diff: 181.81819915771484, mean diff: -0.07818151673747335, median diff 0.0, tol: 1e-05.
test_task_pccor.py:286: in test_solutionValues
self.assertTrue(passed, f'Current solutions differs from reference solution. max diff: {diff_max}, mean diff: '
E AssertionError: False is not true : Current solutions differs from reference solution. max diff: 181.81819915771484, mean diff: -0.07818151673747335, median diff 0.0, tol: 1e-05.
|
||||
| Collapse |
test_task_pccor
pccor_test_solutionValues.test_solutionValues
|
Test Tasks macOS 15 Py3.12 | 3 secs | |
AssertionError: False is not true : Current solutions differs from reference solution. max diff: 181.81819915771484, mean diff: -0.07818152759762448, median diff 0.0, tol: 1e-05.
test_task_pccor.py:286: in test_solutionValues
self.assertTrue(passed, f'Current solutions differs from reference solution. max diff: {diff_max}, mean diff: '
E AssertionError: False is not true : Current solutions differs from reference solution. max diff: 181.81819915771484, mean diff: -0.07818152759762448, median diff 0.0, tol: 1e-05.
|
||||
Jira issues
| Issue | Description | Status | |
|---|---|---|---|
| Unknown Issue Type | CAS-14875 | Could not obtain issue details from Jira | |