a comprehensive HTML report from Allure test results.
Build: #130 failed
Job: Test Tasks ManyLinux failed
Build log
The build generated 424 lines of output. Download or view full build log.
| 28-Oct-2026 17:04:33 | Build CASA - Release Engineering Master Test Allure - Test Tasks ManyLinux #130 (CASA-REMTA-TTAML-130) is being prepared for building on agent casaci-4.cv.nrao.edu, bamboo version: 9.6.26 |
| 28-Oct-2026 17:04:33 | Remote agent on host casaci-4.cv.nrao.edu |
| 28-Oct-2026 17:04:33 | Build working directory is /opt/ci_workspace/casa/bamboo/agent2/xml-data/build-dir/CASA-REMTA-TTAML |
| 28-Oct-2026 17:04:33 | Executing build CASA - Release Engineering Master Test Allure - Test Tasks ManyLinux #130 (CASA-REMTA-TTAML-130) |
| 28-Oct-2026 17:04:33 | Starting task 'Clean working directory task' of type 'com.atlassian.bamboo.plugins.bamboo-artifact-downloader-plugin:cleanWorkingDirectoryTask' |
| 28-Oct-2026 17:04:33 | Cleaning working directory '/opt/ci_workspace/casa/bamboo/agent2/xml-data/build-dir/CASA-REMTA-TTAML' |
| 28-Oct-2026 17:04:33 | Finished task 'Clean working directory task' with result: Success |
| 28-Oct-2026 17:04:33 | Running pre-build action: Build Log Labeller Pre Build Action |
| 28-Oct-2026 17:04:33 | Running pre-build action: VCS Version Collector |
| 28-Oct-2026 17:04:33 | Build CASA - Release Engineering Master Test Allure - Test Tasks ManyLinux #130 (CASA-REMTA-TTAML-130) started building on agent 'casaci-4.cv.nrao.edu' (Remote agent on host casaci-4.cv.nrao.edu) |
| 28-Oct-2026 17:04:33 | Starting task 'Update data' of type 'com.atlassian.bamboo.plugins.scripttask:task.builder.script' |
| 28-Oct-2026 17:04:33 | Beginning to execute external process for build 'CASA - Release Engineering Master Test Allure - Test Tasks ManyLinux #130 (CASA-REMTA-TTAML-130)' ... running command line: /opt/ci_workspace/casa/bamboo/agent2/temp/CASA-REMTA-TTAML-130-ScriptBuildTask-16276025648731963466.sh ... in: /opt/ci_workspace/casa/bamboo/agent2/xml-data/build-dir/CASA-REMTA-TTAML |
| 28-Oct-2026 17:04:34 | Already up to date. |
| 28-Oct-2026 17:04:34 | Already up to date. |
| 28-Oct-2026 17:04:34 | Data update complete |
| 28-Oct-2026 17:04:34 | Finished task 'Update data' with result: Success |
| 28-Oct-2026 17:04:34 | Starting task 'Create wheeldirectory' of type 'com.atlassian.bamboo.plugins.scripttask:task.builder.script' |
| 28-Oct-2026 17:04:34 | Beginning to execute external process for build 'CASA - Release Engineering Master Test Allure - Test Tasks ManyLinux #130 (CASA-REMTA-TTAML-130)' ... running command line: /opt/ci_workspace/casa/bamboo/agent2/temp/CASA-REMTA-TTAML-130-ScriptBuildTask-17213100789986992860.sh ... in: /opt/ci_workspace/casa/bamboo/agent2/xml-data/build-dir/CASA-REMTA-TTAML |
| 28-Oct-2026 17:04:34 | Finished task 'Create wheeldirectory' with result: Success |
| 28-Oct-2026 17:04:34 | Starting task 'Get latest wheel' of type 'com.atlassian.bamboo.plugins.bamboo-artifact-downloader-plugin:artifactdownloadertask' |
| 28-Oct-2026 17:04:34 | Preparing to download plan result CASASPECS-MASTERBUILDCASALITH-304 artifact: Required shared artifact Http Compression On : [ManyLinux228 Python 3.12 Casatestutils], patterns: [casatestutils*.whl] anchored at: [source/wheels] |
| 28-Oct-2026 17:04:34 | Retrieving artifact ManyLinux228 Python 3.12 Casatestutils for CASASPECS-MASTERBUILDCASALITH-304 using Bamboo server artifact handler |
| 28-Oct-2026 17:04:34 | Artifact [ManyLinux228 Python 3.12 Casatestutils] downloaded successfully in 21.76 ms to wheeldirectory/ |
| 28-Oct-2026 17:04:34 | Preparing to download plan result CASASPECS-MASTERBUILDCASALITH-304 artifact: Required shared artifact Http Compression On : [ManyLinux228 Python 3.12 Tool wheel], patterns: [casatools*.whl] anchored at: [source/wheels] |
| 28-Oct-2026 17:04:34 | Retrieving artifact ManyLinux228 Python 3.12 Tool wheel for CASASPECS-MASTERBUILDCASALITH-304 using Bamboo server artifact handler |
| 28-Oct-2026 17:04:40 | Artifact [ManyLinux228 Python 3.12 Tool wheel] downloaded successfully in 5.679 s to wheeldirectory/ |
| 28-Oct-2026 17:04:40 | Preparing to download plan result CASASPECS-MASTERBUILDCASALITH-304 artifact: Required shared artifact Http Compression On : [ManyLinux228 Python 3.12 Task wheel], patterns: [casatasks*.whl] anchored at: [source/wheels] |
| 28-Oct-2026 17:04:40 | Retrieving artifact ManyLinux228 Python 3.12 Task wheel for CASASPECS-MASTERBUILDCASALITH-304 using Bamboo server artifact handler |
| 28-Oct-2026 17:04:40 | Artifact [ManyLinux228 Python 3.12 Task wheel] downloaded successfully in 143.9 ms to wheeldirectory/ |
| 28-Oct-2026 17:04:40 | Finished task 'Get latest wheel' with result: Success |
| 28-Oct-2026 17:04:40 | Substituting variable: ${bamboo.agentId} with 153550850 |
| 28-Oct-2026 17:04:40 | Substituting variable: ${bamboo.agentId} with 153550850 |
| 28-Oct-2026 17:04:40 | Substituting variable: ${bamboo.agentId} with 153550850 |
| 28-Oct-2026 17:04:40 | Starting task 'Stop and remove running wheel-container-test' of type 'com.atlassian.bamboo.plugins.scripttask:task.builder.script' |
| 28-Oct-2026 17:04:40 | Beginning to execute external process for build 'CASA - Release Engineering Master Test Allure - Test Tasks ManyLinux #130 (CASA-REMTA-TTAML-130)' ... running command line: /opt/ci_workspace/casa/bamboo/agent2/temp/CASA-REMTA-TTAML-130-ScriptBuildTask-3704118219051360020.sh ... in: /opt/ci_workspace/casa/bamboo/agent2/xml-data/build-dir/CASA-REMTA-TTAML |
| 28-Oct-2026 17:04:40 | Error response from daemon: No such container: wheel-container-test_153550850 |
| 28-Oct-2026 17:04:40 | Error response from daemon: No such container: wheel-container-test_153550850 |
| 28-Oct-2026 17:04:40 | Removed wheel-container-test_153550850 |
| 28-Oct-2026 17:04:40 | Finished task 'Stop and remove running wheel-container-test' with result: Success |
| 28-Oct-2026 17:04:40 | Substituting variable: ${bamboo.working.directory} with /opt/ci_workspace/casa/bamboo/agent2/xml-data/build-dir/CASA-REMTA-TTAML |
| 28-Oct-2026 17:04:40 | Substituting variable: ${bamboo.agentId} with 153550850 |
| 28-Oct-2026 17:04:40 | Starting task 'Start container' of type 'com.atlassian.bamboo.plugins.bamboo-docker-plugin:task.docker.cli' |
| 28-Oct-2026 17:04:40 | Running image name (casa-docker.nrao.edu:5000/casa-test-rocky-8.10:4) |
| 28-Oct-2026 17:04:40 | Beginning to execute external process for build 'CASA - Release Engineering Master Test Allure - Test Tasks ManyLinux #130 (CASA-REMTA-TTAML-130)' ... running command line: /usr/bin/docker run --volume /opt/ci_workspace/casa/bamboo/agent2/xml-data/build-dir/CASA-REMTA-TTAML/wheeldirectory:/wheeldirectory --volume /opt/casa/data:/opt/casa/data --detach --cpus=8 --memory=64g --name wheel-container-test_153550850 casa-docker.nrao.edu:5000/casa-test-rocky-8.10:4 tail -f /dev/null ... in: /opt/ci_workspace/casa/bamboo/agent2/xml-data/build-dir/CASA-REMTA-TTAML |
| 28-Oct-2026 17:04:40 | 91990c3e01965cf97cceff63d537db1ae6173a9ea763ddb8de5135fffa05fc1a |
| 28-Oct-2026 17:04:40 | Finished task 'Start container' with result: Success |
| 28-Oct-2026 17:04:40 | Substituting variable: ${bamboo.agentId} with 153550850 |
| 28-Oct-2026 17:04:40 | Substituting variable: ${bamboo.planRepository.branchName} with master |
| 28-Oct-2026 17:04:40 | Starting task 'Test wheel' of type 'com.atlassian.bamboo.plugins.scripttask:task.builder.script' |
| 28-Oct-2026 17:04:40 | Beginning to execute external process for build 'CASA - Release Engineering Master Test Allure - Test Tasks ManyLinux #130 (CASA-REMTA-TTAML-130)' ... running command line: /opt/ci_workspace/casa/bamboo/agent2/temp/CASA-REMTA-TTAML-130-ScriptBuildTask-3767964235272300407.sh ... in: /opt/ci_workspace/casa/bamboo/agent2/xml-data/build-dir/CASA-REMTA-TTAML |
| 28-Oct-2026 17:04:40 | branch: master |
| 28-Oct-2026 17:04:40 | Python version: 3.12 |
| 28-Oct-2026 17:04:40 | % Total % Received % Xferd Average Speed Time Time Time Current |
| 28-Oct-2026 17:04:40 | Dload Upload Total Spent Left Speed |
| 28-Oct-2026 17:04:40 | |
| 28-Oct-2026 17:04:40 | 0 0 0 0 0 0 0 0 --:--:-- --:--:-- --:--:-- 0 |
| 28-Oct-2026 17:04:40 | 100 6002k 100 6002k 0 0 68.1M 0 --:--:-- --:--:-- --:--:-- 68.1M |
| 28-Oct-2026 17:04:40 | bamboo_jira_components:'' |
| 28-Oct-2026 17:04:40 | bamboo_testlist:'' |
| 28-Oct-2026 17:04:40 | Ticket components: |
| 28-Oct-2026 17:04:40 | datapath=[ "/opt/casa/data/master", "/opt/casa/data/casatestdata" ] |
| 28-Oct-2026 17:04:40 | measurespath="/opt/casa/data/master" |
| 28-Oct-2026 17:04:40 | measures_auto_update=False |
| 28-Oct-2026 17:04:40 | data_auto_update=False |
| 28-Oct-2026 17:04:42 | /home/casatest/node-v24.12.0-linux-x64/bin:/usr/local/sbin:/usr/local/bin:/usr/sbin:/usr/bin:/sbin:/bin |
| 28-Oct-2026 17:04:47 | |
| 28-Oct-2026 17:04:47 | added 158 packages in 4s |
| 28-Oct-2026 17:04:47 | |
| 28-Oct-2026 17:04:47 | 52 packages are looking for funding |
| 28-Oct-2026 17:04:47 | run `npm fund` for details |
| 28-Oct-2026 17:04:47 | npm notice |
| 28-Oct-2026 17:04:47 | npm notice New minor version of npm available! 11.6.2 -> 11.21.1 |
| 28-Oct-2026 17:04:47 | npm notice Changelog: https://github.com/npm/cli/releases/tag/v11.21.1 |
| 28-Oct-2026 17:04:47 | npm notice To update run: npm install -g npm@11.21.1 |
| 28-Oct-2026 17:04:47 | npm notice |
| 28-Oct-2026 17:04:47 | 3.22.1 |
| 28-Oct-2026 17:04:48 | [993933] Failed to execute script 'atlutil' due to unhandled exception! |
| 28-Oct-2026 17:04:48 | Traceback (most recent call last): |
| 28-Oct-2026 17:04:48 | File "atlutil.py", line 200, in <module> |
| 28-Oct-2026 17:04:48 | File "atlutil.py", line 165, in has_fix_version |
| 28-Oct-2026 17:04:48 | File "json/__init__.py", line 354, in loads |
| 28-Oct-2026 17:04:48 | File "json/decoder.py", line 339, in decode |
| 28-Oct-2026 17:04:48 | File "json/decoder.py", line 357, in raw_decode |
| 28-Oct-2026 17:04:48 | json.decoder.JSONDecodeError: Expecting value: line 12 column 1 (char 11) |
| 28-Oct-2026 17:04:48 | datapath=[ "/opt/casa/data/master", "/opt/casa/data/casatestdata" ] |
| 28-Oct-2026 17:04:48 | measurespath="/opt/casa/data/master" |
| 28-Oct-2026 17:04:48 | measures_auto_update=False |
| 28-Oct-2026 17:04:48 | data_auto_update=False |
| 28-Oct-2026 17:04:50 | Requirement already satisfied: pip in /home/casatest/venv/lib/python3.12/site-packages (24.3.1) |
| 28-Oct-2026 17:04:50 | Collecting pip |
| 28-Oct-2026 17:04:50 | Downloading pip-26.2.2-py3-none-any.whl.metadata (4.6 kB) |
| 28-Oct-2026 17:04:50 | Collecting numpy |
| 28-Oct-2026 17:04:50 | Downloading numpy-2.5.4-cp312-cp312-manylinux_2_27_x86_64.manylinux_2_28_x86_64.whl.metadata (6.6 kB) |
| 28-Oct-2026 17:04:50 | Downloading pip-26.2.2-py3-none-any.whl (1.8 MB) |
| 28-Oct-2026 17:04:50 | ━━━━━━━━━━━━━━━━━━━━━━━━━━━━━━━━━━━━━━━━ 1.8/1.8 MB 110.1 MB/s eta 0:00:00 |
| 28-Oct-2026 17:04:50 | Downloading numpy-2.5.4-cp312-cp312-manylinux_2_27_x86_64.manylinux_2_28_x86_64.whl (16.7 MB) |
| 28-Oct-2026 17:04:50 | ━━━━━━━━━━━━━━━━━━━━━━━━━━━━━━━━━━━━━━━━ 16.7/16.7 MB 219.2 MB/s eta 0:00:00 |
| 28-Oct-2026 17:04:50 | Installing collected packages: pip, numpy |
| 28-Oct-2026 17:04:50 | Attempting uninstall: pip |
| 28-Oct-2026 17:04:50 | Found existing installation: pip 24.3.1 |
| 28-Oct-2026 17:04:50 | Uninstalling pip-24.3.1: |
| 28-Oct-2026 17:04:50 | Successfully uninstalled pip-24.3.1 |
| 28-Oct-2026 17:04:52 | Successfully installed numpy-2.5.4 pip-26.2.2 |
| 28-Oct-2026 17:04:53 | Processing ./casatestutils-6.8.0.2-py3-none-any.whl |
| 28-Oct-2026 17:04:53 | Collecting pytest>=6.0 (from casatestutils==6.8.0.2) |
| 28-Oct-2026 17:04:53 | Downloading pytest-9.2.0-py3-none-any.whl.metadata (7.9 kB) |
| 28-Oct-2026 17:04:53 | Collecting astropy (from casatestutils==6.8.0.2) |
| 28-Oct-2026 17:04:53 | Downloading astropy-8.0.2-cp311-abi3-manylinux2014_x86_64.manylinux_2_17_x86_64.manylinux_2_28_x86_64.whl.metadata (11 kB) |
| 28-Oct-2026 17:04:53 | Collecting iniconfig>=2 (from pytest>=6.0->casatestutils==6.8.0.2) |
| 28-Oct-2026 17:04:53 | Downloading iniconfig-2.3.1-py3-none-any.whl.metadata (2.8 kB) |
| 28-Oct-2026 17:04:53 | Collecting packaging>=24 (from pytest>=6.0->casatestutils==6.8.0.2) |
| 28-Oct-2026 17:04:53 | Downloading packaging-26.3-py3-none-any.whl.metadata (3.5 kB) |
| 28-Oct-2026 17:04:53 | Collecting pluggy<2,>=1.6 (from pytest>=6.0->casatestutils==6.8.0.2) |
| 28-Oct-2026 17:04:53 | Downloading pluggy-1.7.0-py3-none-any.whl.metadata (5.0 kB) |
| 28-Oct-2026 17:04:53 | Collecting pygments>=2.15 (from pytest>=6.0->casatestutils==6.8.0.2) |
| 28-Oct-2026 17:04:53 | Downloading pygments-2.21.0-py3-none-any.whl.metadata (2.5 kB) |
| 28-Oct-2026 17:04:53 | Collecting astropy-iers-data>=0.2026.9.28.0.59.37 (from astropy->casatestutils==6.8.0.2) |
| 28-Oct-2026 17:04:53 | Downloading astropy_iers_data-0.2026.10.19.0.52.1-py3-none-any.whl.metadata (3.4 kB) |
| 28-Oct-2026 17:04:53 | Requirement already satisfied: numpy>=2.0 in /home/casatest/venv/lib/python3.12/site-packages (from astropy->casatestutils==6.8.0.2) (2.5.4) |
| 28-Oct-2026 17:04:53 | Collecting pyerfa>=2.0.1.3 (from astropy->casatestutils==6.8.0.2) |
| 28-Oct-2026 17:04:53 | Downloading pyerfa-2.0.1.5-cp39-abi3-manylinux_2_17_x86_64.manylinux2014_x86_64.whl.metadata (5.7 kB) |
| 28-Oct-2026 17:04:53 | Collecting PyYAML>=6.0.0 (from astropy->casatestutils==6.8.0.2) |
| 28-Oct-2026 17:04:53 | Downloading pyyaml-6.0.3-cp312-cp312-manylinux2014_x86_64.manylinux_2_17_x86_64.manylinux_2_28_x86_64.whl.metadata (2.4 kB) |
| 28-Oct-2026 17:04:53 | Downloading pytest-9.2.0-py3-none-any.whl (411 kB) |
| 28-Oct-2026 17:04:53 | Downloading pluggy-1.7.0-py3-none-any.whl (27 kB) |
| 28-Oct-2026 17:04:53 | Downloading iniconfig-2.3.1-py3-none-any.whl (7.6 kB) |
| 28-Oct-2026 17:04:53 | Downloading packaging-26.3-py3-none-any.whl (129 kB) |
| 28-Oct-2026 17:04:53 | Downloading pygments-2.21.0-py3-none-any.whl (1.3 MB) |
| 28-Oct-2026 17:04:53 | ━━━━━━━━━━━━━━━━━━━━━━━━━━━━━━━━━━━━━━━━ 1.3/1.3 MB 45.8 MB/s 0:00:00 |
| 28-Oct-2026 17:04:53 | Downloading astropy-8.0.2-cp311-abi3-manylinux2014_x86_64.manylinux_2_17_x86_64.manylinux_2_28_x86_64.whl (10.4 MB) |
| 28-Oct-2026 17:04:54 | ━━━━━━━━━━━━━━━━━━━━━━━━━━━━━━━━━━━━━━━━ 10.4/10.4 MB 209.2 MB/s 0:00:00 |
| 28-Oct-2026 17:04:54 | Downloading astropy_iers_data-0.2026.10.19.0.52.1-py3-none-any.whl (2.0 MB) |
| 28-Oct-2026 17:04:54 | ━━━━━━━━━━━━━━━━━━━━━━━━━━━━━━━━━━━━━━━━ 2.0/2.0 MB 109.0 MB/s 0:00:00 |
| 28-Oct-2026 17:04:54 | Downloading pyerfa-2.0.1.5-cp39-abi3-manylinux_2_17_x86_64.manylinux2014_x86_64.whl (738 kB) |
| 28-Oct-2026 17:04:54 | ━━━━━━━━━━━━━━━━━━━━━━━━━━━━━━━━━━━━━━━━ 738.7/738.7 kB 122.0 MB/s 0:00:00 |
| 28-Oct-2026 17:04:54 | Downloading pyyaml-6.0.3-cp312-cp312-manylinux2014_x86_64.manylinux_2_17_x86_64.manylinux_2_28_x86_64.whl (807 kB) |
| 28-Oct-2026 17:04:54 | ━━━━━━━━━━━━━━━━━━━━━━━━━━━━━━━━━━━━━━━━ 807.9/807.9 kB 128.0 MB/s 0:00:00 |
| 28-Oct-2026 17:04:54 | Installing collected packages: PyYAML, pygments, pyerfa, pluggy, packaging, iniconfig, astropy-iers-data, pytest, astropy, casatestutils |
| 28-Oct-2026 17:04:57 | |
| 28-Oct-2026 17:04:57 | Successfully installed PyYAML-6.0.3 astropy-8.0.2 astropy-iers-data-0.2026.10.19.0.52.1 casatestutils-6.8.0.2 iniconfig-2.3.1 packaging-26.3 pluggy-1.7.0 pyerfa-2.0.1.5 pygments-2.21.0 pytest-9.2.0 |
| 28-Oct-2026 17:04:57 | Processing ./casatools-6.8.0.2-cp312-cp312-manylinux_2_28_x86_64.whl |
| 28-Oct-2026 17:04:57 | Requirement already satisfied: numpy in /home/casatest/venv/lib/python3.12/site-packages (from casatools==6.8.0.2) (2.5.4) |
| 28-Oct-2026 17:04:57 | Collecting casaconfig (from casatools==6.8.0.2) |
| 28-Oct-2026 17:04:57 | Downloading casaconfig-1.5.2-py3-none-any.whl.metadata (4.0 kB) |
| 28-Oct-2026 17:04:57 | Collecting certifi>=2023.5.7 (from casaconfig->casatools==6.8.0.2) |
| 28-Oct-2026 17:04:57 | Downloading certifi-2026.10.23-py3-none-any.whl.metadata (2.5 kB) |
| 28-Oct-2026 17:04:57 | Downloading casaconfig-1.5.2-py3-none-any.whl (77 kB) |
| 28-Oct-2026 17:04:57 | Downloading certifi-2026.10.23-py3-none-any.whl (135 kB) |
| 28-Oct-2026 17:04:57 | Installing collected packages: certifi, casaconfig, casatools |
| 28-Oct-2026 17:04:58 | |
| 28-Oct-2026 17:04:58 | Successfully installed casaconfig-1.5.2 casatools-6.8.0.2 certifi-2026.10.23 |
| 28-Oct-2026 17:04:59 | Processing ./casatasks-6.8.0.2-py3-none-any.whl |
| 28-Oct-2026 17:04:59 | Requirement already satisfied: casatools==6.8.0.2 in /home/casatest/venv/lib/python3.12/site-packages (from casatasks==6.8.0.2) (6.8.0.2) |
| 28-Oct-2026 17:04:59 | Collecting matplotlib (from casatasks==6.8.0.2) |
| 28-Oct-2026 17:04:59 | Downloading matplotlib-3.11.2-cp312-cp312-manylinux2014_x86_64.manylinux_2_17_x86_64.whl.metadata (80 kB) |
| 28-Oct-2026 17:04:59 | Collecting scipy (from casatasks==6.8.0.2) |
| 28-Oct-2026 17:04:59 | Downloading scipy-1.18.1-cp312-cp312-manylinux_2_27_x86_64.manylinux_2_28_x86_64.whl.metadata (62 kB) |
| 28-Oct-2026 17:04:59 | Requirement already satisfied: certifi in /home/casatest/venv/lib/python3.12/site-packages (from casatasks==6.8.0.2) (2026.10.23) |
| 28-Oct-2026 17:04:59 | Requirement already satisfied: pyerfa in /home/casatest/venv/lib/python3.12/site-packages (from casatasks==6.8.0.2) (2.0.1.5) |
| 28-Oct-2026 17:04:59 | Requirement already satisfied: numpy in /home/casatest/venv/lib/python3.12/site-packages (from casatools==6.8.0.2->casatasks==6.8.0.2) (2.5.4) |
| 28-Oct-2026 17:04:59 | Requirement already satisfied: casaconfig in /home/casatest/venv/lib/python3.12/site-packages (from casatools==6.8.0.2->casatasks==6.8.0.2) (1.5.2) |
| 28-Oct-2026 17:04:59 | Collecting contourpy>=1.0.1 (from matplotlib->casatasks==6.8.0.2) |
| 28-Oct-2026 17:04:59 | Downloading contourpy-1.4.0-cp312-cp312-manylinux_2_27_x86_64.manylinux_2_28_x86_64.whl.metadata (3.8 kB) |
| 28-Oct-2026 17:04:59 | Collecting cycler>=0.10 (from matplotlib->casatasks==6.8.0.2) |
| 28-Oct-2026 17:04:59 | Downloading cycler-0.12.1-py3-none-any.whl.metadata (3.8 kB) |
| 28-Oct-2026 17:04:59 | Collecting fonttools>=4.28.2 (from matplotlib->casatasks==6.8.0.2) |
| 28-Oct-2026 17:04:59 | Downloading fonttools-4.68.0-cp312-cp312-manylinux2014_x86_64.manylinux_2_17_x86_64.whl.metadata (139 kB) |
| 28-Oct-2026 17:04:59 | Collecting kiwisolver>=1.3.1 (from matplotlib->casatasks==6.8.0.2) |
| 28-Oct-2026 17:04:59 | Downloading kiwisolver-1.5.1-cp312-cp312-manylinux2014_x86_64.manylinux_2_17_x86_64.whl.metadata (5.2 kB) |
| 28-Oct-2026 17:04:59 | Requirement already satisfied: packaging>=20.0 in /home/casatest/venv/lib/python3.12/site-packages (from matplotlib->casatasks==6.8.0.2) (26.3) |
| 28-Oct-2026 17:04:59 | Collecting pillow>=9 (from matplotlib->casatasks==6.8.0.2) |
| 28-Oct-2026 17:04:59 | Downloading pillow-13.0.0-cp312-cp312-manylinux_2_27_x86_64.manylinux_2_28_x86_64.whl.metadata (9.1 kB) |
| 28-Oct-2026 17:05:00 | Collecting pyparsing>=3 (from matplotlib->casatasks==6.8.0.2) |
| 28-Oct-2026 17:05:00 | Downloading pyparsing-3.3.3-py3-none-any.whl.metadata (5.9 kB) |
| 28-Oct-2026 17:05:00 | Collecting python-dateutil>=2.7 (from matplotlib->casatasks==6.8.0.2) |
| 28-Oct-2026 17:05:00 | Downloading python_dateutil-3.0.0-py2.py3-none-any.whl.metadata (8.2 kB) |
| 28-Oct-2026 17:05:00 | Collecting six>=1.6 (from python-dateutil>=2.7->matplotlib->casatasks==6.8.0.2) |
| 28-Oct-2026 17:05:00 | Downloading six-1.17.0-py2.py3-none-any.whl.metadata (1.7 kB) |
| 28-Oct-2026 17:05:00 | Collecting tzdata (from python-dateutil>=2.7->matplotlib->casatasks==6.8.0.2) |
| 28-Oct-2026 17:05:00 | Downloading tzdata-2026.6-py2.py3-none-any.whl.metadata (1.4 kB) |
| 28-Oct-2026 17:05:00 | Downloading matplotlib-3.11.2-cp312-cp312-manylinux2014_x86_64.manylinux_2_17_x86_64.whl (9.9 MB) |
| 28-Oct-2026 17:05:00 | ━━━━━━━━━━━━━━━━━━━━━━━━━━━━━━━━━━━━━━━━ 9.9/9.9 MB 126.3 MB/s 0:00:00 |
| 28-Oct-2026 17:05:00 | Downloading contourpy-1.4.0-cp312-cp312-manylinux_2_27_x86_64.manylinux_2_28_x86_64.whl (383 kB) |
| 28-Oct-2026 17:05:00 | Downloading cycler-0.12.1-py3-none-any.whl (8.3 kB) |
| 28-Oct-2026 17:05:00 | Downloading fonttools-4.68.0-cp312-cp312-manylinux2014_x86_64.manylinux_2_17_x86_64.whl (5.4 MB) |
| 28-Oct-2026 17:05:00 | ━━━━━━━━━━━━━━━━━━━━━━━━━━━━━━━━━━━━━━━━ 5.4/5.4 MB 310.2 MB/s 0:00:00 |
| 28-Oct-2026 17:05:00 | Downloading kiwisolver-1.5.1-cp312-cp312-manylinux2014_x86_64.manylinux_2_17_x86_64.whl (1.5 MB) |
| 28-Oct-2026 17:05:00 | ━━━━━━━━━━━━━━━━━━━━━━━━━━━━━━━━━━━━━━━━ 1.5/1.5 MB 208.5 MB/s 0:00:00 |
| 28-Oct-2026 17:05:00 | Downloading pillow-13.0.0-cp312-cp312-manylinux_2_27_x86_64.manylinux_2_28_x86_64.whl (7.1 MB) |
| 28-Oct-2026 17:05:00 | ━━━━━━━━━━━━━━━━━━━━━━━━━━━━━━━━━━━━━━━━ 7.1/7.1 MB 311.6 MB/s 0:00:00 |
| 28-Oct-2026 17:05:00 | Downloading pyparsing-3.3.3-py3-none-any.whl (126 kB) |
| 28-Oct-2026 17:05:00 | Downloading python_dateutil-3.0.0-py2.py3-none-any.whl (94 kB) |
| 28-Oct-2026 17:05:00 | Downloading six-1.17.0-py2.py3-none-any.whl (11 kB) |
| 28-Oct-2026 17:05:00 | Downloading scipy-1.18.1-cp312-cp312-manylinux_2_27_x86_64.manylinux_2_28_x86_64.whl (35.3 MB) |
| 28-Oct-2026 17:05:00 | ━━━━━━━━━━━━━━━━━━━━━━━━━━━━━━━━━━━━━━━━ 35.3/35.3 MB 333.0 MB/s 0:00:00 |
| 28-Oct-2026 17:05:00 | Downloading tzdata-2026.6-py2.py3-none-any.whl (348 kB) |
| 28-Oct-2026 17:05:00 | Installing collected packages: tzdata, six, scipy, pyparsing, pillow, kiwisolver, fonttools, cycler, contourpy, python-dateutil, matplotlib, casatasks |
| 28-Oct-2026 17:05:06 | |
| 28-Oct-2026 17:05:06 | Successfully installed casatasks-6.8.0.2 contourpy-1.4.0 cycler-0.12.1 fonttools-4.68.0 kiwisolver-1.5.1 matplotlib-3.11.2 pillow-13.0.0 pyparsing-3.3.3 python-dateutil-3.0.0 scipy-1.18.1 six-1.17.0 tzdata-2026.6 |
| 28-Oct-2026 17:05:07 | Collecting allure-pytest |
| 28-Oct-2026 17:05:07 | Downloading allure_pytest-2.16.2-py3-none-any.whl.metadata (3.0 kB) |
| 28-Oct-2026 17:05:07 | Requirement already satisfied: pytest>=4.5.0 in ./home/casatest/venv/lib/python3.12/site-packages (from allure-pytest) (9.2.0) |
| 28-Oct-2026 17:05:07 | Collecting allure-python-commons==2.16.2 (from allure-pytest) |
| 28-Oct-2026 17:05:07 | Downloading allure_python_commons-2.16.2-py3-none-any.whl.metadata (5.7 kB) |
| 28-Oct-2026 17:05:07 | Collecting attrs>=16.0.0 (from allure-python-commons==2.16.2->allure-pytest) |
| 28-Oct-2026 17:05:07 | Downloading attrs-26.1.0-py3-none-any.whl.metadata (8.8 kB) |
| 28-Oct-2026 17:05:07 | Requirement already satisfied: pluggy>=0.4.0 in ./home/casatest/venv/lib/python3.12/site-packages (from allure-python-commons==2.16.2->allure-pytest) (1.7.0) |
| 28-Oct-2026 17:05:07 | Requirement already satisfied: iniconfig>=2 in ./home/casatest/venv/lib/python3.12/site-packages (from pytest>=4.5.0->allure-pytest) (2.3.1) |
| 28-Oct-2026 17:05:07 | Requirement already satisfied: packaging>=24 in ./home/casatest/venv/lib/python3.12/site-packages (from pytest>=4.5.0->allure-pytest) (26.3) |
| 28-Oct-2026 17:05:07 | Requirement already satisfied: pygments>=2.15 in ./home/casatest/venv/lib/python3.12/site-packages (from pytest>=4.5.0->allure-pytest) (2.21.0) |
| 28-Oct-2026 17:05:07 | Downloading allure_pytest-2.16.2-py3-none-any.whl (12 kB) |
| 28-Oct-2026 17:05:07 | Downloading allure_python_commons-2.16.2-py3-none-any.whl (16 kB) |
| 28-Oct-2026 17:05:07 | Downloading attrs-26.1.0-py3-none-any.whl (67 kB) |
| 28-Oct-2026 17:05:07 | Installing collected packages: attrs, allure-python-commons, allure-pytest |
| 28-Oct-2026 17:05:07 | |
| 28-Oct-2026 17:05:07 | Successfully installed allure-pytest-2.16.2 allure-python-commons-2.16.2 attrs-26.1.0 |
| 28-Oct-2026 17:05:07 | /home/casatest/node-v24.12.0-linux-x64/bin/allure |
| 28-Oct-2026 17:05:07 | /usr/local/sbin:/usr/local/bin:/usr/sbin:/usr/bin:/sbin:/bin |
| 28-Oct-2026 17:06:28 | branch 'CAS-14689' set up to track 'origin/CAS-14689'. |
| 28-Oct-2026 17:06:28 | Switched to a new branch 'CAS-14689' |
| 28-Oct-2026 17:06:28 | % Total % Received % Xferd Average Speed Time Time Time Current |
| 28-Oct-2026 17:06:28 | Dload Upload Total Spent Left Speed |
| 28-Oct-2026 17:06:28 | |
| 28-Oct-2026 17:06:28 | 0 0 0 0 0 0 0 0 --:--:-- --:--:-- --:--:-- 0 |
| 28-Oct-2026 17:06:28 | 100 669 0 669 0 0 55750 0 --:--:-- --:--:-- --:--:-- 55750 |
| 28-Oct-2026 17:06:37 | ============================= test session starts ============================== |
| 28-Oct-2026 17:06:37 | platform linux -- Python 3.12.9, pytest-9.2.0, pluggy-1.7.0 -- /home/casatest/venv/bin/python3.12 |
| 28-Oct-2026 17:06:37 | cachedir: .pytest_cache |
| 28-Oct-2026 17:06:37 | rootdir: /home/casatest/casa6/casatestutils/nosedir/test_task_smoothcal |
| 28-Oct-2026 17:06:37 | configfile: pytest.ini |
| 28-Oct-2026 17:06:37 | plugins: allure-pytest-2.16.2 |
| 28-Oct-2026 17:06:38 | collecting ... collected 13 items |
| 28-Oct-2026 17:06:38 | INTERNALERROR> Traceback (most recent call last): |
| 28-Oct-2026 17:06:38 | INTERNALERROR> File "/home/casatest/venv/lib/python3.12/site-packages/_pytest/main.py", line 333, in wrap_session |
| 28-Oct-2026 17:06:38 | INTERNALERROR> session.exitstatus = doit(config, session) or 0 |
| 28-Oct-2026 17:06:38 | INTERNALERROR> ^^^^^^^^^^^^^^^^^^^^^ |
| 28-Oct-2026 17:06:38 | INTERNALERROR> File "/home/casatest/venv/lib/python3.12/site-packages/_pytest/main.py", line 387, in _main |
| 28-Oct-2026 17:06:38 | INTERNALERROR> config.hook.pytest_runtestloop(session=session) |
| 28-Oct-2026 17:06:38 | INTERNALERROR> File "/home/casatest/venv/lib/python3.12/site-packages/pluggy/_caller.py", line 197, in __call__ |
| 28-Oct-2026 17:06:38 | INTERNALERROR> return self._hookexec( |
| 28-Oct-2026 17:06:38 | INTERNALERROR> ^^^^^^^^^^^^^^^ |
| 28-Oct-2026 17:06:38 | INTERNALERROR> File "/home/casatest/venv/lib/python3.12/site-packages/pluggy/_manager.py", line 183, in _hookexec |
| 28-Oct-2026 17:06:38 | INTERNALERROR> return self._inner_hookexec(hook_name, methods, kwargs, firstresult) |
| 28-Oct-2026 17:06:38 | INTERNALERROR> ^^^^^^^^^^^^^^^^^^^^^^^^^^^^^^^^^^^^^^^^^^^^^^^^^^^^^^^^^^^^^ |
| 28-Oct-2026 17:06:38 | INTERNALERROR> File "/home/casatest/venv/lib/python3.12/site-packages/pluggy/_execution.py", line 195, in _multicall |
| 28-Oct-2026 17:06:38 | INTERNALERROR> raise exception |
| 28-Oct-2026 17:06:38 | INTERNALERROR> File "/home/casatest/venv/lib/python3.12/site-packages/pluggy/_execution.py", line 167, in _multicall |
| 28-Oct-2026 17:06:38 | INTERNALERROR> teardown.throw(exception) |
| 28-Oct-2026 17:06:38 | INTERNALERROR> File "/home/casatest/venv/lib/python3.12/site-packages/_pytest/logging.py", line 829, in pytest_runtestloop |
| 28-Oct-2026 17:06:38 | INTERNALERROR> return (yield) # Run all the tests. |
| 28-Oct-2026 17:06:38 | INTERNALERROR> ^^^^^ |
| 28-Oct-2026 17:06:38 | INTERNALERROR> File "/home/casatest/venv/lib/python3.12/site-packages/pluggy/_execution.py", line 167, in _multicall |
| 28-Oct-2026 17:06:38 | INTERNALERROR> teardown.throw(exception) |
| 28-Oct-2026 17:06:38 | INTERNALERROR> File "/home/casatest/venv/lib/python3.12/site-packages/_pytest/terminal.py", line 723, in pytest_runtestloop |
| 28-Oct-2026 17:06:38 | INTERNALERROR> result = yield |
| 28-Oct-2026 17:06:38 | INTERNALERROR> ^^^^^ |
| 28-Oct-2026 17:06:38 | INTERNALERROR> File "/home/casatest/venv/lib/python3.12/site-packages/pluggy/_execution.py", line 147, in _multicall |
| 28-Oct-2026 17:06:38 | INTERNALERROR> res = hook_impl.function(*args) |
| 28-Oct-2026 17:06:38 | INTERNALERROR> ^^^^^^^^^^^^^^^^^^^^^^^^^ |
| 28-Oct-2026 17:06:38 | INTERNALERROR> File "/home/casatest/venv/lib/python3.12/site-packages/_pytest/main.py", line 411, in pytest_runtestloop |
| 28-Oct-2026 17:06:38 | INTERNALERROR> item.config.hook.pytest_runtest_protocol(item=item, nextitem=nextitem) |
| 28-Oct-2026 17:06:38 | INTERNALERROR> File "/home/casatest/venv/lib/python3.12/site-packages/pluggy/_caller.py", line 197, in __call__ |
| 28-Oct-2026 17:06:38 | INTERNALERROR> return self._hookexec( |
| 28-Oct-2026 17:06:38 | INTERNALERROR> ^^^^^^^^^^^^^^^ |
| 28-Oct-2026 17:06:38 | INTERNALERROR> File "/home/casatest/venv/lib/python3.12/site-packages/pluggy/_manager.py", line 183, in _hookexec |
| 28-Oct-2026 17:06:38 | INTERNALERROR> return self._inner_hookexec(hook_name, methods, kwargs, firstresult) |
| 28-Oct-2026 17:06:38 | INTERNALERROR> ^^^^^^^^^^^^^^^^^^^^^^^^^^^^^^^^^^^^^^^^^^^^^^^^^^^^^^^^^^^^^ |
| 28-Oct-2026 17:06:38 | INTERNALERROR> File "/home/casatest/venv/lib/python3.12/site-packages/pluggy/_execution.py", line 195, in _multicall |
| 28-Oct-2026 17:06:38 | INTERNALERROR> raise exception |
| 28-Oct-2026 17:06:38 | INTERNALERROR> File "/home/casatest/venv/lib/python3.12/site-packages/pluggy/_execution.py", line 167, in _multicall |
| 28-Oct-2026 17:06:38 | INTERNALERROR> teardown.throw(exception) |
| 28-Oct-2026 17:06:38 | INTERNALERROR> File "/home/casatest/venv/lib/python3.12/site-packages/pluggy/_execution.py", line 64, in run_old_style_hookwrapper |
| 28-Oct-2026 17:06:38 | INTERNALERROR> return result.get_result() |
| 28-Oct-2026 17:06:38 | INTERNALERROR> ^^^^^^^^^^^^^^^^^^^ |
| 28-Oct-2026 17:06:38 | INTERNALERROR> File "/home/casatest/venv/lib/python3.12/site-packages/pluggy/_result.py", line 103, in get_result |
| 28-Oct-2026 17:06:38 | INTERNALERROR> raise exc.with_traceback(tb) |
| 28-Oct-2026 17:06:38 | INTERNALERROR> File "/home/casatest/venv/lib/python3.12/site-packages/pluggy/_execution.py", line 49, in run_old_style_hookwrapper |
| 28-Oct-2026 17:06:38 | INTERNALERROR> res = yield |
| 28-Oct-2026 17:06:38 | INTERNALERROR> ^^^^^ |
| 28-Oct-2026 17:06:38 | INTERNALERROR> File "/home/casatest/venv/lib/python3.12/site-packages/pluggy/_execution.py", line 167, in _multicall |
| 28-Oct-2026 17:06:38 | INTERNALERROR> teardown.throw(exception) |
| 28-Oct-2026 17:06:38 | INTERNALERROR> File "/home/casatest/venv/lib/python3.12/site-packages/_pytest/warnings.py", line 75, in pytest_runtest_protocol |
| 28-Oct-2026 17:06:38 | INTERNALERROR> return (yield) |
| 28-Oct-2026 17:06:38 | INTERNALERROR> ^^^^^ |
| 28-Oct-2026 17:06:38 | INTERNALERROR> File "/home/casatest/venv/lib/python3.12/site-packages/pluggy/_execution.py", line 167, in _multicall |
| 28-Oct-2026 17:06:38 | INTERNALERROR> teardown.throw(exception) |
| 28-Oct-2026 17:06:38 | INTERNALERROR> File "/home/casatest/venv/lib/python3.12/site-packages/_pytest/assertion/__init__.py", line 212, in pytest_runtest_protocol |
| 28-Oct-2026 17:06:38 | INTERNALERROR> return (yield) |
| 28-Oct-2026 17:06:38 | INTERNALERROR> ^^^^^ |
| 28-Oct-2026 17:06:38 | INTERNALERROR> File "/home/casatest/venv/lib/python3.12/site-packages/pluggy/_execution.py", line 167, in _multicall |
| 28-Oct-2026 17:06:38 | INTERNALERROR> teardown.throw(exception) |
| 28-Oct-2026 17:06:38 | INTERNALERROR> File "/home/casatest/venv/lib/python3.12/site-packages/_pytest/unittest.py", line 610, in pytest_runtest_protocol |
| 28-Oct-2026 17:06:38 | INTERNALERROR> return (yield) |
| 28-Oct-2026 17:06:38 | INTERNALERROR> ^^^^^ |
| 28-Oct-2026 17:06:38 | INTERNALERROR> File "/home/casatest/venv/lib/python3.12/site-packages/pluggy/_execution.py", line 167, in _multicall |
| 28-Oct-2026 17:06:38 | INTERNALERROR> teardown.throw(exception) |
| 28-Oct-2026 17:06:38 | INTERNALERROR> File "/home/casatest/venv/lib/python3.12/site-packages/_pytest/faulthandler.py", line 102, in pytest_runtest_protocol |
| 28-Oct-2026 17:06:38 | INTERNALERROR> return (yield) |
| 28-Oct-2026 17:06:38 | INTERNALERROR> ^^^^^ |
| 28-Oct-2026 17:06:38 | INTERNALERROR> File "/home/casatest/venv/lib/python3.12/site-packages/pluggy/_execution.py", line 147, in _multicall |
| 28-Oct-2026 17:06:38 | INTERNALERROR> res = hook_impl.function(*args) |
| 28-Oct-2026 17:06:38 | INTERNALERROR> ^^^^^^^^^^^^^^^^^^^^^^^^^ |
| 28-Oct-2026 17:06:38 | INTERNALERROR> File "/home/casatest/casa6/casatestutils/nosedir/test_task_smoothcal/conftest.py", line 24, in pytest_runtest_protocol |
| 28-Oct-2026 17:06:38 | INTERNALERROR> self.funcn = item._nodeid |
| 28-Oct-2026 17:06:38 | INTERNALERROR> ^^^^^^^^^^^^ |
| 28-Oct-2026 17:06:38 | INTERNALERROR> AttributeError: 'TestCaseFunction' object has no attribute '_nodeid'. Did you mean: 'nodeid'? |
| 28-Oct-2026 17:06:38 | |
| 28-Oct-2026 17:06:38 | ============================== 1 warning in 1.68s ============================== |
| 28-Oct-2026 17:06:38 | Traceback (most recent call last): |
| 28-Oct-2026 17:06:38 | File "/home/casatest/casa6/casatestutils/runtest.py", line 1555, in <module> |
| 28-Oct-2026 17:06:38 | run( |
| 28-Oct-2026 17:06:38 | File "/home/casatest/casa6/casatestutils/runtest.py", line 1162, in run |
| 28-Oct-2026 17:06:38 | setup_and_run(cmd, workdir, workpath, dirname, DRY_RUN , pytest_args, allure_results) |
| 28-Oct-2026 17:06:38 | File "/home/casatest/casa6/casatestutils/runtest.py", line 1044, in setup_and_run |
| 28-Oct-2026 17:06:38 | update_xml(xmlfile, result, name=os.getcwd().split("/")[-1]) |
| 28-Oct-2026 17:06:38 | File "/home/casatest/casa6/casatestutils/runtest.py", line 601, in update_xml |
| 28-Oct-2026 17:06:38 | testclass = element.attrib["classname"].split(".")[1] |
| 28-Oct-2026 17:06:38 | ~~~~~~~~~~~~~~~~~~~~~~~~~~~~~~~~~~~~~~^^^ |
| 28-Oct-2026 17:06:38 | IndexError: list index out of range |
| 28-Oct-2026 17:06:38 | Namespace(list=False, verbose=False, dry_run=False, classes=None, file=None, mapfile=<_io.TextIOWrapper name='/home/casatest/casa6/casatestutils/casatestutils/component_to_test_map.json' mode='r' encoding='utf-8'>, branch='master', merge_target=None, pkg=None, work_dir=None, ncores=2, test_paths=None, test_list=None, test_config=None, test_group='Flagging,Calibration,asdmsummary,listobs', pmode=None, bamboo=False, cachedir=None, ignore_list=None, run_skipped=False, only_skipped=False, allure_results=True) |
| 28-Oct-2026 17:06:38 | |
| 28-Oct-2026 17:06:38 | Operating system: Linux |
| 28-Oct-2026 17:06:38 | |
| 28-Oct-2026 17:06:38 | Testing Components['Flagging', 'Calibration', 'asdmsummary', 'listobs'] |
| 28-Oct-2026 17:06:38 | |
| 28-Oct-2026 17:06:38 | Arguments Sent Direct To Pytest : [] |
| 28-Oct-2026 17:06:38 | Running 28 Test(s) |
| 28-Oct-2026 17:06:38 | Cleaning: /home/casatest/casa6/casatestutils/nosedir/ |
| 28-Oct-2026 17:06:38 | Tests: ['test_flaghelper', 'test_task_appendantab', 'test_task_applycal', 'test_task_asdmsummary', 'test_task_bandpass', 'test_task_blcal', 'test_task_defintent', 'test_task_delmod', 'test_task_flagcmd', 'test_task_flagdata', 'test_task_flagmanager', 'test_task_fluxscale', 'test_task_fringefit', 'test_task_gaincal', 'test_task_gencal', 'test_task_getantposalma', 'test_task_getcalmodvla', 'test_task_getephemtable', 'test_task_getjyperkalma', 'test_task_initweights', 'test_task_listcal', 'test_task_listobs', 'test_task_pccor', 'test_task_polcal', 'test_task_polfromgain', 'test_task_rerefant', 'test_task_smoothcal', 'test_task_uvmodelfit'] |
| 28-Oct-2026 17:06:38 | Fetching Repository: casa6 |
| 28-Oct-2026 17:06:38 | Running: git clone https://open-bitbucket.nrao.edu/scm/casa/casa6 |
| 28-Oct-2026 17:06:38 | Running: git checkout origin/master |
| 28-Oct-2026 17:06:38 | |
| 28-Oct-2026 17:06:38 | Fetching Repository: casampi |
| 28-Oct-2026 17:06:38 | Running: git clone https://open-bitbucket.nrao.edu/scm/casa/casampi |
| 28-Oct-2026 17:06:38 | Tag: tags/0.6.0 |
| 28-Oct-2026 17:06:38 | Running: git checkout tags/0.6.0 |
| 28-Oct-2026 17:06:38 | |
| 28-Oct-2026 17:06:38 | Fetching Repository: casaplotms |
| 28-Oct-2026 17:06:38 | Running: git clone https://open-bitbucket.nrao.edu/scm/casa/casaplotms |
| 28-Oct-2026 17:06:38 | Tag: tags/3.0.3 |
| 28-Oct-2026 17:06:38 | Running: git checkout tags/3.0.3 |
| 28-Oct-2026 17:06:38 | |
| 28-Oct-2026 17:06:38 | Fetching Repository: casaviewer |
| 28-Oct-2026 17:06:38 | Running: git clone https://open-bitbucket.nrao.edu/scm/casa/casaviewer |
| 28-Oct-2026 17:06:38 | Tag: tags/2.5.1 |
| 28-Oct-2026 17:06:38 | Running: git checkout tags/2.5.1 |
| 28-Oct-2026 17:06:38 | Directory Of Tests: /home/casatest/casa6/casatestutils/nosedir/tests/ |
| 28-Oct-2026 17:06:38 | |
| 28-Oct-2026 17:06:38 | Setting Working Directory: /home/casatest/casa6/casatestutils/nosedir/test_task_smoothcal/ |
| 28-Oct-2026 17:06:38 | Test Directory: /home/casatest/casa6/casatestutils/nosedir/test_task_smoothcal |
| 28-Oct-2026 17:06:38 | |
| 28-Oct-2026 17:06:38 | Running Command: pytest --alluredir=/home/casatest/casa6/casatestutils/nosedir//allure/test_task_smoothcal/allure-results --junitxml=/home/casatest/casa6/casatestutils/nosedir/xml/test_task_smoothcal/nose.xml -s --disable-pytest-warnings --verbose -ra --tb=short /home/casatest/casa6/casatestutils/nosedir/test_task_smoothcal/ |
| 28-Oct-2026 17:06:39 | total 79576 |
| 28-Oct-2026 17:06:39 | -rw-r--r-- 1 casaci 15001 1951039 Oct 28 21:04 casatasks-6.8.0.2-py3-none-any.whl |
| 28-Oct-2026 17:06:39 | -rw-r--r-- 1 casaci 15001 161031 Oct 28 21:04 casatestutils-6.8.0.2-py3-none-any.whl |
| 28-Oct-2026 17:06:39 | -rw-r--r-- 1 casaci 15001 79357138 Oct 28 21:04 casatools-6.8.0.2-cp312-cp312-manylinux_2_28_x86_64.whl |
| 28-Oct-2026 17:06:39 | -rw-r--r-- 1 casaci root 4954 Oct 28 21:06 test_task_smoothcal.xml |
| 28-Oct-2026 17:06:39 | Finished task 'Test wheel' with result: Success |
| 28-Oct-2026 17:06:39 | Substituting variable: ${bamboo.agentId} with 153550850 |
| 28-Oct-2026 17:06:39 | Substituting variable: ${bamboo.agentId} with 153550850 |
| 28-Oct-2026 17:06:39 | Substituting variable: ${bamboo.agentId} with 153550850 |
| 28-Oct-2026 17:06:39 | Substituting variable: ${bamboo.agentId} with 153550850 |
| 28-Oct-2026 17:06:39 | Starting task 'Tar work directory' of type 'com.atlassian.bamboo.plugins.scripttask:task.builder.script' |
| 28-Oct-2026 17:06:39 | Beginning to execute external process for build 'CASA - Release Engineering Master Test Allure - Test Tasks ManyLinux #130 (CASA-REMTA-TTAML-130)' ... running command line: /opt/ci_workspace/casa/bamboo/agent2/temp/CASA-REMTA-TTAML-130-ScriptBuildTask-3219952782951351117.sh ... in: /opt/ci_workspace/casa/bamboo/agent2/xml-data/build-dir/CASA-REMTA-TTAML |
| 28-Oct-2026 17:06:39 | Package working directory |
| 28-Oct-2026 17:06:39 | nosedir/ |
| 28-Oct-2026 17:06:39 | nosedir/test_task_smoothcal/ |
| 28-Oct-2026 17:06:39 | nosedir/test_task_smoothcal/test_task_smoothcal.py |
| 28-Oct-2026 17:06:39 | nosedir/test_task_smoothcal/pytest.ini |
| 28-Oct-2026 17:06:39 | nosedir/test_task_smoothcal/conftest.py |
| 28-Oct-2026 17:06:39 | nosedir/test_task_smoothcal/casa-20261028-210637.log |
| 28-Oct-2026 17:06:39 | nosedir/xml/ |
| 28-Oct-2026 17:06:39 | nosedir/xml/test_task_smoothcal/ |
| 28-Oct-2026 17:06:39 | nosedir/xml/test_task_smoothcal/nose.xml |
| 28-Oct-2026 17:06:39 | nosedir/allure/ |
| 28-Oct-2026 17:06:39 | nosedir/allure/test_task_smoothcal/ |
| 28-Oct-2026 17:06:39 | nosedir/allure/test_task_smoothcal/allure-results/ |
| 28-Oct-2026 17:06:39 | nosedir/allure/test_task_smoothcal/allure-results/7c9ef00e-b6b7-47b7-8652-3319fdb93a3b-result.json |
| 28-Oct-2026 17:06:39 | total 79584 |
| 28-Oct-2026 17:06:39 | -rw-r--r-- 1 casaci 15001 1951039 Oct 28 21:04 casatasks-6.8.0.2-py3-none-any.whl |
| 28-Oct-2026 17:06:39 | -rw-r--r-- 1 casaci 15001 161031 Oct 28 21:04 casatestutils-6.8.0.2-py3-none-any.whl |
| 28-Oct-2026 17:06:39 | -rw-r--r-- 1 casaci 15001 79357138 Oct 28 21:04 casatools-6.8.0.2-cp312-cp312-manylinux_2_28_x86_64.whl |
| 28-Oct-2026 17:06:39 | -rw-r--r-- 1 casaci root 4954 Oct 28 21:06 test_task_smoothcal.xml |
| 28-Oct-2026 17:06:39 | -rw-r--r-- 1 casaci root 4556 Oct 28 21:06 work-casatasks-manylinux228-3.12.tar.gz |
| 28-Oct-2026 17:06:39 | Done packaging working directory |
| 28-Oct-2026 17:06:39 | Finished task 'Tar work directory' with result: Success |
| 28-Oct-2026 17:06:39 | Starting task 'Parse tests' of type 'com.atlassian.bamboo.plugins.testresultparser:task.testresultparser.junit' |
| 28-Oct-2026 17:06:39 | Parsing test results under /opt/ci_workspace/casa/bamboo/agent2/xml-data/build-dir/CASA-REMTA-TTAML... |
| 28-Oct-2026 17:06:39 | Failing task since 1 failing test cases were found. |
| 28-Oct-2026 17:06:39 | Finished task 'Parse tests' with result: Failed |
| 28-Oct-2026 17:06:39 | Running post build plugin 'Docker Container Cleanup' |
| 28-Oct-2026 17:06:39 | Beginning to execute external process for build 'CASA - Release Engineering Master Test Allure - Test Tasks ManyLinux #130 (CASA-REMTA-TTAML-130)' ... running command line: /usr/bin/docker rm -f wheel-container-test_153550850 ... in: /opt/ci_workspace/casa/bamboo/agent2/xml-data/build-dir/CASA-REMTA-TTAML |
| 28-Oct-2026 17:06:42 | wheel-container-test_153550850 |
| 28-Oct-2026 17:06:42 | Running post build plugin 'NCover Results Collector' |
| 28-Oct-2026 17:06:42 | Running post build plugin 'Build Results Label Collector' |
| 28-Oct-2026 17:06:42 | Running post build plugin 'Clover Results Collector' |
| 28-Oct-2026 17:06:42 | Running post build plugin 'npm Cache Cleanup' |
| 28-Oct-2026 17:06:42 | Running post build plugin 'Artifact Copier' |
| 28-Oct-2026 17:06:42 | Publishing an artifact: Tasks Workdir |
| 28-Oct-2026 17:06:42 | Finished publishing of artifact Non required shared artifact Http Compression On : [Tasks Workdir], patterns: [work*.tar.gz] anchored at: [wheeldirectory/] in 41.78 ms |
| 28-Oct-2026 17:06:42 | Publishing an artifact: XML Directories |
| 28-Oct-2026 17:06:42 | Finished publishing of artifact Non required job artifact Http Compression On : [XML Directories], patterns: [**/*.xml] anchored at: [wheeldirectory/] in 40.02 ms |
| 28-Oct-2026 17:06:42 | Publishing an artifact: Allure Report |
| 28-Oct-2026 17:06:42 | Failing as no matching files has been found and empty artifacts are not allowed. |
| 28-Oct-2026 17:06:42 | Unable to publish artifact [Allure Report]: |
| 28-Oct-2026 17:06:42 | The artifact hasn't been successfully published after 16.41 ms |
| 28-Oct-2026 17:06:42 | Publishing an artifact: Allure History |
| 28-Oct-2026 17:06:42 | Failing as no matching files has been found and empty artifacts are not allowed. |
| 28-Oct-2026 17:06:42 | Unable to publish artifact [Allure History]: |
| 28-Oct-2026 17:06:42 | The artifact hasn't been successfully published after 9.365 ms |
| 28-Oct-2026 17:06:42 | Finalising the build... |
| 28-Oct-2026 17:06:42 | Stopping timer. |
| 28-Oct-2026 17:06:42 | Build CASA-REMTA-TTAML-130 completed. |
| 28-Oct-2026 17:06:42 | Running on server: post build plugin 'Build Hanging Detection Configuration' |
| 28-Oct-2026 17:06:42 | Running on server: post build plugin 'NCover Results Collector' |
| 28-Oct-2026 17:06:42 | Running on server: post build plugin 'Build Labeller' |
| 28-Oct-2026 17:06:42 | Running on server: post build plugin 'Clover Delta Calculator' |
| 28-Oct-2026 17:06:42 | Running on server: post build plugin 'Maven Dependencies Postprocessor' |
| 28-Oct-2026 17:06:42 | All post build plugins have finished |
| 28-Oct-2026 17:06:42 | Generating build results summary... |
| 28-Oct-2026 17:06:42 | Saving build results to disk... |
| 28-Oct-2026 17:06:42 | Store variable context... |
| 28-Oct-2026 17:06:42 | Finished building CASA-REMTA-TTAML-130. |