a comprehensive HTML report from Allure test results.
Build: #117 was successful
Job: Test Tasks ManyLinux was successful
Job result summary
- Completed
- Duration
- 34 minutes
- Agent
- casaci-4.cv.nrao.edu test agent5
- Total tests
- 750
- Successful since
- #116 ()
Tests
- 750 tests in total
- 5 tests were quarantined / skipped
- 31 minutes taken in total.
Error summary
The build generated some errors. See the full build log for more details.
Error response from daemon: No such container: wheel-container-test_153550853
Error response from daemon: No such container: wheel-container-test_153550853
2026-09-28 15:16:37 WARN getcalmodvla::::casa Caught URLError: <urlopen error [Errno -2] Name or service not known>
2026-09-28 15:16:37 SEVERE getcalmodvla::::casa Task getcalmodvla raised an exception of class RuntimeError with the following message: All URLs failed to return a component list
2026-09-28 15:16:37 SEVERE getcalmodvla::::casa Task getcalmodvla raised an exception of class ValueError with the following message: refdate must either be a number or a string of the form YYYY-MM-DD
2026-09-28 15:16:37 WARN getcalmodvla::::casa server path /?type=setjy&source=3C48&band=Q&obsdate=52384
2026-09-28 15:16:41 SEVERE getephemtable::::casa Task getephemtable raised an exception of class ValueError with the following message: objectname must be specified
2026-09-28 15:16:41 SEVERE getephemtable::::casa Task getephemtable raised an exception of class ValueError with the following message: timerange must be specified
2026-09-28 15:16:41 SEVERE getephemtable::::casa Task getephemtable raised an exception of class ValueError with the following message: outfile must be specified
2026-09-28 15:16:41 SEVERE getephemtable::::casa Task getephemtable raised an exception of class RuntimeError with the following message: objectname is given as an ID number, need to set asis=True
2026-09-28 15:16:41 SEVERE getephemtable::::casa Task getephemtable raised an exception of class ValueError with the following message: timerange needs to be specified with starttime and stoptime delimited by ~ .
2026-09-28 15:16:41 SEVERE getephemtable::::casa Task getephemtable raised an exception of class ValueError with the following message: Error translating stop time of timerange specified in JD.
2026-09-28 15:16:41 SEVERE getephemtable::::casa Task getephemtable raised an exception of class ValueError with the following message: Error translating stop time of timerange specified in MJD.
2026-09-28 15:16:41 SEVERE getephemtable::::casa Task getephemtable raised an exception of class ValueError with the following message: Error in timerange format. Use YYYY/MM/DD/hh:mm or Julian date with a prefix 'JD' Modified Julian date with a prefix 'MJD'
2026-09-28 15:16:41 SEVERE getephemtable::::casa Task getephemtable raised an exception of class ValueError with the following message: interval value must be integer
2026-09-28 15:16:41 WARN getephemtable::::casa Unexpected format for rotational period or the value is empty, the rotational period cannot be extracted.
2026-09-28 15:16:41 SEVERE getephemtable::::casa Task getephemtable raised an exception of class ValueError with the following message: testephem.tab exists and overwrite=False
2026-09-28 15:16:42 WARN getephemtable::::casa Unexpected format for rotational period or the value is empty, the rotational period cannot be extracted.
2026-09-28 15:16:43 WARN getephemtable::::casa Unexpected format for rotational period or the value is empty, the rotational period cannot be extracted.
2026-09-28 15:16:44 WARN getephemtable::::casa Unexpected format for rotational period or the value is empty, the rotational period cannot be extracted.
2026-09-28 15:16:44 WARN getephemtable::::casa Unexpected format for rotational period or the value is empty, the rotational period cannot be extracted.
2026-09-28 15:16:44 WARN getephemtable::::casa Unexpected format for rotational period or the value is empty, the rotational period cannot be extracted.
2026-09-28 15:16:44 WARN getephemtable::::casa Unexpected format for rotational period or the value is empty, the rotational period cannot be extracted.
2026-09-28 15:16:44 WARN getephemtable::::casa Unexpected format for rotational period or the value is empty, the rotational period cannot be extracted.
2026-09-28 15:16:44 SEVERE getephemtable::::casa Task getephemtable raised an exception of class HTTPError with the following message: HTTP Error 404: Not Found
2026-09-28 15:16:44 SEVERE getephemtable::::casa Task getephemtable raised an exception of class URLError with the following message: <urlopen error Unknown host>
2026-09-28 15:16:46 WARN test1_applycal_fluxscale_gcal_bcal::test1_applycal_fluxscale_gcal_bcal::casa Updating pre-v4.1 caltables: ['mmsbcalcopy.cal', 'mmsgcalcopy.cal', 'mmsfluxcopy.cal']
2026-09-28 15:16:46 WARN test1_applycal_fluxscale_gcal_bcal:::: Found pre-v4.1 caltable (/home/casatest/casa6/casatestutils/nosedir/test_task_applycal/mmsbcalcopy.cal); attempting to update...
2026-09-28 15:16:46 WARN test1_applycal_fluxscale_gcal_bcal::::+ SUCCEEDED: trivial OBSERVATION/OBSERVATION_ID have been added.
2026-09-28 15:16:46 WARN test1_applycal_fluxscale_gcal_bcal:::: Found pre-v4.1 caltable (/home/casatest/casa6/casatestutils/nosedir/test_task_applycal/mmsgcalcopy.cal); attempting to update...
2026-09-28 15:16:46 WARN test1_applycal_fluxscale_gcal_bcal::::+ SUCCEEDED: trivial OBSERVATION/OBSERVATION_ID have been added.
2026-09-28 15:16:46 WARN test1_applycal_fluxscale_gcal_bcal:::: Found pre-v4.1 caltable (/home/casatest/casa6/casatestutils/nosedir/test_task_applycal/mmsfluxcopy.cal); attempting to update...
2026-09-28 15:16:46 WARN test1_applycal_fluxscale_gcal_bcal::::+ SUCCEEDED: trivial OBSERVATION/OBSERVATION_ID have been added.
2026-09-28 15:17:25 WARN calibrater::setvi(bool,bool) Forcing use of OLD VisibilityIterator.
2026-09-28 15:17:27 WARN clearcal::calibrater::setvi(bool,bool) Forcing use of OLD VisibilityIterator.
2026-09-28 15:17:30 WARN clearcal::calibrater::setvi(bool,bool) Forcing use of OLD VisibilityIterator.
2026-09-28 15:17:33 WARN applycal:::: The cal library instructions for caltable =
2026-09-28 15:17:33 WARN applycal::::+ B Jones: cl_dupl_intents.ms.B0
2026-09-28 15:17:33 WARN applycal::::+ ...excluded calibration instructions for the following joint data selection(s):
2026-09-28 15:17:33 WARN applycal:::: obs=0 scan=3 fld=1 intent=2 spw=1 ant=*
2026-09-28 15:17:33 WARN applycal:::: obs=0 scan=5 fld=1 intent=3 spw=1 ant=*
2026-09-28 15:17:33 WARN applycal:::: obs=0 scan=8 fld=1 intent=4 spw=1 ant=*
2026-09-28 15:17:33 WARN applycal:::: obs=0 scan=10 fld=1 intent=5 spw=1 ant=*
2026-09-28 15:17:33 WARN applycal:::: obs=0 scan=12 fld=1 intent=6 spw=1 ant=*
2026-09-28 15:17:33 WARN applycal:::: Therefore, these data were passed uncalibrated (and unflagged) by *this* caltable.
2026-09-28 15:17:33 WARN applycal::::+ Please check your results carefully to be sure this was intended.
2026-09-28 15:17:40 WARN calibrater::setvi(bool,bool) Forcing use of OLD VisibilityIterator.
2026-09-28 15:17:43 WARN clearcal::calibrater::setvi(bool,bool) Forcing use of OLD VisibilityIterator.
2026-09-28 15:17:45 WARN clearcal::calibrater::setvi(bool,bool) Forcing use of OLD VisibilityIterator.
2026-09-28 15:17:47 WARN clearcal::calibrater::setvi(bool,bool) Forcing use of OLD VisibilityIterator.
2026-09-28 15:17:49 WARN clearcal::calibrater::setvi(bool,bool) Forcing use of OLD VisibilityIterator.
2026-09-28 15:17:51 WARN clearcal::calibrater::setvi(bool,bool) Forcing use of OLD VisibilityIterator.
2026-09-28 15:17:53 WARN clearcal::calibrater::setvi(bool,bool) Forcing use of OLD VisibilityIterator.
2026-09-28 15:17:55 WARN clearcal::calibrater::setvi(bool,bool) Forcing use of OLD VisibilityIterator.
2026-09-28 15:17:58 WARN clearcal::calibrater::setvi(bool,bool) Forcing use of OLD VisibilityIterator.
2026-09-28 15:18:01 WARN Found no calibration for MS ant Id=0 (CT ant Id=0) in MS spw Id=0 (CT spw Id=0) (temptcal.T0)
2026-09-28 15:18:01 WARN Found no calibration for MS ant Id=0 (CT ant Id=0) in MS spw Id=1 (CT spw Id=1) (temptcal.T0)
2026-09-28 15:18:01 WARN Found no calibration for MS ant Id=0 (CT ant Id=0) in MS spw Id=2 (CT spw Id=2) (temptcal.T0)
2026-09-28 15:18:01 WARN Found no calibration for MS ant Id=0 (CT ant Id=0) in MS spw Id=3 (CT spw Id=3) (temptcal.T0)
2026-09-28 15:19:05 WARN applycal::MSIter::setFeedInfo time dependent feed table encountered - not correctly handled - continuing anyway
2026-09-28 15:24:16 WARN pccor::::casa No pulse cal data for FD antenna, spw 0, using fringe fit solution as a backup
2026-09-28 15:24:18 SEVERE pccor::::casa Task pccor raised an exception of class ValueError with the following message: Mixing of antennas to include and antennas to exclude in the same list is not allowed
2026-09-28 15:24:18 SEVERE pccor::::casa Task pccor raised an exception of class ValueError with the following message: Antenna 30m is not available in this dataset
2026-09-28 15:24:18 SEVERE pccor::::casa Task pccor raised an exception of class RuntimeError with the following message: Reference antenna must be included in processing antennas in PCCOR
2026-09-28 15:24:19 SEVERE pccor::::casa Task pccor raised an exception of class ValueError with the following message: Selected scan 2000 is not present in the ms
2026-09-28 15:24:19 SEVERE pccor::::casa Task pccor raised an exception of class ValueError with the following message: timerange is incompatible with scan times
2026-09-28 15:24:20 SEVERE pccor::::casa Task pccor raised an exception of class ValueError with the following message: timerange is incompatible with scan times
2026-09-28 15:24:20 SEVERE pccor::::casa Task pccor raised an exception of class ValueError with the following message: 32e is not a valid single scan number
2026-09-28 15:24:21 SEVERE pccor::::casa Task pccor raised an exception of class ValueError with the following message: timerange must contain one and only one <~> to separate start and finish times
2026-09-28 15:24:24 WARN pccor::::casa No pulse cal data for FD antenna, spw 0, using fringe fit solution as a backup
2026-09-28 15:24:27 SEVERE pccor::::casa Task pccor raised an exception of class ValueError with the following message: Mixing of SPWs to include and SPWs to exclude in the same list is not allowed
2026-09-28 15:24:27 SEVERE pccor::::casa Task pccor raised an exception of class ValueError with the following message: 6 is not a valid SPW specification
2026-09-28 15:24:30 WARN pccor::::casa No pulse cal data for FD antenna, spw 0, using fringe fit solution as a backup
2026-09-28 15:24:30 SEVERE pccor::::casa Task pccor raised an exception of class RuntimeError with the following message: Fringe fit solutions not available for specified times
2026-09-28 15:24:34 WARN pccor::::casa No pulse cal data for FD antenna, spw 0, using fringe fit solution as a backup
2026-09-28 15:24:37 WARN pccor::::casa No pulse cal data for FD antenna, spw 0, using fringe fit solution as a backup
2026-09-28 15:24:43 SEVERE pccor::::casa No pulse cal data for FD antenna, spw 0, which is the reference antenna no solutions possible for this SPW
2026-09-28 15:24:43 SEVERE pccor::::casa Task pccor raised an exception of class RuntimeError with the following message: Missing pulse cal data for the reference antenna (FD) nothing to do.
2026-09-28 15:24:44 WARN pccor::::casa No pulse cal data for FD antenna, spw 0, using fringe fit solution as a backup
2026-09-28 15:24:46 SEVERE pccor::open::no_phase_cal_tiny.ms/PHASE_CAL Exception Reported: Table no_phase_cal_tiny.ms/PHASE_CAL does not exist
2026-09-28 15:24:46 SEVERE pccor::::casa Task pccor raised an exception of class RuntimeError with the following message: no_phase_cal_tiny.ms does not contain a PHASE_CAL subtable
2026-09-28 15:25:26 WARN smoothcal:::: Found pre-v4.1 caltable (/home/casatest/casa6/casatestutils/nosedir/test_task_smoothcal/ngc1333_ut_nct.gcal); attempting to update...
2026-09-28 15:25:26 WARN smoothcal::::+ SUCCEEDED: trivial OBSERVATION/OBSERVATION_ID have been added.
2026-09-28 15:25:27 WARN MSIter::setFeedInfo time dependent feed table encountered - not correctly handled - continuing anyway
2026-09-28 15:25:28 WARN smoothcal:::: Found pre-v4.1 caltable (/home/casatest/casa6/casatestutils/nosedir/test_task_smoothcal/ngc1333_ut_nct.gcal); attempting to update...
2026-09-28 15:25:28 WARN smoothcal::::+ SUCCEEDED: trivial OBSERVATION/OBSERVATION_ID have been added.
2026-09-28 15:25:28 WARN smoothcal:::: Found pre-v4.1 caltable (/home/casatest/casa6/casatestutils/nosedir/test_task_smoothcal/ngc1333_ut_nct.gcal); attempting to update...
2026-09-28 15:25:28 WARN smoothcal::::+ SUCCEEDED: trivial OBSERVATION/OBSERVATION_ID have been added.
2026-09-28 15:25:29 SEVERE smoothcal::Calibrater::smooth Caught Exception: Please specify a strictly positive smoothtime.
2026-09-28 15:25:29 SEVERE smoothcal:::: Exception Reported: Error in Calibrater::smooth.
2026-09-28 15:25:29 SEVERE smoothcal::::casa Task smoothcal raised an exception of class RuntimeError with the following message: Error in Calibrater::smooth.
2026-09-28 15:25:29 WARN smoothcal:::: Found pre-v4.1 caltable (/home/casatest/casa6/casatestutils/nosedir/test_task_smoothcal/ngc1333_ut_nct.gcal); attempting to update...
2026-09-28 15:25:29 WARN smoothcal::::+ SUCCEEDED: trivial OBSERVATION/OBSERVATION_ID have been added.
2026-09-28 15:25:29 WARN smoothcal:::: Found pre-v4.1 caltable (/home/casatest/casa6/casatestutils/nosedir/test_task_smoothcal/ngc1333_ut_nct.gcal); attempting to update...
2026-09-28 15:25:29 WARN smoothcal::::+ SUCCEEDED: trivial OBSERVATION/OBSERVATION_ID have been added.
2026-09-28 15:25:30 WARN smoothcal:::: Field Expression: Found out-of-range index(s) in the list (23 24 25 26 27 28 29 30 ) [TIP: Double-quoted strings forces name matching]
2026-09-28 15:25:30 SEVERE smoothcal::Calibrater::smooth Caught Exception: Field Expression: Partial or no match for Field ID list [23, 24, 25, 26, 27, 28, 29, 30]
2026-09-28 15:25:30 SEVERE smoothcal::Calibrater::smooth+ (near char. 5 in string "23~30")
2026-09-28 15:25:30 SEVERE smoothcal:::: Exception Reported: Error in Calibrater::smooth.
2026-09-28 15:25:30 SEVERE smoothcal::::casa Task smoothcal raised an exception of class RuntimeError with the following message: Error in Calibrater::smooth.
2026-09-28 15:25:30 WARN smoothcal:::: Found pre-v4.1 caltable (/home/casatest/casa6/casatestutils/nosedir/test_task_smoothcal/ngc1333_ut_nct.gcal); attempting to update...
2026-09-28 15:25:30 WARN smoothcal::::+ SUCCEEDED: trivial OBSERVATION/OBSERVATION_ID have been added.
Error response from daemon: No such container: wheel-container-test_153550853
2026-09-28 15:16:37 WARN getcalmodvla::::casa Caught URLError: <urlopen error [Errno -2] Name or service not known>
2026-09-28 15:16:37 SEVERE getcalmodvla::::casa Task getcalmodvla raised an exception of class RuntimeError with the following message: All URLs failed to return a component list
2026-09-28 15:16:37 SEVERE getcalmodvla::::casa Task getcalmodvla raised an exception of class ValueError with the following message: refdate must either be a number or a string of the form YYYY-MM-DD
2026-09-28 15:16:37 WARN getcalmodvla::::casa server path /?type=setjy&source=3C48&band=Q&obsdate=52384
2026-09-28 15:16:41 SEVERE getephemtable::::casa Task getephemtable raised an exception of class ValueError with the following message: objectname must be specified
2026-09-28 15:16:41 SEVERE getephemtable::::casa Task getephemtable raised an exception of class ValueError with the following message: timerange must be specified
2026-09-28 15:16:41 SEVERE getephemtable::::casa Task getephemtable raised an exception of class ValueError with the following message: outfile must be specified
2026-09-28 15:16:41 SEVERE getephemtable::::casa Task getephemtable raised an exception of class RuntimeError with the following message: objectname is given as an ID number, need to set asis=True
2026-09-28 15:16:41 SEVERE getephemtable::::casa Task getephemtable raised an exception of class ValueError with the following message: timerange needs to be specified with starttime and stoptime delimited by ~ .
2026-09-28 15:16:41 SEVERE getephemtable::::casa Task getephemtable raised an exception of class ValueError with the following message: Error translating stop time of timerange specified in JD.
2026-09-28 15:16:41 SEVERE getephemtable::::casa Task getephemtable raised an exception of class ValueError with the following message: Error translating stop time of timerange specified in MJD.
2026-09-28 15:16:41 SEVERE getephemtable::::casa Task getephemtable raised an exception of class ValueError with the following message: Error in timerange format. Use YYYY/MM/DD/hh:mm or Julian date with a prefix 'JD' Modified Julian date with a prefix 'MJD'
2026-09-28 15:16:41 SEVERE getephemtable::::casa Task getephemtable raised an exception of class ValueError with the following message: interval value must be integer
2026-09-28 15:16:41 WARN getephemtable::::casa Unexpected format for rotational period or the value is empty, the rotational period cannot be extracted.
2026-09-28 15:16:41 SEVERE getephemtable::::casa Task getephemtable raised an exception of class ValueError with the following message: testephem.tab exists and overwrite=False
2026-09-28 15:16:42 WARN getephemtable::::casa Unexpected format for rotational period or the value is empty, the rotational period cannot be extracted.
2026-09-28 15:16:43 WARN getephemtable::::casa Unexpected format for rotational period or the value is empty, the rotational period cannot be extracted.
2026-09-28 15:16:44 WARN getephemtable::::casa Unexpected format for rotational period or the value is empty, the rotational period cannot be extracted.
2026-09-28 15:16:44 WARN getephemtable::::casa Unexpected format for rotational period or the value is empty, the rotational period cannot be extracted.
2026-09-28 15:16:44 WARN getephemtable::::casa Unexpected format for rotational period or the value is empty, the rotational period cannot be extracted.
2026-09-28 15:16:44 WARN getephemtable::::casa Unexpected format for rotational period or the value is empty, the rotational period cannot be extracted.
2026-09-28 15:16:44 WARN getephemtable::::casa Unexpected format for rotational period or the value is empty, the rotational period cannot be extracted.
2026-09-28 15:16:44 SEVERE getephemtable::::casa Task getephemtable raised an exception of class HTTPError with the following message: HTTP Error 404: Not Found
2026-09-28 15:16:44 SEVERE getephemtable::::casa Task getephemtable raised an exception of class URLError with the following message: <urlopen error Unknown host>
2026-09-28 15:16:46 WARN test1_applycal_fluxscale_gcal_bcal::test1_applycal_fluxscale_gcal_bcal::casa Updating pre-v4.1 caltables: ['mmsbcalcopy.cal', 'mmsgcalcopy.cal', 'mmsfluxcopy.cal']
2026-09-28 15:16:46 WARN test1_applycal_fluxscale_gcal_bcal:::: Found pre-v4.1 caltable (/home/casatest/casa6/casatestutils/nosedir/test_task_applycal/mmsbcalcopy.cal); attempting to update...
2026-09-28 15:16:46 WARN test1_applycal_fluxscale_gcal_bcal::::+ SUCCEEDED: trivial OBSERVATION/OBSERVATION_ID have been added.
2026-09-28 15:16:46 WARN test1_applycal_fluxscale_gcal_bcal:::: Found pre-v4.1 caltable (/home/casatest/casa6/casatestutils/nosedir/test_task_applycal/mmsgcalcopy.cal); attempting to update...
2026-09-28 15:16:46 WARN test1_applycal_fluxscale_gcal_bcal::::+ SUCCEEDED: trivial OBSERVATION/OBSERVATION_ID have been added.
2026-09-28 15:16:46 WARN test1_applycal_fluxscale_gcal_bcal:::: Found pre-v4.1 caltable (/home/casatest/casa6/casatestutils/nosedir/test_task_applycal/mmsfluxcopy.cal); attempting to update...
2026-09-28 15:16:46 WARN test1_applycal_fluxscale_gcal_bcal::::+ SUCCEEDED: trivial OBSERVATION/OBSERVATION_ID have been added.
2026-09-28 15:17:25 WARN calibrater::setvi(bool,bool) Forcing use of OLD VisibilityIterator.
2026-09-28 15:17:27 WARN clearcal::calibrater::setvi(bool,bool) Forcing use of OLD VisibilityIterator.
2026-09-28 15:17:30 WARN clearcal::calibrater::setvi(bool,bool) Forcing use of OLD VisibilityIterator.
2026-09-28 15:17:33 WARN applycal:::: The cal library instructions for caltable =
2026-09-28 15:17:33 WARN applycal::::+ B Jones: cl_dupl_intents.ms.B0
2026-09-28 15:17:33 WARN applycal::::+ ...excluded calibration instructions for the following joint data selection(s):
2026-09-28 15:17:33 WARN applycal:::: obs=0 scan=3 fld=1 intent=2 spw=1 ant=*
2026-09-28 15:17:33 WARN applycal:::: obs=0 scan=5 fld=1 intent=3 spw=1 ant=*
2026-09-28 15:17:33 WARN applycal:::: obs=0 scan=8 fld=1 intent=4 spw=1 ant=*
2026-09-28 15:17:33 WARN applycal:::: obs=0 scan=10 fld=1 intent=5 spw=1 ant=*
2026-09-28 15:17:33 WARN applycal:::: obs=0 scan=12 fld=1 intent=6 spw=1 ant=*
2026-09-28 15:17:33 WARN applycal:::: Therefore, these data were passed uncalibrated (and unflagged) by *this* caltable.
2026-09-28 15:17:33 WARN applycal::::+ Please check your results carefully to be sure this was intended.
2026-09-28 15:17:40 WARN calibrater::setvi(bool,bool) Forcing use of OLD VisibilityIterator.
2026-09-28 15:17:43 WARN clearcal::calibrater::setvi(bool,bool) Forcing use of OLD VisibilityIterator.
2026-09-28 15:17:45 WARN clearcal::calibrater::setvi(bool,bool) Forcing use of OLD VisibilityIterator.
2026-09-28 15:17:47 WARN clearcal::calibrater::setvi(bool,bool) Forcing use of OLD VisibilityIterator.
2026-09-28 15:17:49 WARN clearcal::calibrater::setvi(bool,bool) Forcing use of OLD VisibilityIterator.
2026-09-28 15:17:51 WARN clearcal::calibrater::setvi(bool,bool) Forcing use of OLD VisibilityIterator.
2026-09-28 15:17:53 WARN clearcal::calibrater::setvi(bool,bool) Forcing use of OLD VisibilityIterator.
2026-09-28 15:17:55 WARN clearcal::calibrater::setvi(bool,bool) Forcing use of OLD VisibilityIterator.
2026-09-28 15:17:58 WARN clearcal::calibrater::setvi(bool,bool) Forcing use of OLD VisibilityIterator.
2026-09-28 15:18:01 WARN Found no calibration for MS ant Id=0 (CT ant Id=0) in MS spw Id=0 (CT spw Id=0) (temptcal.T0)
2026-09-28 15:18:01 WARN Found no calibration for MS ant Id=0 (CT ant Id=0) in MS spw Id=1 (CT spw Id=1) (temptcal.T0)
2026-09-28 15:18:01 WARN Found no calibration for MS ant Id=0 (CT ant Id=0) in MS spw Id=2 (CT spw Id=2) (temptcal.T0)
2026-09-28 15:18:01 WARN Found no calibration for MS ant Id=0 (CT ant Id=0) in MS spw Id=3 (CT spw Id=3) (temptcal.T0)
2026-09-28 15:19:05 WARN applycal::MSIter::setFeedInfo time dependent feed table encountered - not correctly handled - continuing anyway
2026-09-28 15:24:16 WARN pccor::::casa No pulse cal data for FD antenna, spw 0, using fringe fit solution as a backup
2026-09-28 15:24:18 SEVERE pccor::::casa Task pccor raised an exception of class ValueError with the following message: Mixing of antennas to include and antennas to exclude in the same list is not allowed
2026-09-28 15:24:18 SEVERE pccor::::casa Task pccor raised an exception of class ValueError with the following message: Antenna 30m is not available in this dataset
2026-09-28 15:24:18 SEVERE pccor::::casa Task pccor raised an exception of class RuntimeError with the following message: Reference antenna must be included in processing antennas in PCCOR
2026-09-28 15:24:19 SEVERE pccor::::casa Task pccor raised an exception of class ValueError with the following message: Selected scan 2000 is not present in the ms
2026-09-28 15:24:19 SEVERE pccor::::casa Task pccor raised an exception of class ValueError with the following message: timerange is incompatible with scan times
2026-09-28 15:24:20 SEVERE pccor::::casa Task pccor raised an exception of class ValueError with the following message: timerange is incompatible with scan times
2026-09-28 15:24:20 SEVERE pccor::::casa Task pccor raised an exception of class ValueError with the following message: 32e is not a valid single scan number
2026-09-28 15:24:21 SEVERE pccor::::casa Task pccor raised an exception of class ValueError with the following message: timerange must contain one and only one <~> to separate start and finish times
2026-09-28 15:24:24 WARN pccor::::casa No pulse cal data for FD antenna, spw 0, using fringe fit solution as a backup
2026-09-28 15:24:27 SEVERE pccor::::casa Task pccor raised an exception of class ValueError with the following message: Mixing of SPWs to include and SPWs to exclude in the same list is not allowed
2026-09-28 15:24:27 SEVERE pccor::::casa Task pccor raised an exception of class ValueError with the following message: 6 is not a valid SPW specification
2026-09-28 15:24:30 WARN pccor::::casa No pulse cal data for FD antenna, spw 0, using fringe fit solution as a backup
2026-09-28 15:24:30 SEVERE pccor::::casa Task pccor raised an exception of class RuntimeError with the following message: Fringe fit solutions not available for specified times
2026-09-28 15:24:34 WARN pccor::::casa No pulse cal data for FD antenna, spw 0, using fringe fit solution as a backup
2026-09-28 15:24:37 WARN pccor::::casa No pulse cal data for FD antenna, spw 0, using fringe fit solution as a backup
2026-09-28 15:24:43 SEVERE pccor::::casa No pulse cal data for FD antenna, spw 0, which is the reference antenna no solutions possible for this SPW
2026-09-28 15:24:43 SEVERE pccor::::casa Task pccor raised an exception of class RuntimeError with the following message: Missing pulse cal data for the reference antenna (FD) nothing to do.
2026-09-28 15:24:44 WARN pccor::::casa No pulse cal data for FD antenna, spw 0, using fringe fit solution as a backup
2026-09-28 15:24:46 SEVERE pccor::open::no_phase_cal_tiny.ms/PHASE_CAL Exception Reported: Table no_phase_cal_tiny.ms/PHASE_CAL does not exist
2026-09-28 15:24:46 SEVERE pccor::::casa Task pccor raised an exception of class RuntimeError with the following message: no_phase_cal_tiny.ms does not contain a PHASE_CAL subtable
2026-09-28 15:25:26 WARN smoothcal:::: Found pre-v4.1 caltable (/home/casatest/casa6/casatestutils/nosedir/test_task_smoothcal/ngc1333_ut_nct.gcal); attempting to update...
2026-09-28 15:25:26 WARN smoothcal::::+ SUCCEEDED: trivial OBSERVATION/OBSERVATION_ID have been added.
2026-09-28 15:25:27 WARN MSIter::setFeedInfo time dependent feed table encountered - not correctly handled - continuing anyway
2026-09-28 15:25:28 WARN smoothcal:::: Found pre-v4.1 caltable (/home/casatest/casa6/casatestutils/nosedir/test_task_smoothcal/ngc1333_ut_nct.gcal); attempting to update...
2026-09-28 15:25:28 WARN smoothcal::::+ SUCCEEDED: trivial OBSERVATION/OBSERVATION_ID have been added.
2026-09-28 15:25:28 WARN smoothcal:::: Found pre-v4.1 caltable (/home/casatest/casa6/casatestutils/nosedir/test_task_smoothcal/ngc1333_ut_nct.gcal); attempting to update...
2026-09-28 15:25:28 WARN smoothcal::::+ SUCCEEDED: trivial OBSERVATION/OBSERVATION_ID have been added.
2026-09-28 15:25:29 SEVERE smoothcal::Calibrater::smooth Caught Exception: Please specify a strictly positive smoothtime.
2026-09-28 15:25:29 SEVERE smoothcal:::: Exception Reported: Error in Calibrater::smooth.
2026-09-28 15:25:29 SEVERE smoothcal::::casa Task smoothcal raised an exception of class RuntimeError with the following message: Error in Calibrater::smooth.
2026-09-28 15:25:29 WARN smoothcal:::: Found pre-v4.1 caltable (/home/casatest/casa6/casatestutils/nosedir/test_task_smoothcal/ngc1333_ut_nct.gcal); attempting to update...
2026-09-28 15:25:29 WARN smoothcal::::+ SUCCEEDED: trivial OBSERVATION/OBSERVATION_ID have been added.
2026-09-28 15:25:29 WARN smoothcal:::: Found pre-v4.1 caltable (/home/casatest/casa6/casatestutils/nosedir/test_task_smoothcal/ngc1333_ut_nct.gcal); attempting to update...
2026-09-28 15:25:29 WARN smoothcal::::+ SUCCEEDED: trivial OBSERVATION/OBSERVATION_ID have been added.
2026-09-28 15:25:30 WARN smoothcal:::: Field Expression: Found out-of-range index(s) in the list (23 24 25 26 27 28 29 30 ) [TIP: Double-quoted strings forces name matching]
2026-09-28 15:25:30 SEVERE smoothcal::Calibrater::smooth Caught Exception: Field Expression: Partial or no match for Field ID list [23, 24, 25, 26, 27, 28, 29, 30]
2026-09-28 15:25:30 SEVERE smoothcal::Calibrater::smooth+ (near char. 5 in string "23~30")
2026-09-28 15:25:30 SEVERE smoothcal:::: Exception Reported: Error in Calibrater::smooth.
2026-09-28 15:25:30 SEVERE smoothcal::::casa Task smoothcal raised an exception of class RuntimeError with the following message: Error in Calibrater::smooth.
2026-09-28 15:25:30 WARN smoothcal:::: Found pre-v4.1 caltable (/home/casatest/casa6/casatestutils/nosedir/test_task_smoothcal/ngc1333_ut_nct.gcal); attempting to update...
2026-09-28 15:25:30 WARN smoothcal::::+ SUCCEEDED: trivial OBSERVATION/OBSERVATION_ID have been added.