Build log
The build generated 65,668 lines of output.The output is too long and has been truncated to the last 1,000 lines. Download or view full build log.
21-Aug-2024 01:23:18 | 2024-08-21 05:23:19 WARN SkyCompRep::convertToJy Cannot convert units of brightness to Jy - will assume Jy |
21-Aug-2024 01:23:18 | 2024-08-21 05:23:19 WARN SkyCompRep::peakToIntegralFlux() There are no image brightness units, assuming Jy/pixel |
21-Aug-2024 01:23:19 | 2024-08-21 05:23:19 WARN SkyCompRep::integralToPeakFlux() There are no image brightness units, assuming Jy/pixel |
21-Aug-2024 01:23:19 | 2024-08-21 05:23:20 WARN ImageFitter::_finishConstruction Unrecognized intensity unit . Will assume Jy/pixel |
21-Aug-2024 01:23:19 | 2024-08-21 05:23:20 WARN ImageFitter::clearNoiseFWHM noiseFWHM not specified and image has no beam, using uncorrelated noise expressions to calculate uncertainties |
21-Aug-2024 01:23:19 | 2024-08-21 05:23:20 WARN SkyCompRep::convertToJy Cannot convert units of brightness to Jy - will assume Jy |
21-Aug-2024 01:23:19 | 2024-08-21 05:23:20 WARN SkyCompRep::peakToIntegralFlux() There are no image brightness units, assuming Jy/pixel |
21-Aug-2024 01:23:19 | 2024-08-21 05:23:20 WARN SkyCompRep::integralToPeakFlux() There are no image brightness units, assuming Jy/pixel |
21-Aug-2024 01:23:20 | 2024-08-21 05:23:20 WARN ImageFitter::_finishConstruction Unrecognized intensity unit . Will assume Jy/pixel |
21-Aug-2024 01:23:20 | 2024-08-21 05:23:20 WARN ImageFitter::clearNoiseFWHM noiseFWHM not specified and image has no beam, using uncorrelated noise expressions to calculate uncertainties |
21-Aug-2024 01:23:20 | 2024-08-21 05:23:21 WARN SkyCompRep::convertToJy Cannot convert units of brightness to Jy - will assume Jy |
21-Aug-2024 01:23:20 | 2024-08-21 05:23:21 WARN SkyCompRep::peakToIntegralFlux() There are no image brightness units, assuming Jy/pixel |
21-Aug-2024 01:23:20 | 2024-08-21 05:23:21 WARN SkyCompRep::integralToPeakFlux() There are no image brightness units, assuming Jy/pixel |
21-Aug-2024 01:23:20 | 2024-08-21 05:23:21 WARN ImageFitter::_finishConstruction Unrecognized intensity unit . Will assume Jy/pixel |
21-Aug-2024 01:23:20 | 2024-08-21 05:23:21 WARN ImageFitter::clearNoiseFWHM noiseFWHM not specified and image has no beam, using uncorrelated noise expressions to calculate uncertainties |
21-Aug-2024 01:23:20 | 2024-08-21 05:23:21 WARN SkyCompRep::convertToJy Cannot convert units of brightness to Jy - will assume Jy |
21-Aug-2024 01:23:20 | 2024-08-21 05:23:21 WARN SkyCompRep::peakToIntegralFlux() There are no image brightness units, assuming Jy/pixel |
21-Aug-2024 01:23:21 | 2024-08-21 05:23:21 WARN SkyCompRep::integralToPeakFlux() There are no image brightness units, assuming Jy/pixel |
21-Aug-2024 01:23:21 | 2024-08-21 05:23:22 WARN ImageFitter::_finishConstruction Unrecognized intensity unit . Will assume Jy/pixel |
21-Aug-2024 01:23:21 | 2024-08-21 05:23:22 WARN ImageFitter::clearNoiseFWHM noiseFWHM not specified and image has no beam, using uncorrelated noise expressions to calculate uncertainties |
21-Aug-2024 01:23:22 | 2024-08-21 05:23:22 WARN SkyCompRep::convertToJy Cannot convert units of brightness to Jy - will assume Jy |
21-Aug-2024 01:23:22 | 2024-08-21 05:23:22 WARN SkyCompRep::peakToIntegralFlux() There are no image brightness units, assuming Jy/pixel |
21-Aug-2024 01:23:22 | 2024-08-21 05:23:22 WARN SkyCompRep::integralToPeakFlux() There are no image brightness units, assuming Jy/pixel |
21-Aug-2024 01:23:22 | 2024-08-21 05:23:22 WARN ImageFitter::_finishConstruction Unrecognized intensity unit . Will assume Jy/pixel |
21-Aug-2024 01:23:22 | 2024-08-21 05:23:22 WARN ImageFitter::clearNoiseFWHM noiseFWHM not specified and image has no beam, using uncorrelated noise expressions to calculate uncertainties |
21-Aug-2024 01:23:22 | 2024-08-21 05:23:22 WARN SkyCompRep::convertToJy Cannot convert units of brightness to Jy - will assume Jy |
21-Aug-2024 01:23:22 | 2024-08-21 05:23:22 WARN SkyCompRep::peakToIntegralFlux() There are no image brightness units, assuming Jy/pixel |
21-Aug-2024 01:23:22 | 2024-08-21 05:23:23 WARN SkyCompRep::integralToPeakFlux() There are no image brightness units, assuming Jy/pixel |
21-Aug-2024 01:23:22 | 2024-08-21 05:23:23 WARN ImageFitter::_finishConstruction Unrecognized intensity unit . Will assume Jy/pixel |
21-Aug-2024 01:23:22 | 2024-08-21 05:23:23 WARN ImageFitter::clearNoiseFWHM noiseFWHM not specified and image has no beam, using uncorrelated noise expressions to calculate uncertainties |
21-Aug-2024 01:23:22 | 2024-08-21 05:23:23 WARN SkyCompRep::convertToJy Cannot convert units of brightness to Jy - will assume Jy |
21-Aug-2024 01:23:22 | 2024-08-21 05:23:23 WARN SkyCompRep::peakToIntegralFlux() There are no image brightness units, assuming Jy/pixel |
21-Aug-2024 01:23:23 | 2024-08-21 05:23:23 WARN SkyCompRep::integralToPeakFlux() There are no image brightness units, assuming Jy/pixel |
21-Aug-2024 01:23:23 | 2024-08-21 05:23:23 WARN ImageFitter::_finishConstruction Unrecognized intensity unit . Will assume Jy/pixel |
21-Aug-2024 01:23:23 | 2024-08-21 05:23:23 WARN ImageFitter::clearNoiseFWHM noiseFWHM not specified and image has no beam, using uncorrelated noise expressions to calculate uncertainties |
21-Aug-2024 01:23:23 | 2024-08-21 05:23:24 WARN SkyCompRep::convertToJy Cannot convert units of brightness to Jy - will assume Jy |
21-Aug-2024 01:23:23 | 2024-08-21 05:23:24 WARN SkyCompRep::peakToIntegralFlux() There are no image brightness units, assuming Jy/pixel |
21-Aug-2024 01:23:23 | 2024-08-21 05:23:24 WARN SkyCompRep::integralToPeakFlux() There are no image brightness units, assuming Jy/pixel |
21-Aug-2024 01:23:23 | 2024-08-21 05:23:24 WARN ImageFitter::_finishConstruction Unrecognized intensity unit . Will assume Jy/pixel |
21-Aug-2024 01:23:23 | 2024-08-21 05:23:24 WARN ImageFitter::clearNoiseFWHM noiseFWHM not specified and image has no beam, using uncorrelated noise expressions to calculate uncertainties |
21-Aug-2024 01:23:23 | 2024-08-21 05:23:24 WARN SkyCompRep::convertToJy Cannot convert units of brightness to Jy - will assume Jy |
21-Aug-2024 01:23:23 | 2024-08-21 05:23:24 WARN SkyCompRep::peakToIntegralFlux() There are no image brightness units, assuming Jy/pixel |
21-Aug-2024 01:23:23 | 2024-08-21 05:23:24 WARN SkyCompRep::integralToPeakFlux() There are no image brightness units, assuming Jy/pixel |
21-Aug-2024 01:23:23 | 2024-08-21 05:23:24 WARN ImageFitter::_finishConstruction Unrecognized intensity unit . Will assume Jy/pixel |
21-Aug-2024 01:23:23 | 2024-08-21 05:23:24 WARN ImageFitter::clearNoiseFWHM noiseFWHM not specified and image has no beam, using uncorrelated noise expressions to calculate uncertainties |
21-Aug-2024 01:23:24 | 2024-08-21 05:23:24 WARN SkyCompRep::convertToJy Cannot convert units of brightness to Jy - will assume Jy |
21-Aug-2024 01:23:24 | 2024-08-21 05:23:24 WARN SkyCompRep::peakToIntegralFlux() There are no image brightness units, assuming Jy/pixel |
21-Aug-2024 01:23:24 | 2024-08-21 05:23:24 WARN SkyCompRep::integralToPeakFlux() There are no image brightness units, assuming Jy/pixel |
21-Aug-2024 01:23:24 | 2024-08-21 05:23:25 WARN ImageFitter::_finishConstruction Unrecognized intensity unit . Will assume Jy/pixel |
21-Aug-2024 01:23:24 | 2024-08-21 05:23:25 WARN ImageFitter::clearNoiseFWHM noiseFWHM not specified and image has no beam, using uncorrelated noise expressions to calculate uncertainties |
21-Aug-2024 01:23:24 | 2024-08-21 05:23:25 WARN SkyCompRep::convertToJy Cannot convert units of brightness to Jy - will assume Jy |
21-Aug-2024 01:23:24 | 2024-08-21 05:23:25 WARN SkyCompRep::peakToIntegralFlux() There are no image brightness units, assuming Jy/pixel |
21-Aug-2024 01:23:24 | 2024-08-21 05:23:25 WARN SkyCompRep::integralToPeakFlux() There are no image brightness units, assuming Jy/pixel |
21-Aug-2024 01:23:25 | 2024-08-21 05:23:25 WARN ImageFitter::_finishConstruction Unrecognized intensity unit . Will assume Jy/pixel |
21-Aug-2024 01:23:25 | 2024-08-21 05:23:25 WARN ImageFitter::clearNoiseFWHM noiseFWHM not specified and image has no beam, using uncorrelated noise expressions to calculate uncertainties |
21-Aug-2024 01:23:25 | 2024-08-21 05:23:25 WARN SkyCompRep::convertToJy Cannot convert units of brightness to Jy - will assume Jy |
21-Aug-2024 01:23:25 | 2024-08-21 05:23:25 WARN SkyCompRep::peakToIntegralFlux() There are no image brightness units, assuming Jy/pixel |
21-Aug-2024 01:23:25 | 2024-08-21 05:23:25 WARN SkyCompRep::integralToPeakFlux() There are no image brightness units, assuming Jy/pixel |
21-Aug-2024 01:23:25 | 2024-08-21 05:23:25 WARN ImageFitter::_finishConstruction Unrecognized intensity unit . Will assume Jy/pixel |
21-Aug-2024 01:23:25 | 2024-08-21 05:23:25 WARN ImageFitter::clearNoiseFWHM noiseFWHM not specified and image has no beam, using uncorrelated noise expressions to calculate uncertainties |
21-Aug-2024 01:23:25 | 2024-08-21 05:23:25 WARN SkyCompRep::convertToJy Cannot convert units of brightness to Jy - will assume Jy |
21-Aug-2024 01:23:25 | 2024-08-21 05:23:25 WARN SkyCompRep::peakToIntegralFlux() There are no image brightness units, assuming Jy/pixel |
21-Aug-2024 01:23:25 | 2024-08-21 05:23:26 WARN SkyCompRep::integralToPeakFlux() There are no image brightness units, assuming Jy/pixel |
21-Aug-2024 01:23:26 | 2024-08-21 05:23:26 WARN ImageFitter::_finishConstruction Unrecognized intensity unit . Will assume Jy/pixel |
21-Aug-2024 01:23:26 | 2024-08-21 05:23:26 WARN ImageFitter::clearNoiseFWHM noiseFWHM not specified and image has no beam, using uncorrelated noise expressions to calculate uncertainties |
21-Aug-2024 01:23:26 | 2024-08-21 05:23:27 WARN SkyCompRep::convertToJy Cannot convert units of brightness to Jy - will assume Jy |
21-Aug-2024 01:23:26 | 2024-08-21 05:23:27 WARN SkyCompRep::peakToIntegralFlux() There are no image brightness units, assuming Jy/pixel |
21-Aug-2024 01:23:26 | 2024-08-21 05:23:27 WARN SkyCompRep::integralToPeakFlux() There are no image brightness units, assuming Jy/pixel |
21-Aug-2024 01:23:26 | 2024-08-21 05:23:27 WARN ImageFitter::_finishConstruction Unrecognized intensity unit . Will assume Jy/pixel |
21-Aug-2024 01:23:26 | 2024-08-21 05:23:27 WARN ImageFitter::clearNoiseFWHM noiseFWHM not specified and image has no beam, using uncorrelated noise expressions to calculate uncertainties |
21-Aug-2024 01:23:27 | 2024-08-21 05:23:27 WARN SkyCompRep::convertToJy Cannot convert units of brightness to Jy - will assume Jy |
21-Aug-2024 01:23:27 | 2024-08-21 05:23:27 WARN SkyCompRep::peakToIntegralFlux() There are no image brightness units, assuming Jy/pixel |
21-Aug-2024 01:23:27 | 2024-08-21 05:23:27 WARN SkyCompRep::integralToPeakFlux() There are no image brightness units, assuming Jy/pixel |
21-Aug-2024 01:23:27 | 2024-08-21 05:23:27 WARN ImageFitter::_finishConstruction Unrecognized intensity unit . Will assume Jy/pixel |
21-Aug-2024 01:23:27 | 2024-08-21 05:23:27 WARN ImageFitter::clearNoiseFWHM noiseFWHM not specified and image has no beam, using uncorrelated noise expressions to calculate uncertainties |
21-Aug-2024 01:23:27 | 2024-08-21 05:23:27 WARN SkyCompRep::convertToJy Cannot convert units of brightness to Jy - will assume Jy |
21-Aug-2024 01:23:27 | 2024-08-21 05:23:27 WARN SkyCompRep::peakToIntegralFlux() There are no image brightness units, assuming Jy/pixel |
21-Aug-2024 01:23:27 | 2024-08-21 05:23:28 WARN SkyCompRep::integralToPeakFlux() There are no image brightness units, assuming Jy/pixel |
21-Aug-2024 01:23:28 | 2024-08-21 05:23:28 WARN ImageFitter::_finishConstruction Unrecognized intensity unit . Will assume Jy/pixel |
21-Aug-2024 01:23:28 | 2024-08-21 05:23:28 WARN ImageFitter::clearNoiseFWHM noiseFWHM not specified and image has no beam, using uncorrelated noise expressions to calculate uncertainties |
21-Aug-2024 01:23:28 | 2024-08-21 05:23:29 WARN SkyCompRep::convertToJy Cannot convert units of brightness to Jy - will assume Jy |
21-Aug-2024 01:23:28 | 2024-08-21 05:23:29 WARN SkyCompRep::peakToIntegralFlux() There are no image brightness units, assuming Jy/pixel |
21-Aug-2024 01:23:28 | 2024-08-21 05:23:29 WARN SkyCompRep::integralToPeakFlux() There are no image brightness units, assuming Jy/pixel |
21-Aug-2024 01:23:28 | 2024-08-21 05:23:29 WARN ImageFitter::_finishConstruction Unrecognized intensity unit . Will assume Jy/pixel |
21-Aug-2024 01:23:28 | 2024-08-21 05:23:29 WARN ImageFitter::clearNoiseFWHM noiseFWHM not specified and image has no beam, using uncorrelated noise expressions to calculate uncertainties |
21-Aug-2024 01:23:28 | 2024-08-21 05:23:29 WARN SkyCompRep::convertToJy Cannot convert units of brightness to Jy - will assume Jy |
21-Aug-2024 01:23:28 | 2024-08-21 05:23:29 WARN SkyCompRep::peakToIntegralFlux() There are no image brightness units, assuming Jy/pixel |
21-Aug-2024 01:23:28 | 2024-08-21 05:23:29 WARN SkyCompRep::integralToPeakFlux() There are no image brightness units, assuming Jy/pixel |
21-Aug-2024 01:23:28 | 2024-08-21 05:23:29 WARN ImageFitter::_finishConstruction Unrecognized intensity unit . Will assume Jy/pixel |
21-Aug-2024 01:23:28 | 2024-08-21 05:23:29 WARN ImageFitter::clearNoiseFWHM noiseFWHM not specified and image has no beam, using uncorrelated noise expressions to calculate uncertainties |
21-Aug-2024 01:23:29 | 2024-08-21 05:23:29 WARN SkyCompRep::convertToJy Cannot convert units of brightness to Jy - will assume Jy |
21-Aug-2024 01:23:29 | 2024-08-21 05:23:29 WARN SkyCompRep::peakToIntegralFlux() There are no image brightness units, assuming Jy/pixel |
21-Aug-2024 01:23:29 | 2024-08-21 05:23:29 WARN SkyCompRep::integralToPeakFlux() There are no image brightness units, assuming Jy/pixel |
21-Aug-2024 01:23:29 | 2024-08-21 05:23:30 WARN ImageFitter::_finishConstruction Unrecognized intensity unit . Will assume Jy/pixel |
21-Aug-2024 01:23:29 | 2024-08-21 05:23:30 WARN ImageFitter::clearNoiseFWHM noiseFWHM not specified and image has no beam, using uncorrelated noise expressions to calculate uncertainties |
21-Aug-2024 01:23:29 | 2024-08-21 05:23:30 WARN SkyCompRep::convertToJy Cannot convert units of brightness to Jy - will assume Jy |
21-Aug-2024 01:23:29 | 2024-08-21 05:23:30 WARN SkyCompRep::peakToIntegralFlux() There are no image brightness units, assuming Jy/pixel |
21-Aug-2024 01:23:29 | 2024-08-21 05:23:30 WARN SkyCompRep::integralToPeakFlux() There are no image brightness units, assuming Jy/pixel |
21-Aug-2024 01:23:30 | 2024-08-21 05:23:30 WARN ImageFitter::_finishConstruction Unrecognized intensity unit . Will assume Jy/pixel |
21-Aug-2024 01:23:30 | 2024-08-21 05:23:30 WARN ImageFitter::clearNoiseFWHM noiseFWHM not specified and image has no beam, using uncorrelated noise expressions to calculate uncertainties |
21-Aug-2024 01:23:30 | 2024-08-21 05:23:30 WARN SkyCompRep::convertToJy Cannot convert units of brightness to Jy - will assume Jy |
21-Aug-2024 01:23:30 | 2024-08-21 05:23:30 WARN SkyCompRep::peakToIntegralFlux() There are no image brightness units, assuming Jy/pixel |
21-Aug-2024 01:23:30 | 2024-08-21 05:23:30 WARN SkyCompRep::integralToPeakFlux() There are no image brightness units, assuming Jy/pixel |
21-Aug-2024 01:23:30 | 2024-08-21 05:23:30 WARN ImageFitter::_finishConstruction Unrecognized intensity unit . Will assume Jy/pixel |
21-Aug-2024 01:23:30 | 2024-08-21 05:23:30 WARN ImageFitter::clearNoiseFWHM noiseFWHM not specified and image has no beam, using uncorrelated noise expressions to calculate uncertainties |
21-Aug-2024 01:23:30 | 2024-08-21 05:23:30 WARN SkyCompRep::convertToJy Cannot convert units of brightness to Jy - will assume Jy |
21-Aug-2024 01:23:30 | 2024-08-21 05:23:30 WARN SkyCompRep::peakToIntegralFlux() There are no image brightness units, assuming Jy/pixel |
21-Aug-2024 01:23:30 | 2024-08-21 05:23:31 WARN SkyCompRep::integralToPeakFlux() There are no image brightness units, assuming Jy/pixel |
21-Aug-2024 01:23:30 | 2024-08-21 05:23:31 WARN ImageFitter::_finishConstruction Unrecognized intensity unit . Will assume Jy/pixel |
21-Aug-2024 01:23:30 | 2024-08-21 05:23:31 WARN ImageFitter::clearNoiseFWHM noiseFWHM not specified and image has no beam, using uncorrelated noise expressions to calculate uncertainties |
21-Aug-2024 01:23:31 | 2024-08-21 05:23:31 WARN SkyCompRep::convertToJy Cannot convert units of brightness to Jy - will assume Jy |
21-Aug-2024 01:23:31 | 2024-08-21 05:23:31 WARN SkyCompRep::peakToIntegralFlux() There are no image brightness units, assuming Jy/pixel |
21-Aug-2024 01:23:31 | 2024-08-21 05:23:31 WARN SkyCompRep::integralToPeakFlux() There are no image brightness units, assuming Jy/pixel |
21-Aug-2024 01:23:31 | 2024-08-21 05:23:31 WARN ImageFitter::_finishConstruction Unrecognized intensity unit . Will assume Jy/pixel |
21-Aug-2024 01:23:31 | 2024-08-21 05:23:31 WARN ImageFitter::clearNoiseFWHM noiseFWHM not specified and image has no beam, using uncorrelated noise expressions to calculate uncertainties |
21-Aug-2024 01:23:31 | 2024-08-21 05:23:31 WARN SkyCompRep::convertToJy Cannot convert units of brightness to Jy - will assume Jy |
21-Aug-2024 01:23:31 | 2024-08-21 05:23:31 WARN SkyCompRep::peakToIntegralFlux() There are no image brightness units, assuming Jy/pixel |
21-Aug-2024 01:23:31 | 2024-08-21 05:23:31 WARN SkyCompRep::integralToPeakFlux() There are no image brightness units, assuming Jy/pixel |
21-Aug-2024 01:23:31 | 2024-08-21 05:23:31 WARN ImageFitter::_finishConstruction Unrecognized intensity unit . Will assume Jy/pixel |
21-Aug-2024 01:23:31 | 2024-08-21 05:23:31 WARN ImageFitter::clearNoiseFWHM noiseFWHM not specified and image has no beam, using uncorrelated noise expressions to calculate uncertainties |
21-Aug-2024 01:23:31 | 2024-08-21 05:23:32 WARN SkyCompRep::convertToJy Cannot convert units of brightness to Jy - will assume Jy |
21-Aug-2024 01:23:31 | 2024-08-21 05:23:32 WARN SkyCompRep::peakToIntegralFlux() There are no image brightness units, assuming Jy/pixel |
21-Aug-2024 01:23:32 | 2024-08-21 05:23:32 WARN SkyCompRep::integralToPeakFlux() There are no image brightness units, assuming Jy/pixel |
21-Aug-2024 01:23:32 | 2024-08-21 05:23:32 WARN ImageFitter::_finishConstruction Unrecognized intensity unit . Will assume Jy/pixel |
21-Aug-2024 01:23:32 | 2024-08-21 05:23:32 WARN ImageFitter::clearNoiseFWHM noiseFWHM not specified and image has no beam, using uncorrelated noise expressions to calculate uncertainties |
21-Aug-2024 01:23:32 | 2024-08-21 05:23:32 WARN SkyCompRep::convertToJy Cannot convert units of brightness to Jy - will assume Jy |
21-Aug-2024 01:23:32 | 2024-08-21 05:23:32 WARN SkyCompRep::peakToIntegralFlux() There are no image brightness units, assuming Jy/pixel |
21-Aug-2024 01:23:32 | 2024-08-21 05:23:32 WARN SkyCompRep::integralToPeakFlux() There are no image brightness units, assuming Jy/pixel |
21-Aug-2024 01:23:32 | 2024-08-21 05:23:33 WARN ImageFitter::_finishConstruction Unrecognized intensity unit . Will assume Jy/pixel |
21-Aug-2024 01:23:32 | 2024-08-21 05:23:33 WARN ImageFitter::clearNoiseFWHM noiseFWHM not specified and image has no beam, using uncorrelated noise expressions to calculate uncertainties |
21-Aug-2024 01:23:32 | 2024-08-21 05:23:33 WARN SkyCompRep::convertToJy Cannot convert units of brightness to Jy - will assume Jy |
21-Aug-2024 01:23:32 | 2024-08-21 05:23:33 WARN SkyCompRep::peakToIntegralFlux() There are no image brightness units, assuming Jy/pixel |
21-Aug-2024 01:23:32 | 2024-08-21 05:23:33 WARN SkyCompRep::integralToPeakFlux() There are no image brightness units, assuming Jy/pixel |
21-Aug-2024 01:23:32 | 2024-08-21 05:23:33 WARN ImageFitter::_finishConstruction Unrecognized intensity unit . Will assume Jy/pixel |
21-Aug-2024 01:23:32 | 2024-08-21 05:23:33 WARN ImageFitter::clearNoiseFWHM noiseFWHM not specified and image has no beam, using uncorrelated noise expressions to calculate uncertainties |
21-Aug-2024 01:23:33 | 2024-08-21 05:23:33 WARN SkyCompRep::convertToJy Cannot convert units of brightness to Jy - will assume Jy |
21-Aug-2024 01:23:33 | 2024-08-21 05:23:33 WARN SkyCompRep::peakToIntegralFlux() There are no image brightness units, assuming Jy/pixel |
21-Aug-2024 01:23:33 | 2024-08-21 05:23:34 WARN SkyCompRep::integralToPeakFlux() There are no image brightness units, assuming Jy/pixel |
21-Aug-2024 01:23:33 | 2024-08-21 05:23:34 WARN ImageFitter::_finishConstruction Unrecognized intensity unit . Will assume Jy/pixel |
21-Aug-2024 01:23:33 | 2024-08-21 05:23:34 WARN ImageFitter::clearNoiseFWHM noiseFWHM not specified and image has no beam, using uncorrelated noise expressions to calculate uncertainties |
21-Aug-2024 01:23:34 | 2024-08-21 05:23:34 WARN SkyCompRep::convertToJy Cannot convert units of brightness to Jy - will assume Jy |
21-Aug-2024 01:23:34 | 2024-08-21 05:23:34 WARN SkyCompRep::peakToIntegralFlux() There are no image brightness units, assuming Jy/pixel |
21-Aug-2024 01:23:34 | 2024-08-21 05:23:34 WARN SkyCompRep::integralToPeakFlux() There are no image brightness units, assuming Jy/pixel |
21-Aug-2024 01:23:34 | 2024-08-21 05:23:34 WARN ImageFitter::_finishConstruction Unrecognized intensity unit . Will assume Jy/pixel |
21-Aug-2024 01:23:34 | 2024-08-21 05:23:34 WARN ImageFitter::clearNoiseFWHM noiseFWHM not specified and image has no beam, using uncorrelated noise expressions to calculate uncertainties |
21-Aug-2024 01:23:34 | 2024-08-21 05:23:35 WARN SkyCompRep::convertToJy Cannot convert units of brightness to Jy - will assume Jy |
21-Aug-2024 01:23:34 | 2024-08-21 05:23:35 WARN SkyCompRep::peakToIntegralFlux() There are no image brightness units, assuming Jy/pixel |
21-Aug-2024 01:23:34 | 2024-08-21 05:23:35 WARN SkyCompRep::integralToPeakFlux() There are no image brightness units, assuming Jy/pixel |
21-Aug-2024 01:23:34 | 2024-08-21 05:23:35 WARN ImageFitter::_finishConstruction Unrecognized intensity unit . Will assume Jy/pixel |
21-Aug-2024 01:23:34 | 2024-08-21 05:23:35 WARN ImageFitter::clearNoiseFWHM noiseFWHM not specified and image has no beam, using uncorrelated noise expressions to calculate uncertainties |
21-Aug-2024 01:23:34 | 2024-08-21 05:23:35 WARN SkyCompRep::convertToJy Cannot convert units of brightness to Jy - will assume Jy |
21-Aug-2024 01:23:34 | 2024-08-21 05:23:35 WARN SkyCompRep::peakToIntegralFlux() There are no image brightness units, assuming Jy/pixel |
21-Aug-2024 01:23:35 | 2024-08-21 05:23:35 WARN SkyCompRep::integralToPeakFlux() There are no image brightness units, assuming Jy/pixel |
21-Aug-2024 01:23:35 | 2024-08-21 05:23:36 WARN ImageFitter::_finishConstruction Unrecognized intensity unit . Will assume Jy/pixel |
21-Aug-2024 01:23:35 | 2024-08-21 05:23:36 WARN ImageFitter::clearNoiseFWHM noiseFWHM not specified and image has no beam, using uncorrelated noise expressions to calculate uncertainties |
21-Aug-2024 01:23:35 | 2024-08-21 05:23:36 WARN SkyCompRep::convertToJy Cannot convert units of brightness to Jy - will assume Jy |
21-Aug-2024 01:23:35 | 2024-08-21 05:23:36 WARN SkyCompRep::peakToIntegralFlux() There are no image brightness units, assuming Jy/pixel |
21-Aug-2024 01:23:35 | 2024-08-21 05:23:36 WARN SkyCompRep::integralToPeakFlux() There are no image brightness units, assuming Jy/pixel |
21-Aug-2024 01:23:36 | 2024-08-21 05:23:36 WARN ImageFitter::_finishConstruction Unrecognized intensity unit . Will assume Jy/pixel |
21-Aug-2024 01:23:36 | 2024-08-21 05:23:36 WARN ImageFitter::clearNoiseFWHM noiseFWHM not specified and image has no beam, using uncorrelated noise expressions to calculate uncertainties |
21-Aug-2024 01:23:36 | 2024-08-21 05:23:36 WARN SkyCompRep::convertToJy Cannot convert units of brightness to Jy - will assume Jy |
21-Aug-2024 01:23:36 | 2024-08-21 05:23:36 WARN SkyCompRep::peakToIntegralFlux() There are no image brightness units, assuming Jy/pixel |
21-Aug-2024 01:23:36 | 2024-08-21 05:23:36 WARN SkyCompRep::integralToPeakFlux() There are no image brightness units, assuming Jy/pixel |
21-Aug-2024 01:23:36 | 2024-08-21 05:23:36 WARN ImageFitter::_finishConstruction Unrecognized intensity unit . Will assume Jy/pixel |
21-Aug-2024 01:23:36 | 2024-08-21 05:23:36 WARN ImageFitter::clearNoiseFWHM noiseFWHM not specified and image has no beam, using uncorrelated noise expressions to calculate uncertainties |
21-Aug-2024 01:23:36 | 2024-08-21 05:23:37 WARN SkyCompRep::convertToJy Cannot convert units of brightness to Jy - will assume Jy |
21-Aug-2024 01:23:36 | 2024-08-21 05:23:37 WARN SkyCompRep::peakToIntegralFlux() There are no image brightness units, assuming Jy/pixel |
21-Aug-2024 01:23:37 | 2024-08-21 05:23:37 WARN SkyCompRep::integralToPeakFlux() There are no image brightness units, assuming Jy/pixel |
21-Aug-2024 01:23:37 | 2024-08-21 05:23:38 WARN ImageFitter::_finishConstruction Unrecognized intensity unit . Will assume Jy/pixel |
21-Aug-2024 01:23:37 | 2024-08-21 05:23:38 WARN ImageFitter::clearNoiseFWHM noiseFWHM not specified and image has no beam, using uncorrelated noise expressions to calculate uncertainties |
21-Aug-2024 01:23:37 | 2024-08-21 05:23:38 WARN SkyCompRep::convertToJy Cannot convert units of brightness to Jy - will assume Jy |
21-Aug-2024 01:23:37 | 2024-08-21 05:23:38 WARN SkyCompRep::peakToIntegralFlux() There are no image brightness units, assuming Jy/pixel |
21-Aug-2024 01:23:37 | 2024-08-21 05:23:38 WARN SkyCompRep::integralToPeakFlux() There are no image brightness units, assuming Jy/pixel |
21-Aug-2024 01:23:38 | 2024-08-21 05:23:38 WARN ImageFitter::_finishConstruction Unrecognized intensity unit . Will assume Jy/pixel |
21-Aug-2024 01:23:38 | 2024-08-21 05:23:38 WARN ImageFitter::clearNoiseFWHM noiseFWHM not specified and image has no beam, using uncorrelated noise expressions to calculate uncertainties |
21-Aug-2024 01:23:38 | 2024-08-21 05:23:38 WARN SkyCompRep::convertToJy Cannot convert units of brightness to Jy - will assume Jy |
21-Aug-2024 01:23:38 | 2024-08-21 05:23:38 WARN SkyCompRep::peakToIntegralFlux() There are no image brightness units, assuming Jy/pixel |
21-Aug-2024 01:23:38 | 2024-08-21 05:23:38 WARN SkyCompRep::integralToPeakFlux() There are no image brightness units, assuming Jy/pixel |
21-Aug-2024 01:23:38 | 2024-08-21 05:23:38 WARN ImageFitter::_finishConstruction Unrecognized intensity unit . Will assume Jy/pixel |
21-Aug-2024 01:23:38 | 2024-08-21 05:23:38 WARN ImageFitter::clearNoiseFWHM noiseFWHM not specified and image has no beam, using uncorrelated noise expressions to calculate uncertainties |
21-Aug-2024 01:23:38 | 2024-08-21 05:23:38 WARN SkyCompRep::convertToJy Cannot convert units of brightness to Jy - will assume Jy |
21-Aug-2024 01:23:38 | 2024-08-21 05:23:38 WARN SkyCompRep::peakToIntegralFlux() There are no image brightness units, assuming Jy/pixel |
21-Aug-2024 01:23:38 | 2024-08-21 05:23:39 WARN SkyCompRep::integralToPeakFlux() There are no image brightness units, assuming Jy/pixel |
21-Aug-2024 01:23:39 | 2024-08-21 05:23:39 WARN ImageFitter::_finishConstruction Unrecognized intensity unit . Will assume Jy/pixel |
21-Aug-2024 01:23:39 | 2024-08-21 05:23:39 WARN ImageFitter::clearNoiseFWHM noiseFWHM not specified and image has no beam, using uncorrelated noise expressions to calculate uncertainties |
21-Aug-2024 01:23:39 | 2024-08-21 05:23:40 WARN SkyCompRep::convertToJy Cannot convert units of brightness to Jy - will assume Jy |
21-Aug-2024 01:23:39 | 2024-08-21 05:23:40 WARN SkyCompRep::peakToIntegralFlux() There are no image brightness units, assuming Jy/pixel |
21-Aug-2024 01:23:39 | 2024-08-21 05:23:40 WARN SkyCompRep::integralToPeakFlux() There are no image brightness units, assuming Jy/pixel |
21-Aug-2024 01:23:39 | 2024-08-21 05:23:40 WARN ImageFitter::_finishConstruction Unrecognized intensity unit . Will assume Jy/pixel |
21-Aug-2024 01:23:39 | 2024-08-21 05:23:40 WARN ImageFitter::clearNoiseFWHM noiseFWHM not specified and image has no beam, using uncorrelated noise expressions to calculate uncertainties |
21-Aug-2024 01:23:39 | 2024-08-21 05:23:40 WARN SkyCompRep::convertToJy Cannot convert units of brightness to Jy - will assume Jy |
21-Aug-2024 01:23:39 | 2024-08-21 05:23:40 WARN SkyCompRep::peakToIntegralFlux() There are no image brightness units, assuming Jy/pixel |
21-Aug-2024 01:23:39 | 2024-08-21 05:23:40 WARN SkyCompRep::integralToPeakFlux() There are no image brightness units, assuming Jy/pixel |
21-Aug-2024 01:23:39 | 2024-08-21 05:23:40 WARN ImageFitter::_finishConstruction Unrecognized intensity unit . Will assume Jy/pixel |
21-Aug-2024 01:23:39 | 2024-08-21 05:23:40 WARN ImageFitter::clearNoiseFWHM noiseFWHM not specified and image has no beam, using uncorrelated noise expressions to calculate uncertainties |
21-Aug-2024 01:23:40 | 2024-08-21 05:23:40 WARN SkyCompRep::convertToJy Cannot convert units of brightness to Jy - will assume Jy |
21-Aug-2024 01:23:40 | 2024-08-21 05:23:40 WARN SkyCompRep::peakToIntegralFlux() There are no image brightness units, assuming Jy/pixel |
21-Aug-2024 01:23:40 | 2024-08-21 05:23:41 WARN SkyCompRep::integralToPeakFlux() There are no image brightness units, assuming Jy/pixel |
21-Aug-2024 01:23:41 | 2024-08-21 05:23:41 WARN ImageFitter::_finishConstruction Unrecognized intensity unit . Will assume Jy/pixel |
21-Aug-2024 01:23:41 | 2024-08-21 05:23:41 WARN ImageFitter::clearNoiseFWHM noiseFWHM not specified and image has no beam, using uncorrelated noise expressions to calculate uncertainties |
21-Aug-2024 01:23:41 | 2024-08-21 05:23:41 WARN SkyCompRep::convertToJy Cannot convert units of brightness to Jy - will assume Jy |
21-Aug-2024 01:23:41 | 2024-08-21 05:23:41 WARN SkyCompRep::peakToIntegralFlux() There are no image brightness units, assuming Jy/pixel |
21-Aug-2024 01:23:41 | 2024-08-21 05:23:41 WARN SkyCompRep::integralToPeakFlux() There are no image brightness units, assuming Jy/pixel |
21-Aug-2024 01:23:41 | 2024-08-21 05:23:42 WARN ImageFitter::_finishConstruction Unrecognized intensity unit . Will assume Jy/pixel |
21-Aug-2024 01:23:41 | 2024-08-21 05:23:42 WARN ImageFitter::clearNoiseFWHM noiseFWHM not specified and image has no beam, using uncorrelated noise expressions to calculate uncertainties |
21-Aug-2024 01:23:41 | 2024-08-21 05:23:42 WARN SkyCompRep::convertToJy Cannot convert units of brightness to Jy - will assume Jy |
21-Aug-2024 01:23:41 | 2024-08-21 05:23:42 WARN SkyCompRep::peakToIntegralFlux() There are no image brightness units, assuming Jy/pixel |
21-Aug-2024 01:23:41 | 2024-08-21 05:23:42 WARN SkyCompRep::integralToPeakFlux() There are no image brightness units, assuming Jy/pixel |
21-Aug-2024 01:23:41 | 2024-08-21 05:23:42 WARN ImageFitter::_finishConstruction Unrecognized intensity unit . Will assume Jy/pixel |
21-Aug-2024 01:23:41 | 2024-08-21 05:23:42 WARN ImageFitter::clearNoiseFWHM noiseFWHM not specified and image has no beam, using uncorrelated noise expressions to calculate uncertainties |
21-Aug-2024 01:23:41 | 2024-08-21 05:23:42 WARN SkyCompRep::convertToJy Cannot convert units of brightness to Jy - will assume Jy |
21-Aug-2024 01:23:41 | 2024-08-21 05:23:42 WARN SkyCompRep::peakToIntegralFlux() There are no image brightness units, assuming Jy/pixel |
21-Aug-2024 01:23:42 | 2024-08-21 05:23:42 WARN SkyCompRep::integralToPeakFlux() There are no image brightness units, assuming Jy/pixel |
21-Aug-2024 01:23:42 | 2024-08-21 05:23:43 WARN ImageFitter::_finishConstruction Unrecognized intensity unit . Will assume Jy/pixel |
21-Aug-2024 01:23:42 | 2024-08-21 05:23:43 WARN ImageFitter::clearNoiseFWHM noiseFWHM not specified and image has no beam, using uncorrelated noise expressions to calculate uncertainties |
21-Aug-2024 01:23:42 | 2024-08-21 05:23:43 WARN SkyCompRep::convertToJy Cannot convert units of brightness to Jy - will assume Jy |
21-Aug-2024 01:23:42 | 2024-08-21 05:23:43 WARN SkyCompRep::peakToIntegralFlux() There are no image brightness units, assuming Jy/pixel |
21-Aug-2024 01:23:42 | 2024-08-21 05:23:43 WARN SkyCompRep::integralToPeakFlux() There are no image brightness units, assuming Jy/pixel |
21-Aug-2024 01:23:42 | |
21-Aug-2024 01:23:42 | Test that regridding to new refcode preserves source positions |
21-Aug-2024 01:23:42 | diff [0.] |
21-Aug-2024 01:23:42 | diff [0.] |
21-Aug-2024 01:23:42 | diff [0.] |
21-Aug-2024 01:23:42 | diff [0.] |
21-Aug-2024 01:23:42 | diff [0.] |
21-Aug-2024 01:23:42 | diff [0.] |
21-Aug-2024 01:23:42 | diff [0.] |
21-Aug-2024 01:23:42 | diff [0.] |
21-Aug-2024 01:23:42 | diff [0.] |
21-Aug-2024 01:23:42 | diff [0.] |
21-Aug-2024 01:23:42 | diff [0.] |
21-Aug-2024 01:23:42 | diff [0.] |
21-Aug-2024 01:23:42 | diff [0.] |
21-Aug-2024 01:23:42 | diff [0.] |
21-Aug-2024 01:23:42 | diff [0.] |
21-Aug-2024 01:23:42 | diff [0.] |
21-Aug-2024 01:23:42 | diff [0.] |
21-Aug-2024 01:23:42 | diff [0.] |
21-Aug-2024 01:23:42 | diff [0.] |
21-Aug-2024 01:23:42 | diff [0.] |
21-Aug-2024 01:23:42 | diff [0.] |
21-Aug-2024 01:23:42 | diff [0.] |
21-Aug-2024 01:23:42 | diff [0.] |
21-Aug-2024 01:23:42 | diff [0.] |
21-Aug-2024 01:23:42 | diff [0.] |
21-Aug-2024 01:23:42 | diff [0.] |
21-Aug-2024 01:23:42 | diff [0.] |
21-Aug-2024 01:23:42 | diff [0.] |
21-Aug-2024 01:23:42 | diff [0.] |
21-Aug-2024 01:23:42 | diff [0.] |
21-Aug-2024 01:23:42 | diff [0.] |
21-Aug-2024 01:23:42 | diff [0.] |
21-Aug-2024 01:23:42 | diff [0.] |
21-Aug-2024 01:23:42 | diff [0.] |
21-Aug-2024 01:23:42 | diff [0.] |
21-Aug-2024 01:23:42 | diff [0.] |
21-Aug-2024 01:23:42 | diff [0.] |
21-Aug-2024 01:23:42 | diff [0.] |
21-Aug-2024 01:23:42 | diff [0.] |
21-Aug-2024 01:23:42 | diff [0.] |
21-Aug-2024 01:23:42 | diff [0.] |
21-Aug-2024 01:23:42 | diff [0.] |
21-Aug-2024 01:23:42 | diff [0.] |
21-Aug-2024 01:23:42 | diff [0.] |
21-Aug-2024 01:23:42 | diff [0.] |
21-Aug-2024 01:23:42 | diff [0.] |
21-Aug-2024 01:23:42 | diff [0.] |
21-Aug-2024 01:23:42 | diff [0.] |
21-Aug-2024 01:23:42 | diff [0.] |
21-Aug-2024 01:23:42 | diff [0.] |
21-Aug-2024 01:23:42 | diff [0.] |
21-Aug-2024 01:23:42 | diff [0.] |
21-Aug-2024 01:23:42 | diff [0.] |
21-Aug-2024 01:23:42 | diff [0.] |
21-Aug-2024 01:23:42 | diff [0.] |
21-Aug-2024 01:23:42 | PASSED |
21-Aug-2024 01:23:42 | |
21-Aug-2024 01:23:43 | test_task_imregrid.py::imregrid_test::test_template_stokes_length_and_input_stokes_length_gt_1 2024-08-21 05:23:43 WARN imregrid::ImageRegridder::_doImagesOverlap At least one of the images exceeds one degree on at one side, not checking for direction plane overlap. |
21-Aug-2024 01:23:43 | |
21-Aug-2024 01:23:43 | PASSED |
21-Aug-2024 01:23:43 | |
21-Aug-2024 01:23:43 | test_task_imregrid.py::imregrid_test::test_template_stokes_length_gt_1_and_input_stokes_length_gt_0 2024-08-21 05:23:44 SEVERE imregrid::image::regrid Exception Reported: Exception: Input image and template coordinate system have no common stokes.. |
21-Aug-2024 01:23:43 | 2024-08-21 05:23:44 SEVERE imregrid::image::regrid+ ... thrown by void casa::ImageRegridderBase<T>::_finishConstruction() [with T = float] at File: /source/casainstall/include/casacpp/imageanalysis/ImageAnalysis/ImageRegridderBase.tcc, line: 138 |
21-Aug-2024 01:23:43 | 2024-08-21 05:23:44 SEVERE imregrid::::casa Task imregrid raised an exception of class RuntimeError with the following message: Exception: Input image and template coordinate system have no common stokes.. |
21-Aug-2024 01:23:43 | 2024-08-21 05:23:44 SEVERE imregrid::::casa+ ... thrown by void casa::ImageRegridderBase<T>::_finishConstruction() [with T = float] at File: /source/casainstall/include/casacpp/imageanalysis/ImageAnalysis/ImageRegridderBase.tcc, line: 138 |
21-Aug-2024 01:23:43 | 2024-08-21 05:23:44 SEVERE imregrid::image::regrid Exception Reported: Exception: Specified output stokes axis length (3) does not match the number of common stokes (1) in the input image and template coordinate system.. |
21-Aug-2024 01:23:43 | 2024-08-21 05:23:44 SEVERE imregrid::image::regrid+ ... thrown by void casa::ImageRegridderBase<T>::_finishConstruction() [with T = float] at File: /source/casainstall/include/casacpp/imageanalysis/ImageAnalysis/ImageRegridderBase.tcc, line: 143 |
21-Aug-2024 01:23:43 | 2024-08-21 05:23:44 SEVERE imregrid::::casa Task imregrid raised an exception of class RuntimeError with the following message: Exception: Specified output stokes axis length (3) does not match the number of common stokes (1) in the input image and template coordinate system.. |
21-Aug-2024 01:23:43 | 2024-08-21 05:23:44 SEVERE imregrid::::casa+ ... thrown by void casa::ImageRegridderBase<T>::_finishConstruction() [with T = float] at File: /source/casainstall/include/casacpp/imageanalysis/ImageAnalysis/ImageRegridderBase.tcc, line: 143 |
21-Aug-2024 01:23:44 | |
21-Aug-2024 01:23:44 | Verify correct behavior for the template image having a stokes axis of length > 1 |
21-Aug-2024 01:23:44 | PASSED |
21-Aug-2024 01:23:44 | |
21-Aug-2024 01:23:44 | - generated xml file: /home/casatest/casa6/casatestutils/nosedir/xml/test_task_imregrid/nose.xml - |
21-Aug-2024 01:23:44 | ================== 20 passed, 1 warning in 106.62s (0:01:46) =================== |
21-Aug-2024 01:23:44 | ============================= test session starts ============================== |
21-Aug-2024 01:23:44 | platform linux -- Python 3.8.7, pytest-8.1.2, pluggy-1.5.0 -- /usr/local/bin/python3.8 |
21-Aug-2024 01:23:44 | cachedir: .pytest_cache |
21-Aug-2024 01:23:44 | rootdir: /home/casatest/casa6/casatestutils/nosedir/test_task_getephemtable |
21-Aug-2024 01:23:44 | configfile: pytest.ini |
21-Aug-2024 01:23:46 | collecting ... urlaccess= 200 |
21-Aug-2024 01:23:46 | code 200 |
21-Aug-2024 01:23:46 | urlaccess= 200 |
21-Aug-2024 01:23:46 | code 200 |
21-Aug-2024 01:23:46 | urlaccess= 200 |
21-Aug-2024 01:23:46 | code 200 |
21-Aug-2024 01:23:46 | collected 7 items |
21-Aug-2024 01:23:46 | |
21-Aug-2024 01:23:46 | |
21-Aug-2024 01:23:46 | test_task_getephemtable.py::getephemtable_test::test_invalid_inputs 2024-08-21 05:23:47 SEVERE getephemtable::::casa Task getephemtable raised an exception of class ValueError with the following message: objectname must be specified |
21-Aug-2024 01:23:46 | 2024-08-21 05:23:47 SEVERE getephemtable::::casa Task getephemtable raised an exception of class ValueError with the following message: timerange must be specified |
21-Aug-2024 01:23:46 | 2024-08-21 05:23:47 SEVERE getephemtable::::casa Task getephemtable raised an exception of class ValueError with the following message: outfile must be specified |
21-Aug-2024 01:23:46 | 2024-08-21 05:23:47 SEVERE getephemtable::::casa Task getephemtable raised an exception of class RuntimeError with the following message: objectname is given as an ID number, need to set asis=True |
21-Aug-2024 01:23:46 | 2024-08-21 05:23:47 SEVERE getephemtable::::casa Task getephemtable raised an exception of class ValueError with the following message: timerange needs to be specified with starttime and stoptime delimited by ~ . |
21-Aug-2024 01:23:46 | 2024-08-21 05:23:47 SEVERE getephemtable::::casa Task getephemtable raised an exception of class ValueError with the following message: Error translating stop time of timerange specified in JD. |
21-Aug-2024 01:23:46 | 2024-08-21 05:23:47 SEVERE getephemtable::::casa Task getephemtable raised an exception of class ValueError with the following message: Error translating stop time of timerange specified in MJD. |
21-Aug-2024 01:23:46 | 2024-08-21 05:23:47 SEVERE getephemtable::::casa Task getephemtable raised an exception of class ValueError with the following message: Error in timerange format. Use YYYY/MM/DD/hh:mm or Julian date with a prefix 'JD' Modified Julian date with a prefix 'MJD' |
21-Aug-2024 01:23:46 | 2024-08-21 05:23:47 SEVERE getephemtable::::casa Task getephemtable raised an exception of class ValueError with the following message: interval value must be integer |
21-Aug-2024 01:23:47 | 2024-08-21 05:23:47 SEVERE getephemtable::::casa Task getephemtable raised an exception of class ValueError with the following message: testephem.tab exists and overwrite=False |
21-Aug-2024 01:23:47 | |
21-Aug-2024 01:23:47 | Test task inputs |
21-Aug-2024 01:23:47 | PASSED |
21-Aug-2024 01:23:47 | |
21-Aug-2024 01:23:48 | test_task_getephemtable.py::getephemtable_test::test_nonalphanumeric_name |
21-Aug-2024 01:23:48 | Test object name extraction for the ojbect name contains nonalphanumeric characters |
21-Aug-2024 01:23:48 | PASSED |
21-Aug-2024 01:23:48 | |
21-Aug-2024 01:23:48 | test_task_getephemtable.py::getephemtable_test::test_save_rawdata |
21-Aug-2024 01:23:48 | Test raw query result saving |
21-Aug-2024 01:23:48 | PASSED |
21-Aug-2024 01:23:48 | |
21-Aug-2024 01:23:49 | test_task_getephemtable.py::getephemtable_test::test_table_generation |
21-Aug-2024 01:23:49 | Test ephem table generation |
21-Aug-2024 01:23:49 | PASSED |
21-Aug-2024 01:23:49 | |
21-Aug-2024 01:23:49 | test_task_getephemtable.py::getephemtable_test::test_tocasatb_textfile_geo |
21-Aug-2024 01:23:49 | Test tocasatb function independently, geocentric location |
21-Aug-2024 01:23:49 | PASSED |
21-Aug-2024 01:23:49 | |
21-Aug-2024 01:23:49 | test_task_getephemtable.py::getephemtable_test::test_tocasatb_textfile_topo |
21-Aug-2024 01:23:49 | Test tocasatb function independently, topocentric (ALMA, VLA, and GBT) locations |
21-Aug-2024 01:23:49 | PASSED |
21-Aug-2024 01:23:49 | |
21-Aug-2024 01:23:49 | test_task_getephemtable.py::getephemtable_test::test_webservice_errors 2024-08-21 05:23:50 SEVERE getephemtable::::casa Task getephemtable raised an exception of class HTTPError with the following message: HTTP Error 404: Not Found |
21-Aug-2024 01:23:49 | 2024-08-21 05:23:50 SEVERE getephemtable::::casa Task getephemtable raised an exception of class URLError with the following message: <urlopen error Unknown host> |
21-Aug-2024 01:23:49 | |
21-Aug-2024 01:23:49 | PASSED |
21-Aug-2024 01:23:49 | |
21-Aug-2024 01:23:49 | - generated xml file: /home/casatest/casa6/casatestutils/nosedir/xml/test_task_getephemtable/nose.xml - |
21-Aug-2024 01:23:49 | ========================= 7 passed, 1 warning in 5.28s ========================= |
21-Aug-2024 01:23:50 | ============================= test session starts ============================== |
21-Aug-2024 01:23:50 | platform linux -- Python 3.8.7, pytest-8.1.2, pluggy-1.5.0 -- /usr/local/bin/python3.8 |
21-Aug-2024 01:23:50 | cachedir: .pytest_cache |
21-Aug-2024 01:23:50 | rootdir: /home/casatest/casa6/casatestutils/nosedir/test_task_sdpolaverage |
21-Aug-2024 01:23:50 | configfile: pytest.ini |
21-Aug-2024 01:23:51 | collecting ... collected 3 items |
21-Aug-2024 01:23:51 | |
21-Aug-2024 01:23:51 | |
21-Aug-2024 01:23:52 | test_task_sdpolaverage.py::test_sdpolaverage::test_default |
21-Aug-2024 01:23:52 | PASSED |
21-Aug-2024 01:23:52 | |
21-Aug-2024 01:23:54 | test_task_sdpolaverage.py::test_sdpolaverage::test_stokes_corrected_data |
21-Aug-2024 01:23:54 | PASSED |
21-Aug-2024 01:23:54 | |
21-Aug-2024 01:23:55 | test_task_sdpolaverage.py::test_sdpolaverage::test_stokes_float_data |
21-Aug-2024 01:23:55 | PASSED |
21-Aug-2024 01:23:55 | |
21-Aug-2024 01:23:55 | - generated xml file: /home/casatest/casa6/casatestutils/nosedir/xml/test_task_sdpolaverage/nose.xml - |
21-Aug-2024 01:23:55 | ========================= 3 passed, 1 warning in 4.62s ========================= |
21-Aug-2024 01:23:55 | ============================= test session starts ============================== |
21-Aug-2024 01:23:55 | platform linux -- Python 3.8.7, pytest-8.1.2, pluggy-1.5.0 -- /usr/local/bin/python3.8 |
21-Aug-2024 01:23:55 | cachedir: .pytest_cache |
21-Aug-2024 01:23:55 | rootdir: /home/casatest/casa6/casatestutils/nosedir/test_task_rmfit |
21-Aug-2024 01:23:55 | configfile: pytest.ini |
21-Aug-2024 01:23:56 | collecting ... collected 11 items |
21-Aug-2024 01:23:56 | |
21-Aug-2024 01:23:56 | |
21-Aug-2024 01:23:56 | test_task_rmfit.py::rmfit_test::test_algorithm 2024-08-21 05:23:57 WARN prom::::casa *** Error ''function' object has no attribute 'func_code'' updating HISTORY |
21-Aug-2024 01:23:57 | |
21-Aug-2024 01:23:57 | Test rotation measure computation algorithm |
21-Aug-2024 01:23:57 | PASSED |
21-Aug-2024 01:23:57 | |
21-Aug-2024 01:23:57 | test_task_rmfit.py::rmfit_test::test_axisDiff 2024-08-21 05:23:57 WARN prom::ImageConcat::setImage (file /source/casainstall/include/casacore/images/Images/ImageConcat.tcc, line 288) Images are not contiguous along the concatenation axis For this axis, a non-regular Spectral coordinate will be made |
21-Aug-2024 01:23:57 | 2024-08-21 05:23:57 WARN prom::ImageConcat::setCoordinates (file /source/casainstall/include/casacore/images/Images/ImageConcat.tcc, line 680) Could not create Coordinate because TabularCoordinate - pixel and world values must increase or decrease monotonically CoordinateSystem set to that of first image instead |
21-Aug-2024 01:23:57 | 2024-08-21 05:23:57 WARN prom::::casa *** Error ''function' object has no attribute 'func_code'' updating HISTORY |
21-Aug-2024 01:23:57 | |
21-Aug-2024 01:23:57 | test_axisDiff |
21-Aug-2024 01:23:57 | --------------- |
21-Aug-2024 01:23:57 | |
21-Aug-2024 01:23:57 | This tests checks that the task will still run with multiple images with differing spectal axis dimensions |
21-Aug-2024 01:23:57 | PASSED |
21-Aug-2024 01:23:57 | |
21-Aug-2024 01:23:57 | test_task_rmfit.py::rmfit_test::test_freqAmount 2024-08-21 05:23:57 WARN prom::::casa *** Error ''function' object has no attribute 'func_code'' updating HISTORY |
21-Aug-2024 01:23:57 | 2024-08-21 05:23:57 SEVERE prom::imagepol::rotationmeasure Exception Reported: Exception: This image only has 1 frequencies, this is not enough. |
21-Aug-2024 01:23:57 | 2024-08-21 05:23:57 SEVERE prom::imagepol::rotationmeasure+ ... thrown by void casa::ImagePolarimetry::rotationMeasure(casacore::ImageInterface<float>*&, casacore::ImageInterface<float>*&, casacore::ImageInterface<float>*&, casacore::ImageInterface<float>*&, casacore::ImageInterface<float>*&, casacore::ImageInterface<float>*&, casacore::Int, casacore::Float, casacore::Float, casacore::Float, casacore::Float, casacore::Bool) at File: /source/casa6/casatools/src/code/imageanalysis/ImageAnalysis/ImagePolarimetry.cc, line: 583 |
21-Aug-2024 01:23:57 | 2024-08-21 05:23:57 SEVERE prom::::casa Task rmfit raised an exception of class RuntimeError with the following message: Exception: This image only has 1 frequencies, this is not enough. |
21-Aug-2024 01:23:57 | 2024-08-21 05:23:57 SEVERE prom::::casa+ ... thrown by void casa::ImagePolarimetry::rotationMeasure(casacore::ImageInterface<float>*&, casacore::ImageInterface<float>*&, casacore::ImageInterface<float>*&, casacore::ImageInterface<float>*&, casacore::ImageInterface<float>*&, casacore::ImageInterface<float>*&, casacore::Int, casacore::Float, casacore::Float, casacore::Float, casacore::Float, casacore::Bool) at File: /source/casa6/casatools/src/code/imageanalysis/ImageAnalysis/ImagePolarimetry.cc, line: 583 |
21-Aug-2024 01:23:57 | |
21-Aug-2024 01:23:57 | test_freqAmount |
21-Aug-2024 01:23:57 | ----------------- |
21-Aug-2024 01:23:57 | |
21-Aug-2024 01:23:57 | This test checks that rmfit will only work if the provided image has more than two frequency channels |
21-Aug-2024 01:23:57 | PASSED |
21-Aug-2024 01:23:57 | |
21-Aug-2024 01:23:57 | test_task_rmfit.py::rmfit_test::test_makesImage 2024-08-21 05:23:57 WARN prom::::casa *** Error ''function' object has no attribute 'func_code'' updating HISTORY |
21-Aug-2024 01:23:57 | |
21-Aug-2024 01:23:57 | test_makesImage |
21-Aug-2024 01:23:57 | ------------------ |
21-Aug-2024 01:23:57 | |
21-Aug-2024 01:23:57 | This test checks that a rotation measure image is generated when the task is run. |
21-Aug-2024 01:23:57 | PASSED |
21-Aug-2024 01:23:57 | |
21-Aug-2024 01:23:57 | test_task_rmfit.py::rmfit_test::test_maxpaerr 2024-08-21 05:23:58 WARN prom::::casa *** Error ''function' object has no attribute 'func_code'' updating HISTORY |
21-Aug-2024 01:23:57 | 2024-08-21 05:23:58 WARN prom::::casa *** Error ''function' object has no attribute 'func_code'' updating HISTORY |
21-Aug-2024 01:23:57 | |
21-Aug-2024 01:23:57 | test_maxpaerr |
21-Aug-2024 01:23:57 | --------------- |
21-Aug-2024 01:23:57 | |
21-Aug-2024 01:23:57 | Test that the maxpaerr parameter changes the max allowed position angle |
21-Aug-2024 01:23:57 | PASSED |
21-Aug-2024 01:23:57 | |
21-Aug-2024 01:23:57 | test_task_rmfit.py::rmfit_test::test_multiImage 2024-08-21 05:23:58 WARN prom::ImageConcat::setImage (file /source/casainstall/include/casacore/images/Images/ImageConcat.tcc, line 288) Images are not contiguous along the concatenation axis For this axis, a non-regular Spectral coordinate will be made |
21-Aug-2024 01:23:57 | 2024-08-21 05:23:58 WARN prom::ImageConcat::setCoordinates (file /source/casainstall/include/casacore/images/Images/ImageConcat.tcc, line 680) Could not create Coordinate because TabularCoordinate - pixel and world values must increase or decrease monotonically CoordinateSystem set to that of first image instead |
21-Aug-2024 01:23:57 | 2024-08-21 05:23:58 WARN prom::::casa *** Error ''function' object has no attribute 'func_code'' updating HISTORY |
21-Aug-2024 01:23:57 | |
21-Aug-2024 01:23:57 | test_multiImage |
21-Aug-2024 01:23:57 | ------------------ |
21-Aug-2024 01:23:57 | |
21-Aug-2024 01:23:57 | This test checks that rmfit can take multiple image names |
21-Aug-2024 01:23:57 | PASSED |
21-Aug-2024 01:23:57 | |
21-Aug-2024 01:23:57 | test_task_rmfit.py::rmfit_test::test_needsQUV 2024-08-21 05:23:58 SEVERE prom::imagepol::open Exception Reported: This image has no Stokes Q, U, nor V. This is not useful at File: /source/casa6/casatools/src/code/imageanalysis/ImageAnalysis/ImagePolarimetry.cc, line: 1145 |
21-Aug-2024 01:23:57 | 2024-08-21 05:23:58 SEVERE prom::::casa Task rmfit raised an exception of class RuntimeError with the following message: This image has no Stokes Q, U, nor V. This is not useful at File: /source/casa6/casatools/src/code/imageanalysis/ImageAnalysis/ImagePolarimetry.cc, line: 1145 |
21-Aug-2024 01:23:57 | |
21-Aug-2024 01:23:57 | test_needsQUV |
21-Aug-2024 01:23:57 | ---------------- |
21-Aug-2024 01:23:57 | |
21-Aug-2024 01:23:57 | This test checks that if the image provided doesn't have Stokes Q, U, or V the task will fail to execute |
21-Aug-2024 01:23:57 | PASSED |
21-Aug-2024 01:23:57 | |
21-Aug-2024 01:23:58 | test_task_rmfit.py::rmfit_test::test_rmfgparam 2024-08-21 05:23:58 WARN prom::::casa *** Error ''function' object has no attribute 'func_code'' updating HISTORY |
21-Aug-2024 01:23:58 | 2024-08-21 05:23:58 WARN prom::::casa *** Error ''function' object has no attribute 'func_code'' updating HISTORY |
21-Aug-2024 01:23:58 | |
21-Aug-2024 01:23:58 | test_rmfgparam |
21-Aug-2024 01:23:58 | ----------------- |
21-Aug-2024 01:23:58 | |
21-Aug-2024 01:23:58 | Test that rmfg is used to specify a foreground rmvalue which is subtracted |
21-Aug-2024 01:23:58 | PASSED |
21-Aug-2024 01:23:58 | |
21-Aug-2024 01:23:58 | test_task_rmfit.py::rmfit_test::test_rmfit_basics 2024-08-21 05:23:58 WARN prom::::casa *** Error ''function' object has no attribute 'func_code'' updating HISTORY |
21-Aug-2024 01:23:58 | 2024-08-21 05:23:58 WARN prom::ImageConcat::setImage (file /source/casainstall/include/casacore/images/Images/ImageConcat.tcc, line 288) Images are not contiguous along the concatenation axis For this axis, a non-regular Spectral coordinate will be made |
21-Aug-2024 01:23:58 | 2024-08-21 05:23:58 WARN prom::::casa *** Error ''function' object has no attribute 'func_code'' updating HISTORY |
21-Aug-2024 01:23:58 | |
21-Aug-2024 01:23:58 | Sanity tests for task rmfit |
21-Aug-2024 01:23:58 | PASSED |
21-Aug-2024 01:23:58 | |
21-Aug-2024 01:23:58 | test_task_rmfit.py::rmfit_test::test_rmmax 2024-08-21 05:23:59 WARN prom::::casa *** Error ''function' object has no attribute 'func_code'' updating HISTORY |
21-Aug-2024 01:23:58 | 2024-08-21 05:23:59 WARN prom::::casa *** Error ''function' object has no attribute 'func_code'' updating HISTORY |
21-Aug-2024 01:23:58 | |
21-Aug-2024 01:23:58 | test_rmmax |
21-Aug-2024 01:23:58 | ------------ |
21-Aug-2024 01:23:58 | |
21-Aug-2024 01:23:58 | This test checks that the rmmax param gives the max absolute RM value that should be solved for |
21-Aug-2024 01:23:58 | PASSED |
21-Aug-2024 01:23:58 | |
21-Aug-2024 01:23:58 | test_task_rmfit.py::rmfit_test::test_sigmaParam 2024-08-21 05:23:59 WARN prom::::casa *** Error ''function' object has no attribute 'func_code'' updating HISTORY |
21-Aug-2024 01:23:58 | 2024-08-21 05:23:59 WARN prom::::casa *** Error ''function' object has no attribute 'func_code'' updating HISTORY |
21-Aug-2024 01:23:58 | |
21-Aug-2024 01:23:58 | test_sigmaParam |
21-Aug-2024 01:23:58 | ----------------- |
21-Aug-2024 01:23:58 | |
21-Aug-2024 01:23:58 | Test that the sigma parameter gives the thermal noise in Stokes U and Q |
21-Aug-2024 01:23:58 | PASSED |
21-Aug-2024 01:23:58 | |
21-Aug-2024 01:23:58 | - generated xml file: /home/casatest/casa6/casatestutils/nosedir/xml/test_task_rmfit/nose.xml - |
21-Aug-2024 01:23:58 | ======================== 11 passed, 1 warning in 3.33s ========================= |
21-Aug-2024 01:23:59 | ============================= test session starts ============================== |
21-Aug-2024 01:23:59 | platform linux -- Python 3.8.7, pytest-8.1.2, pluggy-1.5.0 -- /usr/local/bin/python3.8 |
21-Aug-2024 01:23:59 | cachedir: .pytest_cache |
21-Aug-2024 01:23:59 | rootdir: /home/casatest/casa6/casatestutils/nosedir/test_task_specsmooth |
21-Aug-2024 01:23:59 | configfile: pytest.ini |
21-Aug-2024 01:24:00 | collecting ... collected 2 items |
21-Aug-2024 01:24:00 | |
21-Aug-2024 01:24:00 | |
21-Aug-2024 01:24:00 | test_task_specsmooth.py::specsmooth_test::test_general 2024-08-21 05:24:01 SEVERE specsmooth::image::hanning Exception Reported: Exception: The selected region of the image must have at least 3 pixels along the axis to be smoothed.. |
21-Aug-2024 01:24:00 | 2024-08-21 05:24:01 SEVERE specsmooth::image::hanning+ ... thrown by std::shared_ptr<casacore::ImageInterface<T> > casa::Image1DSmoother<T>::smooth() const [with T = float] at File: /source/casainstall/include/casacpp/imageanalysis/ImageAnalysis/Image1DSmoother.tcc, line: 39 |
21-Aug-2024 01:24:00 | 2024-08-21 05:24:01 SEVERE specsmooth::::casa Task specsmooth raised an exception of class RuntimeError with the following message: Exception: The selected region of the image must have at least 3 pixels along the axis to be smoothed.. |
21-Aug-2024 01:24:00 | 2024-08-21 05:24:01 SEVERE specsmooth::::casa+ ... thrown by std::shared_ptr<casacore::ImageInterface<T> > casa::Image1DSmoother<T>::smooth() const [with T = float] at File: /source/casainstall/include/casacpp/imageanalysis/ImageAnalysis/Image1DSmoother.tcc, line: 39 |
21-Aug-2024 01:24:00 | 2024-08-21 05:24:01 SEVERE specsmooth::image::hanning Exception Reported: Exception: The selected region of the image must have at least 3 pixels along the axis to be smoothed.. |
21-Aug-2024 01:24:00 | 2024-08-21 05:24:01 SEVERE specsmooth::image::hanning+ ... thrown by std::shared_ptr<casacore::ImageInterface<T> > casa::Image1DSmoother<T>::smooth() const [with T = float] at File: /source/casainstall/include/casacpp/imageanalysis/ImageAnalysis/Image1DSmoother.tcc, line: 39 |
21-Aug-2024 01:24:00 | 2024-08-21 05:24:01 SEVERE specsmooth::::casa Task specsmooth raised an exception of class RuntimeError with the following message: Exception: The selected region of the image must have at least 3 pixels along the axis to be smoothed.. |
21-Aug-2024 01:24:00 | 2024-08-21 05:24:01 SEVERE specsmooth::::casa+ ... thrown by std::shared_ptr<casacore::ImageInterface<T> > casa::Image1DSmoother<T>::smooth() const [with T = float] at File: /source/casainstall/include/casacpp/imageanalysis/ImageAnalysis/Image1DSmoother.tcc, line: 39 |
21-Aug-2024 01:24:01 | |
21-Aug-2024 01:24:01 | Test general behavior |
21-Aug-2024 01:24:01 | PASSED |
21-Aug-2024 01:24:01 | |
21-Aug-2024 01:24:01 | test_task_specsmooth.py::specsmooth_test::test_history 2024-08-21 05:24:01 WARN image::open (file src/tools/image/image_cmpt.cc, line 4208) Another image is already open, closing first |
21-Aug-2024 01:24:01 | |
21-Aug-2024 01:24:01 | Test history records are written |
21-Aug-2024 01:24:01 | PASSED |
21-Aug-2024 01:24:01 | |
21-Aug-2024 01:24:01 | - generated xml file: /home/casatest/casa6/casatestutils/nosedir/xml/test_task_specsmooth/nose.xml - |
21-Aug-2024 01:24:01 | ========================= 2 passed, 1 warning in 1.99s ========================= |
21-Aug-2024 01:24:01 | ============================= test session starts ============================== |
21-Aug-2024 01:24:01 | platform linux -- Python 3.8.7, pytest-8.1.2, pluggy-1.5.0 -- /usr/local/bin/python3.8 |
21-Aug-2024 01:24:01 | cachedir: .pytest_cache |
21-Aug-2024 01:24:01 | rootdir: /home/casatest/casa6/casatestutils/nosedir/test_task_conjugatevis |
21-Aug-2024 01:24:01 | configfile: pytest.ini |
21-Aug-2024 01:24:03 | collecting ... collected 10 items |
21-Aug-2024 01:24:03 | |
21-Aug-2024 01:24:03 | |
21-Aug-2024 01:24:03 | test_task_conjugatevis.py::conjugatevis_test::test1 |
21-Aug-2024 01:24:03 | Conjugatevis 1: |
21-Aug-2024 01:24:03 | Copying shortpart1.ms |
21-Aug-2024 01:24:03 | test_conjugatevis: Success! Now checking output ... |
21-Aug-2024 01:24:03 | test_conjugatevis: Error conjugated.ms/table.f0 doesn't exist ... |
21-Aug-2024 01:24:03 | test_conjugatevis: table.dat present. |
21-Aug-2024 01:24:03 | test_conjugatevis: MS exists. Try opening as MS ... |
21-Aug-2024 01:24:03 | test_conjugatevis: OK. Checking tables in detail ... |
21-Aug-2024 01:24:03 | test_conjugatevis: comparing ['DATA', 4000, [[(-0.00426177-0.00387163j)], [(0.00058119+0.00283016j)]], 1e-08] |
21-Aug-2024 01:24:03 | test_conjugatevis: table MAIN as expected. |
21-Aug-2024 01:24:03 | test_conjugatevis: comparing ['DATA', 3000, [[(0.00347826-0.00406267j)], [(0.00458098-0.00508398j)]], 1e-08] |
21-Aug-2024 01:24:03 | test_conjugatevis: table MAIN as expected. |
21-Aug-2024 01:24:03 | PASSED |
21-Aug-2024 01:24:03 | |
21-Aug-2024 01:24:12 | test_task_conjugatevis.py::conjugatevis_test::test_changeMultipleSpectralWindows |
21-Aug-2024 01:24:12 | 3. test_changeMultipleSpectralWindows: Check that conjugatevis changed the phase sign for multiple spectral windows |
21-Aug-2024 01:24:12 | Copying shortpart1.ms |
21-Aug-2024 01:24:12 | PASSED |
21-Aug-2024 01:24:12 | |
21-Aug-2024 01:24:18 | test_task_conjugatevis.py::conjugatevis_test::test_changeSignOneSpectralWindow |
21-Aug-2024 01:24:18 | 2. test_changeSignOnSpectralWindow: Check that conjugatevis changed the phase sign for a single spectral window |
21-Aug-2024 01:24:18 | Copying shortpart1.ms |
21-Aug-2024 01:24:18 | PASSED |
21-Aug-2024 01:24:18 | |
21-Aug-2024 01:24:32 | test_task_conjugatevis.py::conjugatevis_test::test_defaultOutputFileName |
21-Aug-2024 01:24:32 | 6. test_defaultOutputFileName: Check that conjugatevis writes the output ms file as 'conjugated_'+vis |
21-Aug-2024 01:24:32 | Copying shortpart1.ms |
21-Aug-2024 01:24:32 | PASSED |
21-Aug-2024 01:24:32 | |
21-Aug-2024 01:24:44 | test_task_conjugatevis.py::conjugatevis_test::test_defaultSpectralWindowList |
21-Aug-2024 01:24:44 | 4. test_defaultSpectralWindows: Check that conjugatevis changes phase sign for all spectral windows for default spwlist |
21-Aug-2024 01:24:44 | Copying shortpart1.ms |
21-Aug-2024 01:24:44 | PASSED |
21-Aug-2024 01:24:44 | |
21-Aug-2024 01:24:57 | test_task_conjugatevis.py::conjugatevis_test::test_overwriteDefault 2024-08-21 05:24:57 SEVERE conjugatevis::::casa Task conjugatevis raised an exception of class RuntimeError with the following message: outputvis gaincal2-conj.ms exists and you did not permit overwrite |
21-Aug-2024 01:24:57 | |
21-Aug-2024 01:24:57 | 9. test_overwriteDefault: Check that the default setting of overwrite is False |
21-Aug-2024 01:24:57 | Copying shortpart1.ms |
21-Aug-2024 01:24:57 | PASSED |
21-Aug-2024 01:24:57 | |
21-Aug-2024 01:25:07 | test_task_conjugatevis.py::conjugatevis_test::test_overwriteFalse 2024-08-21 05:25:07 SEVERE conjugatevis::::casa Task conjugatevis raised an exception of class RuntimeError with the following message: outputvis gaincal2-conj.ms exists and you did not permit overwrite |
21-Aug-2024 01:25:07 | |
21-Aug-2024 01:25:07 | 8. test_overwriteFalse: Check that conjugatevis will not overwrite an existing file if overwrite=False |
21-Aug-2024 01:25:07 | Copying shortpart1.ms |
21-Aug-2024 01:25:07 | PASSED |
21-Aug-2024 01:25:07 | |
21-Aug-2024 01:25:26 | test_task_conjugatevis.py::conjugatevis_test::test_overwriteTrue |
21-Aug-2024 01:25:26 | 7. test_overwriteTrue: Check that conjugatevis will overwrite an existing file if overwrite=True |
21-Aug-2024 01:25:26 | Copying shortpart1.ms |
21-Aug-2024 01:25:26 | PASSED |
21-Aug-2024 01:25:26 | |
21-Aug-2024 01:25:36 | test_task_conjugatevis.py::conjugatevis_test::test_specifiedOutputFileName |
21-Aug-2024 01:25:36 | 5. test_specifiedOutputFileName: Check that conjugatevis writes the output ms file with the specified file name |
21-Aug-2024 01:25:36 | Copying shortpart1.ms |
21-Aug-2024 01:25:36 | PASSED |
21-Aug-2024 01:25:36 | |
21-Aug-2024 01:25:45 | test_task_conjugatevis.py::conjugatevis_test::test_takesMeasurementSet |
21-Aug-2024 01:25:45 | 1. test_takesMeasurementSet: Check that conjugatevis opens a MeasurementSet file |
21-Aug-2024 01:25:45 | Copying shortpart1.ms |
21-Aug-2024 01:25:45 | PASSED |
21-Aug-2024 01:25:45 | |
21-Aug-2024 01:25:45 | - generated xml file: /home/casatest/casa6/casatestutils/nosedir/xml/test_task_conjugatevis/nose.xml - |
21-Aug-2024 01:25:45 | ================== 10 passed, 1 warning in 103.76s (0:01:43) =================== |
21-Aug-2024 01:25:46 | ============================= test session starts ============================== |
21-Aug-2024 01:25:46 | platform linux -- Python 3.8.7, pytest-8.1.2, pluggy-1.5.0 -- /usr/local/bin/python3.8 |
21-Aug-2024 01:25:46 | cachedir: .pytest_cache |
21-Aug-2024 01:25:46 | rootdir: /home/casatest/casa6/casatestutils/nosedir/test_task_delmod |
21-Aug-2024 01:25:46 | configfile: pytest.ini |
21-Aug-2024 01:25:47 | collecting ... collected 4 items |
21-Aug-2024 01:25:47 | |
21-Aug-2024 01:25:47 | |
21-Aug-2024 01:25:47 | test_task_delmod.py::delmod_test::test_mesSet 2024-08-21 05:25:48 WARN calibrater::setvi(bool,bool) Forcing use of OLD VisibilityIterator. |
21-Aug-2024 01:25:47 | |
21-Aug-2024 01:25:47 | test_messet |
21-Aug-2024 01:25:47 | ----------------- |
21-Aug-2024 01:25:47 | |
21-Aug-2024 01:25:47 | Checks that only a valid MS is accept as input |
21-Aug-2024 01:25:47 | |
21-Aug-2024 01:25:47 | The first assert checks that no severe errors appear in the log when preforming the task on a valid MS |
21-Aug-2024 01:25:47 | The second assert checks that a severe error is raised when the provided MS does not exist |
21-Aug-2024 01:25:47 | TABLE IS BEING REMOVED |
21-Aug-2024 01:25:47 | PASSED |
21-Aug-2024 01:25:47 | |
21-Aug-2024 01:25:47 | test_task_delmod.py::delmod_test::test_removefield 2024-08-21 05:25:48 WARN calibrater::setvi(bool,bool) Forcing use of OLD VisibilityIterator. |
21-Aug-2024 01:25:48 | 2024-08-21 05:25:48 WARN ft::FTMachine::initMaps No overlap in frequency between image channels and selected data found for this FTMachine |
21-Aug-2024 01:25:48 | 2024-08-21 05:25:48 WARN ft::FTMachine::initMaps+ Check your data selection and image parameters if you end up with a blank image |
21-Aug-2024 01:25:48 | |
21-Aug-2024 01:25:48 | test_removefield |
21-Aug-2024 01:25:48 | ---------------------- |
21-Aug-2024 01:25:48 | |
21-Aug-2024 01:25:48 | Check that the field selection paramter works as intended |
21-Aug-2024 01:25:48 | |
21-Aug-2024 01:25:48 | This test checks that the field selection removes the proper FIELD_ID from the MS |
21-Aug-2024 01:25:48 | |
21-Aug-2024 01:25:48 | The field is deleted and then table tools are used to open and check for the existence of the removed FIELD_ID |
21-Aug-2024 01:25:48 | |
21-Aug-2024 01:25:48 | The assertion checks that the specified FIELD_ID is no longer present in the MS |
21-Aug-2024 01:25:48 | TABLE IS BEING REMOVED |
21-Aug-2024 01:25:48 | PASSED |
21-Aug-2024 01:25:48 | |
21-Aug-2024 01:25:48 | test_task_delmod.py::delmod_test::test_removeotf 2024-08-21 05:25:49 WARN calibrater::setvi(bool,bool) Forcing use of OLD VisibilityIterator. |
21-Aug-2024 01:25:48 | 2024-08-21 05:25:49 WARN ft::FTMachine::initMaps No overlap in frequency between image channels and selected data found for this FTMachine |
21-Aug-2024 01:25:48 | 2024-08-21 05:25:49 WARN ft::FTMachine::initMaps+ Check your data selection and image parameters if you end up with a blank image |
21-Aug-2024 01:25:49 | |
21-Aug-2024 01:25:49 | test_removeotf |
21-Aug-2024 01:25:49 | ------------------ |
21-Aug-2024 01:25:49 | |
21-Aug-2024 01:25:49 | Checks that the vitual model is removed when the parameter otf=True |
21-Aug-2024 01:25:49 | |
21-Aug-2024 01:25:49 | The first assert statment checks that the model does exist initially (this may be unnessisary) |
21-Aug-2024 01:25:49 | |
21-Aug-2024 01:25:49 | The second assertion checks that the virtual model no longer exists |
21-Aug-2024 01:25:49 | TABLE IS BEING REMOVED |
21-Aug-2024 01:25:49 | PASSED |
21-Aug-2024 01:25:49 | |
21-Aug-2024 01:25:49 | test_task_delmod.py::delmod_test::test_removescr 2024-08-21 05:25:49 WARN calibrater::setvi(bool,bool) Forcing use of OLD VisibilityIterator. |
21-Aug-2024 01:25:49 | 2024-08-21 05:25:49 SEVERE getcol::MODEL_DATA Exception Reported: TableProxy::getColumn: column MODEL_DATA does not exist |
21-Aug-2024 01:25:49 | |
21-Aug-2024 01:25:49 | test_removescr |
21-Aug-2024 01:25:49 | ----------------------- |
21-Aug-2024 01:25:49 | |
21-Aug-2024 01:25:49 | Checks that the scratch column is removed when using the parameer scr=True |
21-Aug-2024 01:25:49 | |
21-Aug-2024 01:25:49 | The assert checks that table tools cannot access the scratch column after delmod has been performed |
21-Aug-2024 01:25:49 | TABLE IS BEING REMOVED |
21-Aug-2024 01:25:49 | PASSED |
21-Aug-2024 01:25:49 | |
21-Aug-2024 01:25:49 | - generated xml file: /home/casatest/casa6/casatestutils/nosedir/xml/test_task_delmod/nose.xml - |
21-Aug-2024 01:25:49 | ========================= 4 passed, 1 warning in 3.22s ========================= |
21-Aug-2024 01:25:50 | ============================= test session starts ============================== |
21-Aug-2024 01:25:50 | platform linux -- Python 3.8.7, pytest-8.1.2, pluggy-1.5.0 -- /usr/local/bin/python3.8 |
21-Aug-2024 01:25:50 | cachedir: .pytest_cache |
21-Aug-2024 01:25:50 | rootdir: /home/casatest/casa6/casatestutils/nosedir/test_task_splattotable |
21-Aug-2024 01:25:50 | configfile: pytest.ini |
21-Aug-2024 01:25:51 | collecting ... collected 2 items |
21-Aug-2024 01:25:51 | |
21-Aug-2024 01:25:51 | |
21-Aug-2024 01:25:51 | test_task_splattotable.py::splattotable_test::test_exceptions 2024-08-21 05:25:51 SEVERE Exception Reports: Output table name cannot be blank. |
21-Aug-2024 01:25:51 | 2024-08-21 05:25:51 SEVERE splattotable::::casa Task splattotable raised an exception of class ValueError with the following message: table must be specified. |
21-Aug-2024 01:25:51 | 2024-08-21 05:25:51 SEVERE ListConverter::_parseLists bad format for line 1 in file splattotable_list2.txt |
21-Aug-2024 01:25:51 | 2024-08-21 05:25:51 SEVERE Exception Reports: 2024-08-21 05:25:51 SEVERE ListConverter::_parseLists bad format for line 1 in file splattotable_list2.txt |
21-Aug-2024 01:25:51 | 2024-08-21 05:25:51 SEVERE splattotable::ListConverter::_parseLists bad format for line 1 in file splattotable_list2.txt |
21-Aug-2024 01:25:51 | 2024-08-21 05:25:51 SEVERE splattotable:::: Exception Reports: 2024-08-21 05:25:51 SEVERE splattotable::ListConverter::_parseLists bad format for line 1 in file splattotable_list2.txt |
21-Aug-2024 01:25:51 | 2024-08-21 05:25:51 SEVERE splattotable::::casa Task splattotable raised an exception of class RuntimeError with the following message: 2024-08-21 05:25:51 SEVERE splattotable::ListConverter::_parseLists bad format for line 1 in file splattotable_list2.txt |
21-Aug-2024 01:25:51 | 2024-08-21 05:25:51 SEVERE Exception Reports: RegularFile: foo/bar/myout does not exist and cannot be created |
21-Aug-2024 01:25:51 | 2024-08-21 05:25:51 SEVERE splattotable:::: Exception Reports: RegularFile: foo/bar/myout does not exist and cannot be created |
21-Aug-2024 01:25:51 | 2024-08-21 05:25:51 SEVERE splattotable::::casa Task splattotable raised an exception of class RuntimeError with the following message: RegularFile: foo/bar/myout does not exist and cannot be created |
21-Aug-2024 01:25:51 | |
21-Aug-2024 01:25:51 | splattotable: Test various exception cases |
21-Aug-2024 01:25:51 | PASSED |
21-Aug-2024 01:25:51 | |
21-Aug-2024 01:25:52 | test_task_splattotable.py::splattotable_test::test_good_list |
21-Aug-2024 01:25:52 | splattotable: Test converting a good list |
21-Aug-2024 01:25:52 | PASSED |
21-Aug-2024 01:25:52 | |
21-Aug-2024 01:25:52 | - generated xml file: /home/casatest/casa6/casatestutils/nosedir/xml/test_task_splattotable/nose.xml - |
21-Aug-2024 01:25:52 | ========================= 2 passed, 1 warning in 2.11s ========================= |
21-Aug-2024 01:25:52 | |
21-Aug-2024 01:25:52 | |
21-Aug-2024 01:25:52 | Setting Working Directory: /home/casatest/casa6/casatestutils/nosedir/test_task_imregrid/ |
21-Aug-2024 01:25:52 | Test Directory: /home/casatest/casa6/casatestutils/nosedir/test_task_imregrid |
21-Aug-2024 01:25:52 | |
21-Aug-2024 01:25:52 | Running Command: pytest --junitxml=/home/casatest/casa6/casatestutils/nosedir/xml/test_task_imregrid/nose.xml -s --disable-pytest-warnings --verbose -ra --tb=short /home/casatest/casa6/casatestutils/nosedir/test_task_imregrid/ |
21-Aug-2024 01:25:52 | |
21-Aug-2024 01:25:52 | Setting Working Directory: /home/casatest/casa6/casatestutils/nosedir/test_task_getephemtable/ |
21-Aug-2024 01:25:52 | Test Directory: /home/casatest/casa6/casatestutils/nosedir/test_task_getephemtable |
21-Aug-2024 01:25:52 | |
21-Aug-2024 01:25:52 | Running Command: pytest --junitxml=/home/casatest/casa6/casatestutils/nosedir/xml/test_task_getephemtable/nose.xml -s --disable-pytest-warnings --verbose -ra --tb=short /home/casatest/casa6/casatestutils/nosedir/test_task_getephemtable/ |
21-Aug-2024 01:25:52 | |
21-Aug-2024 01:25:52 | Setting Working Directory: /home/casatest/casa6/casatestutils/nosedir/test_task_sdpolaverage/ |
21-Aug-2024 01:25:52 | Test Directory: /home/casatest/casa6/casatestutils/nosedir/test_task_sdpolaverage |
21-Aug-2024 01:25:52 | |
21-Aug-2024 01:25:52 | Running Command: pytest --junitxml=/home/casatest/casa6/casatestutils/nosedir/xml/test_task_sdpolaverage/nose.xml -s --disable-pytest-warnings --verbose -ra --tb=short /home/casatest/casa6/casatestutils/nosedir/test_task_sdpolaverage/ |
21-Aug-2024 01:25:52 | |
21-Aug-2024 01:25:52 | Setting Working Directory: /home/casatest/casa6/casatestutils/nosedir/test_task_rmfit/ |
21-Aug-2024 01:25:52 | Test Directory: /home/casatest/casa6/casatestutils/nosedir/test_task_rmfit |
21-Aug-2024 01:25:52 | |
21-Aug-2024 01:25:52 | Running Command: pytest --junitxml=/home/casatest/casa6/casatestutils/nosedir/xml/test_task_rmfit/nose.xml -s --disable-pytest-warnings --verbose -ra --tb=short /home/casatest/casa6/casatestutils/nosedir/test_task_rmfit/ |
21-Aug-2024 01:25:52 | |
21-Aug-2024 01:25:52 | Setting Working Directory: /home/casatest/casa6/casatestutils/nosedir/test_task_specsmooth/ |
21-Aug-2024 01:25:52 | Test Directory: /home/casatest/casa6/casatestutils/nosedir/test_task_specsmooth |
21-Aug-2024 01:25:52 | |
21-Aug-2024 01:25:52 | Running Command: pytest --junitxml=/home/casatest/casa6/casatestutils/nosedir/xml/test_task_specsmooth/nose.xml -s --disable-pytest-warnings --verbose -ra --tb=short /home/casatest/casa6/casatestutils/nosedir/test_task_specsmooth/ |
21-Aug-2024 01:25:52 | |
21-Aug-2024 01:25:52 | Setting Working Directory: /home/casatest/casa6/casatestutils/nosedir/test_task_conjugatevis/ |
21-Aug-2024 01:25:52 | Test Directory: /home/casatest/casa6/casatestutils/nosedir/test_task_conjugatevis |
21-Aug-2024 01:25:52 | |
21-Aug-2024 01:25:52 | Running Command: pytest --junitxml=/home/casatest/casa6/casatestutils/nosedir/xml/test_task_conjugatevis/nose.xml -s --disable-pytest-warnings --verbose -ra --tb=short /home/casatest/casa6/casatestutils/nosedir/test_task_conjugatevis/ |
21-Aug-2024 01:25:52 | |
21-Aug-2024 01:25:52 | Setting Working Directory: /home/casatest/casa6/casatestutils/nosedir/test_task_delmod/ |
21-Aug-2024 01:25:52 | Test Directory: /home/casatest/casa6/casatestutils/nosedir/test_task_delmod |
21-Aug-2024 01:25:52 | |
21-Aug-2024 01:25:52 | Running Command: pytest --junitxml=/home/casatest/casa6/casatestutils/nosedir/xml/test_task_delmod/nose.xml -s --disable-pytest-warnings --verbose -ra --tb=short /home/casatest/casa6/casatestutils/nosedir/test_task_delmod/ |
21-Aug-2024 01:25:52 | |
21-Aug-2024 01:25:52 | Setting Working Directory: /home/casatest/casa6/casatestutils/nosedir/test_task_splattotable/ |
21-Aug-2024 01:25:52 | Test Directory: /home/casatest/casa6/casatestutils/nosedir/test_task_splattotable |
21-Aug-2024 01:25:52 | |
21-Aug-2024 01:25:52 | Running Command: pytest --junitxml=/home/casatest/casa6/casatestutils/nosedir/xml/test_task_splattotable/nose.xml -s --disable-pytest-warnings --verbose -ra --tb=short /home/casatest/casa6/casatestutils/nosedir/test_task_splattotable/ |
21-Aug-2024 01:25:55 | total 184928 |
21-Aug-2024 01:25:55 | -rw-r--r-- 1 casaci 15001 1853374 Aug 21 00:20 casatasks-6.6.5.24+dirty-py3-none-any.whl |
21-Aug-2024 01:25:55 | -rw-r--r-- 1 casaci root 4456099 Aug 21 05:25 casatasks_test.log |
21-Aug-2024 01:25:55 | -rw-r--r-- 1 casaci 15001 129194 Aug 21 00:20 casatestutils-6.6.5.24+dirty-py3-none-any.whl |
21-Aug-2024 01:25:55 | -rw-r--r-- 1 casaci 15001 182142368 Aug 21 00:20 casatools-6.6.5.24+dirty-cp38-cp38-manylinux_2_28_x86_64.whl |
21-Aug-2024 01:25:55 | -rw-r--r-- 1 casaci root 2507 Aug 21 05:25 test_casaxmlutil.xml |
21-Aug-2024 01:25:55 | -rw-r--r-- 1 casaci root 2317 Aug 21 05:25 test_flaghelper.xml |
21-Aug-2024 01:25:55 | -rw-r--r-- 1 casaci root 1860 Aug 21 05:25 test_imagerhelpers_gclean.xml |
21-Aug-2024 01:25:55 | -rw-r--r-- 1 casaci root 2658 Aug 21 05:25 test_jyperk.xml |
21-Aug-2024 01:25:55 | -rw-r--r-- 1 casaci root 1796 Aug 21 05:25 test_task_accor.xml |
21-Aug-2024 01:25:55 | -rw-r--r-- 1 casaci root 3051 Aug 21 05:25 test_task_applycal.xml |
21-Aug-2024 01:25:55 | -rw-r--r-- 1 casaci root 629 Aug 21 05:25 test_task_asdmsummary.xml |
21-Aug-2024 01:25:55 | -rw-r--r-- 1 casaci root 805 Aug 21 05:25 test_task_bandpass.xml |
21-Aug-2024 01:25:55 | -rw-r--r-- 1 casaci root 1723 Aug 21 05:25 test_task_blcal.xml |
21-Aug-2024 01:25:55 | -rw-r--r-- 1 casaci root 854 Aug 21 05:25 test_task_calstat.xml |
21-Aug-2024 01:25:55 | -rw-r--r-- 1 casaci root 972 Aug 21 05:25 test_task_clearcal.xml |
21-Aug-2024 01:25:55 | -rw-r--r-- 1 casaci root 663 Aug 21 05:25 test_task_clearstat.xml |
21-Aug-2024 01:25:55 | -rw-r--r-- 1 casaci root 1833 Aug 21 05:25 test_task_concat.xml |
21-Aug-2024 01:25:55 | -rw-r--r-- 1 casaci root 1345 Aug 21 05:25 test_task_conjugatevis.xml |
21-Aug-2024 01:25:55 | -rw-r--r-- 1 casaci root 7399 Aug 21 05:25 test_task_cvel.xml |
21-Aug-2024 01:25:55 | -rw-r--r-- 1 casaci root 5027 Aug 21 05:25 test_task_cvel2.xml |
21-Aug-2024 01:25:55 | -rw-r--r-- 1 casaci root 17642 Aug 21 05:25 test_task_deconvolve.xml |
21-Aug-2024 01:25:55 | -rw-r--r-- 1 casaci root 722 Aug 21 05:25 test_task_defintent.xml |
21-Aug-2024 01:25:55 | -rw-r--r-- 1 casaci root 586 Aug 21 05:25 test_task_delmod.xml |
21-Aug-2024 01:25:55 | -rw-r--r-- 1 casaci root 1772 Aug 21 05:25 test_task_exportasdm.xml |
21-Aug-2024 01:25:55 | -rw-r--r-- 1 casaci root 333 Aug 21 05:25 test_task_exportfits.xml |
21-Aug-2024 01:25:55 | -rw-r--r-- 1 casaci root 1837 Aug 21 05:25 test_task_exportuvfits.xml |
21-Aug-2024 01:25:55 | -rw-r--r-- 1 casaci root 866 Aug 21 05:25 test_task_feather.xml |
21-Aug-2024 01:25:55 | -rw-r--r-- 1 casaci root 1951 Aug 21 05:25 test_task_fixplanets.xml |
21-Aug-2024 01:25:55 | -rw-r--r-- 1 casaci root 1443 Aug 21 05:25 test_task_fixvis.xml |
21-Aug-2024 01:25:55 | -rw-r--r-- 1 casaci root 4601 Aug 21 05:25 test_task_flagcmd.xml |
21-Aug-2024 01:25:55 | -rw-r--r-- 1 casaci root 27907 Aug 21 05:25 test_task_flagdata.xml |
21-Aug-2024 01:25:55 | -rw-r--r-- 1 casaci root 940 Aug 21 05:25 test_task_flagmanager.xml |
21-Aug-2024 01:25:55 | -rw-r--r-- 1 casaci root 2332 Aug 21 05:25 test_task_fluxscale.xml |
21-Aug-2024 01:25:55 | -rw-r--r-- 1 casaci root 1244 Aug 21 05:25 test_task_fringefit.xml |
21-Aug-2024 01:25:55 | -rw-r--r-- 1 casaci root 3231 Aug 21 05:25 test_task_gaincal.xml |
21-Aug-2024 01:25:55 | -rw-r--r-- 1 casaci root 2682 Aug 21 05:25 test_task_gencal.xml |
21-Aug-2024 01:25:55 | -rw-r--r-- 1 casaci root 451 Aug 21 05:25 test_task_getantposalma.xml |
21-Aug-2024 01:25:55 | -rw-r--r-- 1 casaci root 659 Aug 21 05:25 test_task_getcalmodvla.xml |
21-Aug-2024 01:25:55 | -rw-r--r-- 1 casaci root 1015 Aug 21 05:25 test_task_getephemtable.xml |
21-Aug-2024 01:25:55 | -rw-r--r-- 1 casaci root 1206 Aug 21 05:25 test_task_hanningsmooth.xml |
21-Aug-2024 01:25:55 | -rw-r--r-- 1 casaci root 29165 Aug 21 05:25 test_task_imbaseline.xml |
21-Aug-2024 01:25:55 | -rw-r--r-- 1 casaci root 2194 Aug 21 05:25 test_task_imcollapse.xml |
21-Aug-2024 01:25:55 | -rw-r--r-- 1 casaci root 1197 Aug 21 05:25 test_task_imcontsub.xml |
21-Aug-2024 01:25:55 | -rw-r--r-- 1 casaci root 1742 Aug 21 05:25 test_task_imdev.xml |
21-Aug-2024 01:25:55 | -rw-r--r-- 1 casaci root 3166 Aug 21 05:25 test_task_imfit.xml |
21-Aug-2024 01:25:55 | -rw-r--r-- 1 casaci root 2109 Aug 21 05:25 test_task_imhead.xml |
21-Aug-2024 01:25:55 | -rw-r--r-- 1 casaci root 1149 Aug 21 05:25 test_task_imhistory.xml |
21-Aug-2024 01:25:55 | -rw-r--r-- 1 casaci root 3029 Aug 21 05:25 test_task_immath.xml |
21-Aug-2024 01:25:55 | -rw-r--r-- 1 casaci root 1642 Aug 21 05:25 test_task_immoments.xml |
21-Aug-2024 01:25:55 | -rw-r--r-- 1 casaci root 1103 Aug 21 05:25 test_task_impbcor.xml |
21-Aug-2024 01:25:55 | -rw-r--r-- 1 casaci root 726 Aug 21 05:25 test_task_importasap.xml |
21-Aug-2024 01:25:55 | -rw-r--r-- 1 casaci root 3681 Aug 21 05:25 test_task_importasdm.xml |
21-Aug-2024 01:25:55 | -rw-r--r-- 1 casaci root 326 Aug 21 05:25 test_task_importatca.xml |
21-Aug-2024 01:25:55 | -rw-r--r-- 1 casaci root 987 Aug 21 05:25 test_task_importfitsidi.xml |
21-Aug-2024 01:25:55 | -rw-r--r-- 1 casaci root 332 Aug 21 05:25 test_task_importmiriad.xml |
21-Aug-2024 01:25:55 | -rw-r--r-- 1 casaci root 614 Aug 21 05:25 test_task_importnro.xml |
21-Aug-2024 01:25:55 | -rw-r--r-- 1 casaci root 1792 Aug 21 05:25 test_task_importuvfits.xml |
21-Aug-2024 01:25:55 | -rw-r--r-- 1 casaci root 808 Aug 21 05:25 test_task_importvla.xml |
21-Aug-2024 01:25:55 | -rw-r--r-- 1 casaci root 1812 Aug 21 05:25 test_task_impv.xml |
21-Aug-2024 01:25:55 | -rw-r--r-- 1 casaci root 2089 Aug 21 05:25 test_task_imrebin.xml |
21-Aug-2024 01:25:55 | -rw-r--r-- 1 casaci root 804 Aug 21 05:25 test_task_imreframe.xml |
21-Aug-2024 01:25:55 | -rw-r--r-- 1 casaci root 2317 Aug 21 05:25 test_task_imregrid.xml |
21-Aug-2024 01:25:55 | -rw-r--r-- 1 casaci root 1436 Aug 21 05:25 test_task_imsmooth.xml |
21-Aug-2024 01:25:55 | -rw-r--r-- 1 casaci root 1414 Aug 21 05:25 test_task_imstat.xml |
21-Aug-2024 01:25:55 | -rw-r--r-- 1 casaci root 708 Aug 21 05:25 test_task_imsubimage.xml |
21-Aug-2024 01:25:55 | -rw-r--r-- 1 casaci root 778 Aug 21 05:25 test_task_imtrans.xml |
21-Aug-2024 01:25:55 | -rw-r--r-- 1 casaci root 3103 Aug 21 05:25 test_task_imval.xml |
21-Aug-2024 01:25:55 | -rw-r--r-- 1 casaci root 3770 Aug 21 05:25 test_task_initweights.xml |
21-Aug-2024 01:25:55 | -rw-r--r-- 1 casaci root 1458 Aug 21 05:25 test_task_listcal.xml |
21-Aug-2024 01:25:55 | -rw-r--r-- 1 casaci root 486 Aug 21 05:25 test_task_listfits.xml |
21-Aug-2024 01:25:55 | -rw-r--r-- 1 casaci root 726 Aug 21 05:25 test_task_listhistory.xml |
21-Aug-2024 01:25:55 | -rw-r--r-- 1 casaci root 8555 Aug 21 05:25 test_task_listobs.xml |
21-Aug-2024 01:25:55 | -rw-r--r-- 1 casaci root 1494 Aug 21 05:25 test_task_listpartition.xml |
21-Aug-2024 01:25:55 | -rw-r--r-- 1 casaci root 499 Aug 21 05:25 test_task_listsdm.xml |
21-Aug-2024 01:25:55 | -rw-r--r-- 1 casaci root 728 Aug 21 05:25 test_task_listvis.xml |
21-Aug-2024 01:25:55 | -rw-r--r-- 1 casaci root 2637 Aug 21 05:25 test_task_makemask.xml |
21-Aug-2024 01:25:55 | -rw-r--r-- 1 casaci root 34462 Aug 21 05:25 test_task_mstransform.xml |
21-Aug-2024 01:25:55 | -rw-r--r-- 1 casaci root 5821 Aug 21 05:25 test_task_mstransform_mms.xml |
21-Aug-2024 01:25:55 | -rw-r--r-- 1 casaci root 758 Aug 21 05:25 test_task_nrobeamaverage.xml |
21-Aug-2024 01:25:55 | -rw-r--r-- 1 casaci root 3440 Aug 21 05:25 test_task_partition.xml |
21-Aug-2024 01:25:55 | -rw-r--r-- 1 casaci root 1518 Aug 21 05:25 test_task_phaseshift.xml |
21-Aug-2024 01:25:55 | -rw-r--r-- 1 casaci root 1069 Aug 21 05:25 test_task_plotants.xml |
21-Aug-2024 01:25:55 | -rw-r--r-- 1 casaci root 25947 Aug 21 05:25 test_task_plotbandpass.xml |
21-Aug-2024 01:25:55 | -rw-r--r-- 1 casaci root 1770 Aug 21 05:25 test_task_plotprofilemap.xml |
21-Aug-2024 01:25:55 | -rw-r--r-- 1 casaci root 1789 Aug 21 05:25 test_task_plotweather.xml |
21-Aug-2024 01:25:55 | -rw-r--r-- 1 casaci root 3062 Aug 21 05:25 test_task_polcal.xml |
21-Aug-2024 01:25:55 | -rw-r--r-- 1 casaci root 332 Aug 21 05:25 test_task_polfromgain.xml |
21-Aug-2024 01:25:55 | -rw-r--r-- 1 casaci root 1191 Aug 21 05:25 test_task_predictcomp.xml |
21-Aug-2024 01:25:55 | -rw-r--r-- 1 casaci root 947 Aug 21 05:25 test_task_rerefant.xml |
21-Aug-2024 01:25:55 | -rw-r--r-- 1 casaci root 1181 Aug 21 05:25 test_task_rmfit.xml |
21-Aug-2024 01:25:55 | -rw-r--r-- 1 casaci root 784 Aug 21 05:25 test_task_rmtables.xml |
21-Aug-2024 01:25:55 | -rw-r--r-- 1 casaci root 5002 Aug 21 05:25 test_task_sdatmcor.xml |
21-Aug-2024 01:25:55 | -rw-r--r-- 1 casaci root 17961 Aug 21 05:25 test_task_sdbaseline.xml |
21-Aug-2024 01:25:55 | -rw-r--r-- 1 casaci root 6620 Aug 21 05:25 test_task_sdcal.xml |
21-Aug-2024 01:25:55 | -rw-r--r-- 1 casaci root 4150 Aug 21 05:25 test_task_sdfit.xml |
21-Aug-2024 01:25:55 | -rw-r--r-- 1 casaci root 1835 Aug 21 05:25 test_task_sdfixscan.xml |
21-Aug-2024 01:25:55 | -rw-r--r-- 1 casaci root 1563 Aug 21 05:25 test_task_sdgaincal.xml |
21-Aug-2024 01:25:55 | -rw-r--r-- 1 casaci root 23436 Aug 21 05:25 test_task_sdimaging.xml |
21-Aug-2024 01:25:55 | -rw-r--r-- 1 casaci root 2594 Aug 21 05:25 test_task_sdintimaging.xml |
21-Aug-2024 01:25:55 | -rw-r--r-- 1 casaci root 559 Aug 21 05:25 test_task_sdpolaverage.xml |
21-Aug-2024 01:25:55 | -rw-r--r-- 1 casaci root 2427 Aug 21 05:25 test_task_sdsidebandsplit.xml |
21-Aug-2024 01:25:55 | -rw-r--r-- 1 casaci root 3921 Aug 21 05:25 test_task_sdsmooth.xml |
21-Aug-2024 01:25:55 | -rw-r--r-- 1 casaci root 4373 Aug 21 05:25 test_task_sdtimeaverage.xml |
21-Aug-2024 01:25:55 | -rw-r--r-- 1 casaci root 3426 Aug 21 05:25 test_task_setjy.xml |
21-Aug-2024 01:25:55 | -rw-r--r-- 1 casaci root 1690 Aug 21 05:25 test_task_simanalyze.xml |
21-Aug-2024 01:25:55 | -rw-r--r-- 1 casaci root 12691 Aug 21 05:25 test_task_simobserve.xml |
21-Aug-2024 01:25:55 | -rw-r--r-- 1 casaci root 1485 Aug 21 05:25 test_task_slsearch.xml |
21-Aug-2024 01:25:55 | -rw-r--r-- 1 casaci root 1261 Aug 21 05:25 test_task_smoothcal.xml |
21-Aug-2024 01:25:55 | -rw-r--r-- 1 casaci root 1923 Aug 21 05:25 test_task_specfit.xml |
21-Aug-2024 01:25:55 | -rw-r--r-- 1 casaci root 690 Aug 21 05:25 test_task_specflux.xml |
21-Aug-2024 01:25:55 | -rw-r--r-- 1 casaci root 427 Aug 21 05:25 test_task_specsmooth.xml |
21-Aug-2024 01:25:55 | -rw-r--r-- 1 casaci root 442 Aug 21 05:25 test_task_splattotable.xml |
21-Aug-2024 01:25:55 | -rw-r--r-- 1 casaci root 17876 Aug 21 05:25 test_task_split.xml |
21-Aug-2024 01:25:55 | -rw-r--r-- 1 casaci root 680 Aug 21 05:25 test_task_spxfit.xml |
21-Aug-2024 01:25:55 | -rw-r--r-- 1 casaci root 2383 Aug 21 05:25 test_task_statwt.xml |
21-Aug-2024 01:25:55 | -rw-r--r-- 1 casaci root 35624 Aug 21 05:25 test_task_tclean.xml |
21-Aug-2024 01:25:55 | -rw-r--r-- 1 casaci root 674 Aug 21 05:25 test_task_testconcat.xml |
21-Aug-2024 01:25:55 | -rw-r--r-- 1 casaci root 22570 Aug 21 05:25 test_task_tsdimaging.xml |
21-Aug-2024 01:25:55 | -rw-r--r-- 1 casaci root 817 Aug 21 05:25 test_task_uvcontsub_old.xml |
21-Aug-2024 01:25:55 | -rw-r--r-- 1 casaci root 1496 Aug 21 05:25 test_task_uvmodelfit.xml |
21-Aug-2024 01:25:55 | -rw-r--r-- 1 casaci root 1457 Aug 21 05:25 test_task_virtualconcat.xml |
21-Aug-2024 01:25:55 | -rw-r--r-- 1 casaci root 1070 Aug 21 05:25 test_task_vishead.xml |
21-Aug-2024 01:25:55 | -rw-r--r-- 1 casaci root 3266 Aug 21 05:25 test_task_visstat.xml |
21-Aug-2024 01:25:55 | -rw-r--r-- 1 casaci root 1959 Aug 21 05:25 test_task_wvrgcal.xml |
21-Aug-2024 01:25:55 | Finished task 'Test wheel' with result: Success |
21-Aug-2024 01:25:55 | Starting task 'Package working directory' of type 'com.atlassian.bamboo.plugins.scripttask:task.builder.script' |
21-Aug-2024 01:25:55 | Beginning to execute external process for build 'CASA - CMake Pull Request - CAS-14426 - Test Tasks Many Linux 2.28 #1 (CASA-CPR198-TTAML228-1)' ... running command line: /export/home/cbt-el7-6/bamboohome/temp/CASA-CPR198-TTAML228-1-ScriptBuildTask-6425619933505145435.sh ... in: /export/home/cbt-el7-6/bamboohome/xml-data/build-dir/CASA-CPR198-TTAML228 |
21-Aug-2024 01:25:55 | Package working directory |
21-Aug-2024 01:25:55 | tar: work: Cannot stat: No such file or directory |
21-Aug-2024 01:25:55 | tar: Exiting with failure status due to previous errors |
21-Aug-2024 01:25:55 | total 184932 |
21-Aug-2024 01:25:55 | -rw-r--r-- 1 casaci 15001 1853374 Aug 21 00:20 casatasks-6.6.5.24+dirty-py3-none-any.whl |
21-Aug-2024 01:25:55 | -rw-r--r-- 1 casaci root 4456099 Aug 21 05:25 casatasks_test.log |
21-Aug-2024 01:25:55 | -rw-r--r-- 1 casaci 15001 129194 Aug 21 00:20 casatestutils-6.6.5.24+dirty-py3-none-any.whl |
21-Aug-2024 01:25:55 | -rw-r--r-- 1 casaci 15001 182142368 Aug 21 00:20 casatools-6.6.5.24+dirty-cp38-cp38-manylinux_2_28_x86_64.whl |
21-Aug-2024 01:25:55 | -rw-r--r-- 1 casaci root 2507 Aug 21 05:25 test_casaxmlutil.xml |
21-Aug-2024 01:25:55 | -rw-r--r-- 1 casaci root 2317 Aug 21 05:25 test_flaghelper.xml |
21-Aug-2024 01:25:55 | -rw-r--r-- 1 casaci root 1860 Aug 21 05:25 test_imagerhelpers_gclean.xml |
21-Aug-2024 01:25:55 | -rw-r--r-- 1 casaci root 2658 Aug 21 05:25 test_jyperk.xml |
21-Aug-2024 01:25:55 | -rw-r--r-- 1 casaci root 1796 Aug 21 05:25 test_task_accor.xml |
21-Aug-2024 01:25:55 | -rw-r--r-- 1 casaci root 3051 Aug 21 05:25 test_task_applycal.xml |
21-Aug-2024 01:25:55 | -rw-r--r-- 1 casaci root 629 Aug 21 05:25 test_task_asdmsummary.xml |
21-Aug-2024 01:25:55 | -rw-r--r-- 1 casaci root 805 Aug 21 05:25 test_task_bandpass.xml |
21-Aug-2024 01:25:55 | -rw-r--r-- 1 casaci root 1723 Aug 21 05:25 test_task_blcal.xml |
21-Aug-2024 01:25:55 | -rw-r--r-- 1 casaci root 854 Aug 21 05:25 test_task_calstat.xml |
21-Aug-2024 01:25:55 | -rw-r--r-- 1 casaci root 972 Aug 21 05:25 test_task_clearcal.xml |
21-Aug-2024 01:25:55 | -rw-r--r-- 1 casaci root 663 Aug 21 05:25 test_task_clearstat.xml |
21-Aug-2024 01:25:55 | -rw-r--r-- 1 casaci root 1833 Aug 21 05:25 test_task_concat.xml |
21-Aug-2024 01:25:55 | -rw-r--r-- 1 casaci root 1345 Aug 21 05:25 test_task_conjugatevis.xml |
21-Aug-2024 01:25:55 | -rw-r--r-- 1 casaci root 7399 Aug 21 05:25 test_task_cvel.xml |
21-Aug-2024 01:25:55 | -rw-r--r-- 1 casaci root 5027 Aug 21 05:25 test_task_cvel2.xml |
21-Aug-2024 01:25:55 | -rw-r--r-- 1 casaci root 17642 Aug 21 05:25 test_task_deconvolve.xml |
21-Aug-2024 01:25:55 | -rw-r--r-- 1 casaci root 722 Aug 21 05:25 test_task_defintent.xml |
21-Aug-2024 01:25:55 | -rw-r--r-- 1 casaci root 586 Aug 21 05:25 test_task_delmod.xml |
21-Aug-2024 01:25:55 | -rw-r--r-- 1 casaci root 1772 Aug 21 05:25 test_task_exportasdm.xml |
21-Aug-2024 01:25:55 | -rw-r--r-- 1 casaci root 333 Aug 21 05:25 test_task_exportfits.xml |
21-Aug-2024 01:25:55 | -rw-r--r-- 1 casaci root 1837 Aug 21 05:25 test_task_exportuvfits.xml |
21-Aug-2024 01:25:55 | -rw-r--r-- 1 casaci root 866 Aug 21 05:25 test_task_feather.xml |
21-Aug-2024 01:25:55 | -rw-r--r-- 1 casaci root 1951 Aug 21 05:25 test_task_fixplanets.xml |
21-Aug-2024 01:25:55 | -rw-r--r-- 1 casaci root 1443 Aug 21 05:25 test_task_fixvis.xml |
21-Aug-2024 01:25:55 | -rw-r--r-- 1 casaci root 4601 Aug 21 05:25 test_task_flagcmd.xml |
21-Aug-2024 01:25:55 | -rw-r--r-- 1 casaci root 27907 Aug 21 05:25 test_task_flagdata.xml |
21-Aug-2024 01:25:55 | -rw-r--r-- 1 casaci root 940 Aug 21 05:25 test_task_flagmanager.xml |
21-Aug-2024 01:25:55 | -rw-r--r-- 1 casaci root 2332 Aug 21 05:25 test_task_fluxscale.xml |
21-Aug-2024 01:25:55 | -rw-r--r-- 1 casaci root 1244 Aug 21 05:25 test_task_fringefit.xml |
21-Aug-2024 01:25:55 | -rw-r--r-- 1 casaci root 3231 Aug 21 05:25 test_task_gaincal.xml |
21-Aug-2024 01:25:55 | -rw-r--r-- 1 casaci root 2682 Aug 21 05:25 test_task_gencal.xml |
21-Aug-2024 01:25:55 | -rw-r--r-- 1 casaci root 451 Aug 21 05:25 test_task_getantposalma.xml |
21-Aug-2024 01:25:55 | -rw-r--r-- 1 casaci root 659 Aug 21 05:25 test_task_getcalmodvla.xml |
21-Aug-2024 01:25:55 | -rw-r--r-- 1 casaci root 1015 Aug 21 05:25 test_task_getephemtable.xml |
21-Aug-2024 01:25:55 | -rw-r--r-- 1 casaci root 1206 Aug 21 05:25 test_task_hanningsmooth.xml |
21-Aug-2024 01:25:55 | -rw-r--r-- 1 casaci root 29165 Aug 21 05:25 test_task_imbaseline.xml |
21-Aug-2024 01:25:55 | -rw-r--r-- 1 casaci root 2194 Aug 21 05:25 test_task_imcollapse.xml |
21-Aug-2024 01:25:55 | -rw-r--r-- 1 casaci root 1197 Aug 21 05:25 test_task_imcontsub.xml |
21-Aug-2024 01:25:55 | -rw-r--r-- 1 casaci root 1742 Aug 21 05:25 test_task_imdev.xml |
21-Aug-2024 01:25:55 | -rw-r--r-- 1 casaci root 3166 Aug 21 05:25 test_task_imfit.xml |
21-Aug-2024 01:25:55 | -rw-r--r-- 1 casaci root 2109 Aug 21 05:25 test_task_imhead.xml |
21-Aug-2024 01:25:55 | -rw-r--r-- 1 casaci root 1149 Aug 21 05:25 test_task_imhistory.xml |
21-Aug-2024 01:25:55 | -rw-r--r-- 1 casaci root 3029 Aug 21 05:25 test_task_immath.xml |
21-Aug-2024 01:25:55 | -rw-r--r-- 1 casaci root 1642 Aug 21 05:25 test_task_immoments.xml |
21-Aug-2024 01:25:55 | -rw-r--r-- 1 casaci root 1103 Aug 21 05:25 test_task_impbcor.xml |
21-Aug-2024 01:25:55 | -rw-r--r-- 1 casaci root 726 Aug 21 05:25 test_task_importasap.xml |
21-Aug-2024 01:25:55 | -rw-r--r-- 1 casaci root 3681 Aug 21 05:25 test_task_importasdm.xml |
21-Aug-2024 01:25:55 | -rw-r--r-- 1 casaci root 326 Aug 21 05:25 test_task_importatca.xml |
21-Aug-2024 01:25:55 | -rw-r--r-- 1 casaci root 987 Aug 21 05:25 test_task_importfitsidi.xml |
21-Aug-2024 01:25:55 | -rw-r--r-- 1 casaci root 332 Aug 21 05:25 test_task_importmiriad.xml |
21-Aug-2024 01:25:55 | -rw-r--r-- 1 casaci root 614 Aug 21 05:25 test_task_importnro.xml |
21-Aug-2024 01:25:55 | -rw-r--r-- 1 casaci root 1792 Aug 21 05:25 test_task_importuvfits.xml |
21-Aug-2024 01:25:55 | -rw-r--r-- 1 casaci root 808 Aug 21 05:25 test_task_importvla.xml |
21-Aug-2024 01:25:55 | -rw-r--r-- 1 casaci root 1812 Aug 21 05:25 test_task_impv.xml |
21-Aug-2024 01:25:55 | -rw-r--r-- 1 casaci root 2089 Aug 21 05:25 test_task_imrebin.xml |
21-Aug-2024 01:25:55 | -rw-r--r-- 1 casaci root 804 Aug 21 05:25 test_task_imreframe.xml |
21-Aug-2024 01:25:55 | -rw-r--r-- 1 casaci root 2317 Aug 21 05:25 test_task_imregrid.xml |
21-Aug-2024 01:25:55 | -rw-r--r-- 1 casaci root 1436 Aug 21 05:25 test_task_imsmooth.xml |
21-Aug-2024 01:25:55 | -rw-r--r-- 1 casaci root 1414 Aug 21 05:25 test_task_imstat.xml |
21-Aug-2024 01:25:55 | -rw-r--r-- 1 casaci root 708 Aug 21 05:25 test_task_imsubimage.xml |
21-Aug-2024 01:25:55 | -rw-r--r-- 1 casaci root 778 Aug 21 05:25 test_task_imtrans.xml |
21-Aug-2024 01:25:55 | -rw-r--r-- 1 casaci root 3103 Aug 21 05:25 test_task_imval.xml |
21-Aug-2024 01:25:55 | -rw-r--r-- 1 casaci root 3770 Aug 21 05:25 test_task_initweights.xml |
21-Aug-2024 01:25:55 | -rw-r--r-- 1 casaci root 1458 Aug 21 05:25 test_task_listcal.xml |
21-Aug-2024 01:25:55 | -rw-r--r-- 1 casaci root 486 Aug 21 05:25 test_task_listfits.xml |
21-Aug-2024 01:25:55 | -rw-r--r-- 1 casaci root 726 Aug 21 05:25 test_task_listhistory.xml |
21-Aug-2024 01:25:55 | -rw-r--r-- 1 casaci root 8555 Aug 21 05:25 test_task_listobs.xml |
21-Aug-2024 01:25:55 | -rw-r--r-- 1 casaci root 1494 Aug 21 05:25 test_task_listpartition.xml |
21-Aug-2024 01:25:55 | -rw-r--r-- 1 casaci root 499 Aug 21 05:25 test_task_listsdm.xml |
21-Aug-2024 01:25:55 | -rw-r--r-- 1 casaci root 728 Aug 21 05:25 test_task_listvis.xml |
21-Aug-2024 01:25:55 | -rw-r--r-- 1 casaci root 2637 Aug 21 05:25 test_task_makemask.xml |
21-Aug-2024 01:25:55 | -rw-r--r-- 1 casaci root 34462 Aug 21 05:25 test_task_mstransform.xml |
21-Aug-2024 01:25:55 | -rw-r--r-- 1 casaci root 5821 Aug 21 05:25 test_task_mstransform_mms.xml |
21-Aug-2024 01:25:55 | -rw-r--r-- 1 casaci root 758 Aug 21 05:25 test_task_nrobeamaverage.xml |
21-Aug-2024 01:25:55 | -rw-r--r-- 1 casaci root 3440 Aug 21 05:25 test_task_partition.xml |
21-Aug-2024 01:25:55 | -rw-r--r-- 1 casaci root 1518 Aug 21 05:25 test_task_phaseshift.xml |
21-Aug-2024 01:25:55 | -rw-r--r-- 1 casaci root 1069 Aug 21 05:25 test_task_plotants.xml |
21-Aug-2024 01:25:55 | -rw-r--r-- 1 casaci root 25947 Aug 21 05:25 test_task_plotbandpass.xml |
21-Aug-2024 01:25:55 | -rw-r--r-- 1 casaci root 1770 Aug 21 05:25 test_task_plotprofilemap.xml |
21-Aug-2024 01:25:55 | -rw-r--r-- 1 casaci root 1789 Aug 21 05:25 test_task_plotweather.xml |
21-Aug-2024 01:25:55 | -rw-r--r-- 1 casaci root 3062 Aug 21 05:25 test_task_polcal.xml |
21-Aug-2024 01:25:55 | -rw-r--r-- 1 casaci root 332 Aug 21 05:25 test_task_polfromgain.xml |
21-Aug-2024 01:25:55 | -rw-r--r-- 1 casaci root 1191 Aug 21 05:25 test_task_predictcomp.xml |
21-Aug-2024 01:25:55 | -rw-r--r-- 1 casaci root 947 Aug 21 05:25 test_task_rerefant.xml |
21-Aug-2024 01:25:55 | -rw-r--r-- 1 casaci root 1181 Aug 21 05:25 test_task_rmfit.xml |
21-Aug-2024 01:25:55 | -rw-r--r-- 1 casaci root 784 Aug 21 05:25 test_task_rmtables.xml |
21-Aug-2024 01:25:55 | -rw-r--r-- 1 casaci root 5002 Aug 21 05:25 test_task_sdatmcor.xml |
21-Aug-2024 01:25:55 | -rw-r--r-- 1 casaci root 17961 Aug 21 05:25 test_task_sdbaseline.xml |
21-Aug-2024 01:25:55 | -rw-r--r-- 1 casaci root 6620 Aug 21 05:25 test_task_sdcal.xml |
21-Aug-2024 01:25:55 | -rw-r--r-- 1 casaci root 4150 Aug 21 05:25 test_task_sdfit.xml |
21-Aug-2024 01:25:55 | -rw-r--r-- 1 casaci root 1835 Aug 21 05:25 test_task_sdfixscan.xml |
21-Aug-2024 01:25:55 | -rw-r--r-- 1 casaci root 1563 Aug 21 05:25 test_task_sdgaincal.xml |
21-Aug-2024 01:25:55 | -rw-r--r-- 1 casaci root 23436 Aug 21 05:25 test_task_sdimaging.xml |
21-Aug-2024 01:25:55 | -rw-r--r-- 1 casaci root 2594 Aug 21 05:25 test_task_sdintimaging.xml |
21-Aug-2024 01:25:55 | -rw-r--r-- 1 casaci root 559 Aug 21 05:25 test_task_sdpolaverage.xml |
21-Aug-2024 01:25:55 | -rw-r--r-- 1 casaci root 2427 Aug 21 05:25 test_task_sdsidebandsplit.xml |
21-Aug-2024 01:25:55 | -rw-r--r-- 1 casaci root 3921 Aug 21 05:25 test_task_sdsmooth.xml |
21-Aug-2024 01:25:55 | -rw-r--r-- 1 casaci root 4373 Aug 21 05:25 test_task_sdtimeaverage.xml |
21-Aug-2024 01:25:55 | -rw-r--r-- 1 casaci root 3426 Aug 21 05:25 test_task_setjy.xml |
21-Aug-2024 01:25:55 | -rw-r--r-- 1 casaci root 1690 Aug 21 05:25 test_task_simanalyze.xml |
21-Aug-2024 01:25:55 | -rw-r--r-- 1 casaci root 12691 Aug 21 05:25 test_task_simobserve.xml |
21-Aug-2024 01:25:55 | -rw-r--r-- 1 casaci root 1485 Aug 21 05:25 test_task_slsearch.xml |
21-Aug-2024 01:25:55 | -rw-r--r-- 1 casaci root 1261 Aug 21 05:25 test_task_smoothcal.xml |
21-Aug-2024 01:25:55 | -rw-r--r-- 1 casaci root 1923 Aug 21 05:25 test_task_specfit.xml |
21-Aug-2024 01:25:55 | -rw-r--r-- 1 casaci root 690 Aug 21 05:25 test_task_specflux.xml |
21-Aug-2024 01:25:55 | -rw-r--r-- 1 casaci root 427 Aug 21 05:25 test_task_specsmooth.xml |
21-Aug-2024 01:25:55 | -rw-r--r-- 1 casaci root 442 Aug 21 05:25 test_task_splattotable.xml |
21-Aug-2024 01:25:55 | -rw-r--r-- 1 casaci root 17876 Aug 21 05:25 test_task_split.xml |
21-Aug-2024 01:25:55 | -rw-r--r-- 1 casaci root 680 Aug 21 05:25 test_task_spxfit.xml |
21-Aug-2024 01:25:55 | -rw-r--r-- 1 casaci root 2383 Aug 21 05:25 test_task_statwt.xml |
21-Aug-2024 01:25:55 | -rw-r--r-- 1 casaci root 35624 Aug 21 05:25 test_task_tclean.xml |
21-Aug-2024 01:25:55 | -rw-r--r-- 1 casaci root 674 Aug 21 05:25 test_task_testconcat.xml |
21-Aug-2024 01:25:55 | -rw-r--r-- 1 casaci root 22570 Aug 21 05:25 test_task_tsdimaging.xml |
21-Aug-2024 01:25:55 | -rw-r--r-- 1 casaci root 817 Aug 21 05:25 test_task_uvcontsub_old.xml |
21-Aug-2024 01:25:55 | -rw-r--r-- 1 casaci root 1496 Aug 21 05:25 test_task_uvmodelfit.xml |
21-Aug-2024 01:25:55 | -rw-r--r-- 1 casaci root 1457 Aug 21 05:25 test_task_virtualconcat.xml |
21-Aug-2024 01:25:55 | -rw-r--r-- 1 casaci root 1070 Aug 21 05:25 test_task_vishead.xml |
21-Aug-2024 01:25:55 | -rw-r--r-- 1 casaci root 3266 Aug 21 05:25 test_task_visstat.xml |
21-Aug-2024 01:25:55 | -rw-r--r-- 1 casaci root 1959 Aug 21 05:25 test_task_wvrgcal.xml |
21-Aug-2024 01:25:55 | -rw-r--r-- 1 casaci root 45 Aug 21 05:25 work-el7.tar.gz |
21-Aug-2024 01:25:55 | Done packaging working directory |
21-Aug-2024 01:25:55 | Finished task 'Package working directory' with result: Success |
21-Aug-2024 01:25:55 | Starting task 'Parse tests' of type 'com.atlassian.bamboo.plugins.testresultparser:task.testresultparser.junit' |
21-Aug-2024 01:25:55 | Parsing test results under /export/home/cbt-el7-6/bamboohome/xml-data/build-dir/CASA-CPR198-TTAML228... |
21-Aug-2024 01:25:55 | Finished task 'Parse tests' with result: Success |
21-Aug-2024 01:25:55 | Running post build plugin 'Docker Container Cleanup' |
21-Aug-2024 01:25:55 | Beginning to execute external process for build 'CASA - CMake Pull Request - CAS-14426 - Test Tasks Many Linux 2.28 #1 (CASA-CPR198-TTAML228-1)' ... running command line: /bin/docker rm -f wheel-container-test ... in: /export/home/cbt-el7-6/bamboohome/xml-data/build-dir/CASA-CPR198-TTAML228 |
21-Aug-2024 01:26:00 | wheel-container-test |
21-Aug-2024 01:26:00 | Running post build plugin 'NCover Results Collector' |
21-Aug-2024 01:26:00 | Running post build plugin 'Build Results Label Collector' |
21-Aug-2024 01:26:00 | Running post build plugin 'Clover Results Collector' |
21-Aug-2024 01:26:00 | Running post build plugin 'npm Cache Cleanup' |
21-Aug-2024 01:26:00 | Running post build plugin 'Artifact Copier' |
21-Aug-2024 01:26:00 | Publishing an artifact: Workdir |
21-Aug-2024 01:26:00 | Finished publishing of artifact Non required job artifact Http Compression On : [Workdir], patterns: [work*.tar.gz] anchored at: [wheeldirectory/] in 103.7 ms |
21-Aug-2024 01:26:00 | Publishing an artifact: Tests |
21-Aug-2024 01:26:00 | Finished publishing of artifact Non required job artifact Http Compression On : [Tests], patterns: [*.xml] anchored at: [wheeldirectory/] in 654.4 ms |
21-Aug-2024 01:26:00 | Publishing an artifact: xml Directories |
21-Aug-2024 01:26:02 | Finished publishing of artifact Non required job artifact Http Compression On : [xml Directories], patterns: [**/*.xml] anchored at: [wheeldirectory/] in 1.052 s |
21-Aug-2024 01:26:02 | Publishing an artifact: Casatasks Test Log |
21-Aug-2024 01:26:02 | Finished publishing of artifact Non required job artifact Http Compression On : [Casatasks Test Log], patterns: [casatasks_test.log] anchored at: [wheeldirectory/] in 149.6 ms |
21-Aug-2024 01:26:02 | Finalising the build... |
21-Aug-2024 01:26:02 | Stopping timer. |
21-Aug-2024 01:26:02 | Build CASA-CPR198-TTAML228-1 completed. |
21-Aug-2024 01:26:02 | Running on server: post build plugin 'Build Hanging Detection Configuration' |
21-Aug-2024 01:26:02 | Running on server: post build plugin 'NCover Results Collector' |
21-Aug-2024 01:26:02 | Running on server: post build plugin 'Build Labeller' |
21-Aug-2024 01:26:02 | Running on server: post build plugin 'Clover Delta Calculator' |
21-Aug-2024 01:26:02 | Running on server: post build plugin 'Maven Dependencies Postprocessor' |
21-Aug-2024 01:26:02 | All post build plugins have finished |
21-Aug-2024 01:26:02 | Generating build results summary... |
21-Aug-2024 01:26:03 | Saving build results to disk... |
21-Aug-2024 01:26:03 | Store variable context... |
21-Aug-2024 01:26:03 | Finished building CASA-CPR198-TTAML228-1. |