Build: #25 failed
Job: Test Tasks OSX11 failed
Test results
- 113 tests in total
- 113 tests failed
- < 1 second taken in total.
Build 25 has the following 113 errors:There were no new test failures since the previous build.
Status | Test | Failing since | Duration | |
---|---|---|---|---|
test_asdmsummary
full log
|
Failing since build #24 (Manual run by Ville Suoranta) | < 1 sec | ||
Traceback (most recent call last): File "/Users/casaci/bamboohome/xml-data/build-dir/CASA-C6MP380-TTA11/casa6/casatasks/tests/tasks/test_asdmsummary.py", line 11, in <module> from casatasks.private.casa_transition import is_CASA6 ModuleNotFoundError: No module named 'casatasks' |
||||
test_bandpass
full log
|
Failing since build #24 (Manual run by Ville Suoranta) | < 1 sec | ||
Traceback (most recent call last): File "/Users/casaci/bamboohome/xml-data/build-dir/CASA-C6MP380-TTA11/casa6/casatasks/tests/tasks/test_bandpass.py", line 6, in <module> from casatasks.private.casa_transition import is_CASA6 ModuleNotFoundError: No module named 'casatasks' |
||||
test_clearstat
full log
|
Failing since build #24 (Manual run by Ville Suoranta) | < 1 sec | ||
Traceback (most recent call last): File "/Users/casaci/bamboohome/xml-data/build-dir/CASA-C6MP380-TTA11/casa6/casatasks/tests/tasks/test_clearstat.py", line 8, in <module> from casatasks.private.casa_transition import is_CASA6 ModuleNotFoundError: No module named 'casatasks' |
||||
test_concat
full log
|
Failing since build #24 (Manual run by Ville Suoranta) | < 1 sec | ||
Traceback (most recent call last): File "/Users/casaci/bamboohome/xml-data/build-dir/CASA-C6MP380-TTA11/casa6/casatasks/tests/tasks/test_concat.py", line 17, in <module> from casatasks.private.casa_transition import is_CASA6 ModuleNotFoundError: No module named 'casatasks' |
||||
test_cvel
full log
|
Failing since build #24 (Manual run by Ville Suoranta) | < 1 sec | ||
Traceback (most recent call last): File "/Users/casaci/bamboohome/xml-data/build-dir/CASA-C6MP380-TTA11/casa6/casatasks/tests/tasks/test_cvel.py", line 6, in <module> import numpy ModuleNotFoundError: No module named 'numpy' |
||||
test_cvel2
full log
|
Failing since build #24 (Manual run by Ville Suoranta) | < 1 sec | ||
Traceback (most recent call last): File "/Users/casaci/bamboohome/xml-data/build-dir/CASA-C6MP380-TTA11/casa6/casatasks/tests/tasks/test_cvel2.py", line 5, in <module> import numpy ModuleNotFoundError: No module named 'numpy' |
||||
test_exportasdm
full log
|
Failing since build #24 (Manual run by Ville Suoranta) | < 1 sec | ||
Traceback (most recent call last): File "/Users/casaci/bamboohome/xml-data/build-dir/CASA-C6MP380-TTA11/casa6/casatasks/tests/tasks/test_exportasdm.py", line 9, in <module> from casatasks.private.casa_transition import is_CASA6 ModuleNotFoundError: No module named 'casatasks' |
||||
test_exportfits
full log
|
Failing since build #24 (Manual run by Ville Suoranta) | < 1 sec | ||
Traceback (most recent call last): File "/Users/casaci/bamboohome/xml-data/build-dir/CASA-C6MP380-TTA11/casa6/casatasks/tests/tasks/test_exportfits.py", line 2, in <module> import numpy ModuleNotFoundError: No module named 'numpy' |
||||
test_exportuvfits
full log
|
Failing since build #24 (Manual run by Ville Suoranta) | < 1 sec | ||
Traceback (most recent call last): File "/Users/casaci/bamboohome/xml-data/build-dir/CASA-C6MP380-TTA11/casa6/casatasks/tests/tasks/test_exportuvfits.py", line 7, in <module> import numpy as np ModuleNotFoundError: No module named 'numpy' |
||||
test_fixplanets
full log
|
Failing since build #24 (Manual run by Ville Suoranta) | < 1 sec | ||
Traceback (most recent call last): File "/Users/casaci/bamboohome/xml-data/build-dir/CASA-C6MP380-TTA11/casa6/casatasks/tests/tasks/test_fixplanets.py", line 8, in <module> from casatasks.private.casa_transition import is_CASA6 ModuleNotFoundError: No module named 'casatasks' |
||||
test_fixvis
full log
|
Failing since build #24 (Manual run by Ville Suoranta) | < 1 sec | ||
Traceback (most recent call last): File "/Users/casaci/bamboohome/xml-data/build-dir/CASA-C6MP380-TTA11/casa6/casatasks/tests/tasks/test_fixvis.py", line 8, in <module> from casatasks.private.casa_transition import is_CASA6 ModuleNotFoundError: No module named 'casatasks' |
||||
test_flagcmd
full log
|
Failing since build #24 (Manual run by Ville Suoranta) | < 1 sec | ||
Traceback (most recent call last): File "/Users/casaci/bamboohome/xml-data/build-dir/CASA-C6MP380-TTA11/casa6/casatasks/tests/tasks/test_flagcmd.py", line 8, in <module> from casatasks.private.casa_transition import is_CASA6 ModuleNotFoundError: No module named 'casatasks' |
||||
test_flagdata
full log
|
Failing since build #24 (Manual run by Ville Suoranta) | < 1 sec | ||
Traceback (most recent call last): File "/Users/casaci/bamboohome/xml-data/build-dir/CASA-C6MP380-TTA11/casa6/casatasks/tests/tasks/test_flagdata.py", line 8, in <module> import numpy as np ModuleNotFoundError: No module named 'numpy' |
||||
test_flagmanager
full log
|
Failing since build #24 (Manual run by Ville Suoranta) | < 1 sec | ||
Traceback (most recent call last): File "/Users/casaci/bamboohome/xml-data/build-dir/CASA-C6MP380-TTA11/casa6/casatasks/tests/tasks/test_flagmanager.py", line 8, in <module> from casatasks.private.casa_transition import is_CASA6 ModuleNotFoundError: No module named 'casatasks' |
||||
test_fringefit
full log
|
Failing since build #24 (Manual run by Ville Suoranta) | < 1 sec | ||
Traceback (most recent call last): File "/Users/casaci/bamboohome/xml-data/build-dir/CASA-C6MP380-TTA11/casa6/casatasks/tests/tasks/test_fringefit.py", line 15, in <module> from casatasks.private.casa_transition import * ModuleNotFoundError: No module named 'casatasks' |
||||
test_gencal
full log
|
Failing since build #24 (Manual run by Ville Suoranta) | < 1 sec | ||
Traceback (most recent call last): File "/Users/casaci/bamboohome/xml-data/build-dir/CASA-C6MP380-TTA11/casa6/casatasks/tests/tasks/test_gencal.py", line 6, in <module> import numpy as np ModuleNotFoundError: No module named 'numpy' |
||||
test_hanningsmooth
full log
|
Failing since build #24 (Manual run by Ville Suoranta) | < 1 sec | ||
Traceback (most recent call last): File "/Users/casaci/bamboohome/xml-data/build-dir/CASA-C6MP380-TTA11/casa6/casatasks/tests/tasks/test_hanningsmooth.py", line 7, in <module> from casatasks.private.casa_transition import is_CASA6 ModuleNotFoundError: No module named 'casatasks' |
||||
test_imcollapse
full log
|
Failing since build #24 (Manual run by Ville Suoranta) | < 1 sec | ||
Traceback (most recent call last): File "/Users/casaci/bamboohome/xml-data/build-dir/CASA-C6MP380-TTA11/casa6/casatasks/tests/tasks/test_imcollapse.py", line 72, in <module> import numpy ModuleNotFoundError: No module named 'numpy' |
||||
test_imcontsub
full log
|
Failing since build #24 (Manual run by Ville Suoranta) | < 1 sec | ||
Traceback (most recent call last): File "/Users/casaci/bamboohome/xml-data/build-dir/CASA-C6MP380-TTA11/casa6/casatasks/tests/tasks/test_imcontsub.py", line 105, in <module> from casatasks.private.casa_transition import is_CASA6 ModuleNotFoundError: No module named 'casatasks' |
||||
test_imfit
full log
|
Failing since build #24 (Manual run by Ville Suoranta) | < 1 sec | ||
Traceback (most recent call last): File "/Users/casaci/bamboohome/xml-data/build-dir/CASA-C6MP380-TTA11/casa6/casatasks/tests/tasks/test_imfit.py", line 71, in <module> import numpy ModuleNotFoundError: No module named 'numpy' |
||||
test_immath
full log
|
Failing since build #24 (Manual run by Ville Suoranta) | < 1 sec | ||
Traceback (most recent call last): File "/Users/casaci/bamboohome/xml-data/build-dir/CASA-C6MP380-TTA11/casa6/casatasks/tests/tasks/test_immath.py", line 91, in <module> import numpy as np ModuleNotFoundError: No module named 'numpy' |
||||
test_immoments
full log
|
Failing since build #24 (Manual run by Ville Suoranta) | < 1 sec | ||
Traceback (most recent call last): File "/Users/casaci/bamboohome/xml-data/build-dir/CASA-C6MP380-TTA11/casa6/casatasks/tests/tasks/test_immoments.py", line 94, in <module> import numpy ModuleNotFoundError: No module named 'numpy' |
||||
test_importasap
full log
|
Failing since build #24 (Manual run by Ville Suoranta) | < 1 sec | ||
Traceback (most recent call last): File "/Users/casaci/bamboohome/xml-data/build-dir/CASA-C6MP380-TTA11/casa6/casatasks/tests/tasks/test_importasap.py", line 8, in <module> import numpy ModuleNotFoundError: No module named 'numpy' |
||||
test_importasdm
full log
|
Failing since build #24 (Manual run by Ville Suoranta) | < 1 sec | ||
Traceback (most recent call last): File "/Users/casaci/bamboohome/xml-data/build-dir/CASA-C6MP380-TTA11/casa6/casatasks/tests/tasks/test_importasdm.py", line 33, in <module> import numpy ModuleNotFoundError: No module named 'numpy' |
||||
test_importatca
full log
|
Failing since build #24 (Manual run by Ville Suoranta) | < 1 sec | ||
Traceback (most recent call last): File "/Users/casaci/bamboohome/xml-data/build-dir/CASA-C6MP380-TTA11/casa6/casatasks/tests/tasks/test_importatca.py", line 25, in <module> import numpy ModuleNotFoundError: No module named 'numpy' |
||||
test_importfitsidi
full log
|
Failing since build #24 (Manual run by Ville Suoranta) | < 1 sec | ||
Traceback (most recent call last): File "/Users/casaci/bamboohome/xml-data/build-dir/CASA-C6MP380-TTA11/casa6/casatasks/tests/tasks/test_importfitsidi.py", line 25, in <module> import numpy ModuleNotFoundError: No module named 'numpy' |
||||
test_importmiriad
full log
|
Failing since build #24 (Manual run by Ville Suoranta) | < 1 sec | ||
Traceback (most recent call last): File "/Users/casaci/bamboohome/xml-data/build-dir/CASA-C6MP380-TTA11/casa6/casatasks/tests/tasks/test_importmiriad.py", line 26, in <module> from casatasks.private.casa_transition import is_CASA6 ModuleNotFoundError: No module named 'casatasks' |
||||
test_importnro
full log
|
Failing since build #24 (Manual run by Ville Suoranta) | < 1 sec | ||
Traceback (most recent call last): File "/Users/casaci/bamboohome/xml-data/build-dir/CASA-C6MP380-TTA11/casa6/casatasks/tests/tasks/test_importnro.py", line 7, in <module> import numpy ModuleNotFoundError: No module named 'numpy' |
||||
test_importvla
full log
|
Failing since build #24 (Manual run by Ville Suoranta) | < 1 sec | ||
Traceback (most recent call last): File "/Users/casaci/bamboohome/xml-data/build-dir/CASA-C6MP380-TTA11/casa6/casatasks/tests/tasks/test_importvla.py", line 7, in <module> import numpy as np ModuleNotFoundError: No module named 'numpy' |
||||
test_imrebin
full log
|
Failing since build #24 (Manual run by Ville Suoranta) | < 1 sec | ||
Traceback (most recent call last): File "/Users/casaci/bamboohome/xml-data/build-dir/CASA-C6MP380-TTA11/casa6/casatasks/tests/tasks/test_imrebin.py", line 71, in <module> import numpy ModuleNotFoundError: No module named 'numpy' |
||||
test_imregrid
full log
|
Failing since build #24 (Manual run by Ville Suoranta) | < 1 sec | ||
Traceback (most recent call last): File "/Users/casaci/bamboohome/xml-data/build-dir/CASA-C6MP380-TTA11/casa6/casatasks/tests/tasks/test_imregrid.py", line 9, in <module> import numpy as np ModuleNotFoundError: No module named 'numpy' |
||||
test_imsmooth
full log
|
Failing since build #24 (Manual run by Ville Suoranta) | < 1 sec | ||
Traceback (most recent call last): File "/Users/casaci/bamboohome/xml-data/build-dir/CASA-C6MP380-TTA11/casa6/casatasks/tests/tasks/test_imsmooth.py", line 33, in <module> import numpy ModuleNotFoundError: No module named 'numpy' |
||||
test_imsubimage
full log
|
Failing since build #24 (Manual run by Ville Suoranta) | < 1 sec | ||
Traceback (most recent call last): File "/Users/casaci/bamboohome/xml-data/build-dir/CASA-C6MP380-TTA11/casa6/casatasks/tests/tasks/test_imsubimage.py", line 4, in <module> import numpy ModuleNotFoundError: No module named 'numpy' |
||||
test_imval
full log
|
Failing since build #24 (Manual run by Ville Suoranta) | < 1 sec | ||
Traceback (most recent call last): File "/Users/casaci/bamboohome/xml-data/build-dir/CASA-C6MP380-TTA11/casa6/casatasks/tests/tasks/test_imval.py", line 113, in <module> import numpy ModuleNotFoundError: No module named 'numpy' |
||||
test_initweights
full log
|
Failing since build #24 (Manual run by Ville Suoranta) | < 1 sec | ||
Traceback (most recent call last): File "/Users/casaci/bamboohome/xml-data/build-dir/CASA-C6MP380-TTA11/casa6/casatasks/tests/tasks/test_initweights.py", line 5, in <module> import numpy ModuleNotFoundError: No module named 'numpy' |
||||
test_listfits
full log
|
Failing since build #24 (Manual run by Ville Suoranta) | < 1 sec | ||
Traceback (most recent call last): File "/Users/casaci/bamboohome/xml-data/build-dir/CASA-C6MP380-TTA11/casa6/casatasks/tests/tasks/test_listfits.py", line 8, in <module> from casatasks.private.casa_transition import is_CASA6 ModuleNotFoundError: No module named 'casatasks' |
||||
test_listpartition
full log
|
Failing since build #24 (Manual run by Ville Suoranta) | < 1 sec | ||
Traceback (most recent call last): File "/Users/casaci/bamboohome/xml-data/build-dir/CASA-C6MP380-TTA11/casa6/casatasks/tests/tasks/test_listpartition.py", line 9, in <module> from casatasks.private.casa_transition import is_CASA6 ModuleNotFoundError: No module named 'casatasks' |
||||
test_listvis
full log
|
Failing since build #24 (Manual run by Ville Suoranta) | < 1 sec | ||
Traceback (most recent call last): File "/Users/casaci/bamboohome/xml-data/build-dir/CASA-C6MP380-TTA11/casa6/casatasks/tests/tasks/test_listvis.py", line 8, in <module> from casatasks.private.casa_transition import * ModuleNotFoundError: No module named 'casatasks' |
||||
test_makemask
full log
|
Failing since build #24 (Manual run by Ville Suoranta) | < 1 sec | ||
Traceback (most recent call last): File "/Users/casaci/bamboohome/xml-data/build-dir/CASA-C6MP380-TTA11/casa6/casatasks/tests/tasks/test_makemask.py", line 6, in <module> import numpy ModuleNotFoundError: No module named 'numpy' |
||||
test_mstransform
full log
|
Failing since build #24 (Manual run by Ville Suoranta) | < 1 sec | ||
Traceback (most recent call last): File "/Users/casaci/bamboohome/xml-data/build-dir/CASA-C6MP380-TTA11/casa6/casatasks/tests/tasks/test_mstransform.py", line 6, in <module> import numpy ModuleNotFoundError: No module named 'numpy' |
||||
test_mstransform_mms
full log
|
Failing since build #24 (Manual run by Ville Suoranta) | < 1 sec | ||
Traceback (most recent call last): File "/Users/casaci/bamboohome/xml-data/build-dir/CASA-C6MP380-TTA11/casa6/casatasks/tests/tasks/test_mstransform_mms.py", line 6, in <module> from casatestutils import testhelper as th ModuleNotFoundError: No module named 'casatestutils' |
||||
test_nrobeamaverage
full log
|
Failing since build #24 (Manual run by Ville Suoranta) | < 1 sec | ||
Traceback (most recent call last): File "/Users/casaci/bamboohome/xml-data/build-dir/CASA-C6MP380-TTA11/casa6/casatasks/tests/tasks/test_nrobeamaverage.py", line 8, in <module> from casatestutils import testhelper as th ModuleNotFoundError: No module named 'casatestutils' |
||||
test_partition
full log
|
Failing since build #24 (Manual run by Ville Suoranta) | < 1 sec | ||
Traceback (most recent call last): File "/Users/casaci/bamboohome/xml-data/build-dir/CASA-C6MP380-TTA11/casa6/casatasks/tests/tasks/test_partition.py", line 6, in <module> from casatestutils import testhelper as th ModuleNotFoundError: No module named 'casatestutils' |
||||
test_plotants
full log
|
Failing since build #24 (Manual run by Ville Suoranta) | < 1 sec | ||
Traceback (most recent call last): File "/Users/casaci/bamboohome/xml-data/build-dir/CASA-C6MP380-TTA11/casa6/casatasks/tests/tasks/test_plotants.py", line 7, in <module> from casatasks.private.casa_transition import is_CASA6 ModuleNotFoundError: No module named 'casatasks' |
||||
test_plotbandpass
full log
|
Failing since build #24 (Manual run by Ville Suoranta) | < 1 sec | ||
Traceback (most recent call last): File "/Users/casaci/bamboohome/xml-data/build-dir/CASA-C6MP380-TTA11/casa6/casatasks/tests/tasks/test_plotbandpass.py", line 26, in <module> import numpy as np ModuleNotFoundError: No module named 'numpy' |
||||
test_plotprofilemap
full log
|
Failing since build #24 (Manual run by Ville Suoranta) | < 1 sec | ||
Traceback (most recent call last): File "/Users/casaci/bamboohome/xml-data/build-dir/CASA-C6MP380-TTA11/casa6/casatasks/tests/tasks/test_plotprofilemap.py", line 6, in <module> import numpy ModuleNotFoundError: No module named 'numpy' |
||||
test_plotweather
full log
|
Failing since build #24 (Manual run by Ville Suoranta) | < 1 sec | ||
Traceback (most recent call last): File "/Users/casaci/bamboohome/xml-data/build-dir/CASA-C6MP380-TTA11/casa6/casatasks/tests/tasks/test_plotweather.py", line 8, in <module> from casatasks.private.casa_transition import is_CASA6 ModuleNotFoundError: No module named 'casatasks' |
||||
test_predictcomp
full log
|
Failing since build #24 (Manual run by Ville Suoranta) | < 1 sec | ||
Traceback (most recent call last): File "/Users/casaci/bamboohome/xml-data/build-dir/CASA-C6MP380-TTA11/casa6/casatasks/tests/tasks/test_predictcomp.py", line 5, in <module> import numpy as np ModuleNotFoundError: No module named 'numpy' |
||||
test_req_task_accor
full log
|
Failing since build #24 (Manual run by Ville Suoranta) | < 1 sec | ||
Traceback (most recent call last): File "/Users/casaci/bamboohome/xml-data/build-dir/CASA-C6MP380-TTA11/casa6/casatasks/tests/tasks/test_req_task_accor.py", line 27, in <module> import casatools ModuleNotFoundError: No module named 'casatools' During handling of the above exception, another exception occurred: Traceback (most recent call last): (3 more lines...) |
||||
test_req_task_applycal
full log
|
Failing since build #24 (Manual run by Ville Suoranta) | < 1 sec | ||
Traceback (most recent call last): File "/Users/casaci/bamboohome/xml-data/build-dir/CASA-C6MP380-TTA11/casa6/casatasks/tests/tasks/test_req_task_applycal.py", line 27, in <module> import casatools ModuleNotFoundError: No module named 'casatools' During handling of the above exception, another exception occurred: Traceback (most recent call last): (3 more lines...) |
||||
test_req_task_blcal
full log
|
Failing since build #24 (Manual run by Ville Suoranta) | < 1 sec | ||
Traceback (most recent call last): File "/Users/casaci/bamboohome/xml-data/build-dir/CASA-C6MP380-TTA11/casa6/casatasks/tests/tasks/test_req_task_blcal.py", line 26, in <module> import casatools ModuleNotFoundError: No module named 'casatools' During handling of the above exception, another exception occurred: Traceback (most recent call last): (3 more lines...) |
||||
test_req_task_calstat
full log
|
Failing since build #24 (Manual run by Ville Suoranta) | < 1 sec | ||
Traceback (most recent call last): File "/Users/casaci/bamboohome/xml-data/build-dir/CASA-C6MP380-TTA11/casa6/casatasks/tests/tasks/test_req_task_calstat.py", line 33, in <module> import casatools ModuleNotFoundError: No module named 'casatools' During handling of the above exception, another exception occurred: Traceback (most recent call last): (3 more lines...) |
||||
test_req_task_clearcal
full log
|
Failing since build #24 (Manual run by Ville Suoranta) | < 1 sec | ||
Traceback (most recent call last): File "/Users/casaci/bamboohome/xml-data/build-dir/CASA-C6MP380-TTA11/casa6/casatasks/tests/tasks/test_req_task_clearcal.py", line 34, in <module> import casatools ModuleNotFoundError: No module named 'casatools' During handling of the above exception, another exception occurred: Traceback (most recent call last): (3 more lines...) |
||||
test_req_task_conjugatevis
full log
|
Failing since build #24 (Manual run by Ville Suoranta) | < 1 sec | ||
Traceback (most recent call last): File "/Users/casaci/bamboohome/xml-data/build-dir/CASA-C6MP380-TTA11/casa6/casatasks/tests/tasks/test_req_task_conjugatevis.py", line 30, in <module> import casatools ModuleNotFoundError: No module named 'casatools' During handling of the above exception, another exception occurred: Traceback (most recent call last): (3 more lines...) |
||||
test_req_task_delmod
full log
|
Failing since build #24 (Manual run by Ville Suoranta) | < 1 sec | ||
Traceback (most recent call last): File "/Users/casaci/bamboohome/xml-data/build-dir/CASA-C6MP380-TTA11/casa6/casatasks/tests/tasks/test_req_task_delmod.py", line 31, in <module> import casatools ModuleNotFoundError: No module named 'casatools' During handling of the above exception, another exception occurred: Traceback (most recent call last): (3 more lines...) |
||||
test_req_task_feather
full log
|
Failing since build #24 (Manual run by Ville Suoranta) | < 1 sec | ||
Traceback (most recent call last): File "/Users/casaci/bamboohome/xml-data/build-dir/CASA-C6MP380-TTA11/casa6/casatasks/tests/tasks/test_req_task_feather.py", line 27, in <module> import casatools ModuleNotFoundError: No module named 'casatools' During handling of the above exception, another exception occurred: Traceback (most recent call last): (3 more lines...) |
||||
test_req_task_fixplanets
full log
|
Failing since build #24 (Manual run by Ville Suoranta) | < 1 sec | ||
Traceback (most recent call last): File "/Users/casaci/bamboohome/xml-data/build-dir/CASA-C6MP380-TTA11/casa6/casatasks/tests/tasks/test_req_task_fixplanets.py", line 27, in <module> import casatools ModuleNotFoundError: No module named 'casatools' During handling of the above exception, another exception occurred: Traceback (most recent call last): (3 more lines...) |
||||
test_req_task_fluxscale
full log
|
Failing since build #24 (Manual run by Ville Suoranta) | < 1 sec | ||
Traceback (most recent call last): File "/Users/casaci/bamboohome/xml-data/build-dir/CASA-C6MP380-TTA11/casa6/casatasks/tests/tasks/test_req_task_fluxscale.py", line 27, in <module> import casatools ModuleNotFoundError: No module named 'casatools' During handling of the above exception, another exception occurred: Traceback (most recent call last): (3 more lines...) |
||||
test_req_task_ft
full log
|
Failing since build #24 (Manual run by Ville Suoranta) | < 1 sec | ||
Traceback (most recent call last): File "/Users/casaci/bamboohome/xml-data/build-dir/CASA-C6MP380-TTA11/casa6/casatasks/tests/tasks/test_req_task_ft.py", line 33, in <module> import casatools ModuleNotFoundError: No module named 'casatools' During handling of the above exception, another exception occurred: Traceback (most recent call last): (3 more lines...) |
||||
test_req_task_gaincal
full log
|
Failing since build #24 (Manual run by Ville Suoranta) | < 1 sec | ||
Traceback (most recent call last): File "/Users/casaci/bamboohome/xml-data/build-dir/CASA-C6MP380-TTA11/casa6/casatasks/tests/tasks/test_req_task_gaincal.py", line 27, in <module> import casatools ModuleNotFoundError: No module named 'casatools' During handling of the above exception, another exception occurred: Traceback (most recent call last): (3 more lines...) |
||||
test_req_task_imdev
full log
|
Failing since build #24 (Manual run by Ville Suoranta) | < 1 sec | ||
Traceback (most recent call last): File "/Users/casaci/bamboohome/xml-data/build-dir/CASA-C6MP380-TTA11/casa6/casatasks/tests/tasks/test_req_task_imdev.py", line 27, in <module> import casatools ModuleNotFoundError: No module named 'casatools' During handling of the above exception, another exception occurred: Traceback (most recent call last): (3 more lines...) |
||||
test_req_task_imhead
full log
|
Failing since build #24 (Manual run by Ville Suoranta) | < 1 sec | ||
Traceback (most recent call last): File "/Users/casaci/bamboohome/xml-data/build-dir/CASA-C6MP380-TTA11/casa6/casatasks/tests/tasks/test_req_task_imhead.py", line 26, in <module> import casatools ModuleNotFoundError: No module named 'casatools' During handling of the above exception, another exception occurred: Traceback (most recent call last): (3 more lines...) |
||||
test_req_task_imhistory
full log
|
Failing since build #24 (Manual run by Ville Suoranta) | < 1 sec | ||
Traceback (most recent call last): File "/Users/casaci/bamboohome/xml-data/build-dir/CASA-C6MP380-TTA11/casa6/casatasks/tests/tasks/test_req_task_imhistory.py", line 27, in <module> import casatools ModuleNotFoundError: No module named 'casatools' During handling of the above exception, another exception occurred: Traceback (most recent call last): (3 more lines...) |
||||
test_req_task_impbcor
full log
|
Failing since build #24 (Manual run by Ville Suoranta) | < 1 sec | ||
Traceback (most recent call last): File "/Users/casaci/bamboohome/xml-data/build-dir/CASA-C6MP380-TTA11/casa6/casatasks/tests/tasks/test_req_task_impbcor.py", line 29, in <module> from casatools import ctsys, image, table ModuleNotFoundError: No module named 'casatools' During handling of the above exception, another exception occurred: Traceback (most recent call last): (3 more lines...) |
||||
test_req_task_importuvfits
full log
|
Failing since build #24 (Manual run by Ville Suoranta) | < 1 sec | ||
Traceback (most recent call last): File "/Users/casaci/bamboohome/xml-data/build-dir/CASA-C6MP380-TTA11/casa6/casatasks/tests/tasks/test_req_task_importuvfits.py", line 39, in <module> import casatools ModuleNotFoundError: No module named 'casatools' During handling of the above exception, another exception occurred: Traceback (most recent call last): (3 more lines...) |
||||
test_req_task_impv
full log
|
Failing since build #24 (Manual run by Ville Suoranta) | < 1 sec | ||
Traceback (most recent call last): File "/Users/casaci/bamboohome/xml-data/build-dir/CASA-C6MP380-TTA11/casa6/casatasks/tests/tasks/test_req_task_impv.py", line 26, in <module> import numpy ModuleNotFoundError: No module named 'numpy' |
||||
test_req_task_imrebin
full log
|
Failing since build #24 (Manual run by Ville Suoranta) | < 1 sec | ||
Traceback (most recent call last): File "/Users/casaci/bamboohome/xml-data/build-dir/CASA-C6MP380-TTA11/casa6/casatasks/tests/tasks/test_req_task_imrebin.py", line 27, in <module> import casatools ModuleNotFoundError: No module named 'casatools' During handling of the above exception, another exception occurred: Traceback (most recent call last): (3 more lines...) |
||||
test_req_task_imreframe
full log
|
Failing since build #24 (Manual run by Ville Suoranta) | < 1 sec | ||
Traceback (most recent call last): File "/Users/casaci/bamboohome/xml-data/build-dir/CASA-C6MP380-TTA11/casa6/casatasks/tests/tasks/test_req_task_imreframe.py", line 27, in <module> import casatools ModuleNotFoundError: No module named 'casatools' During handling of the above exception, another exception occurred: Traceback (most recent call last): (3 more lines...) |
||||
test_req_task_imstat
full log
|
Failing since build #24 (Manual run by Ville Suoranta) | < 1 sec | ||
Traceback (most recent call last): File "/Users/casaci/bamboohome/xml-data/build-dir/CASA-C6MP380-TTA11/casa6/casatasks/tests/tasks/test_req_task_imstat.py", line 31, in <module> import numpy as np ModuleNotFoundError: No module named 'numpy' |
||||
test_req_task_imtrans
full log
|
Failing since build #24 (Manual run by Ville Suoranta) | < 1 sec | ||
Traceback (most recent call last): File "/Users/casaci/bamboohome/xml-data/build-dir/CASA-C6MP380-TTA11/casa6/casatasks/tests/tasks/test_req_task_imtrans.py", line 32, in <module> from casatools import ctsys, image, table ModuleNotFoundError: No module named 'casatools' During handling of the above exception, another exception occurred: Traceback (most recent call last): (3 more lines...) |
||||
test_req_task_listcal
full log
|
Failing since build #24 (Manual run by Ville Suoranta) | < 1 sec | ||
Traceback (most recent call last): File "/Users/casaci/bamboohome/xml-data/build-dir/CASA-C6MP380-TTA11/casa6/casatasks/tests/tasks/test_req_task_listcal.py", line 22, in <module> import casatools ModuleNotFoundError: No module named 'casatools' During handling of the above exception, another exception occurred: Traceback (most recent call last): (3 more lines...) |
||||
test_req_task_listhistory
full log
|
Failing since build #24 (Manual run by Ville Suoranta) | < 1 sec | ||
Traceback (most recent call last): File "/Users/casaci/bamboohome/xml-data/build-dir/CASA-C6MP380-TTA11/casa6/casatasks/tests/tasks/test_req_task_listhistory.py", line 27, in <module> import casatools ModuleNotFoundError: No module named 'casatools' During handling of the above exception, another exception occurred: Traceback (most recent call last): (3 more lines...) |
||||
test_req_task_listobs
full log
|
Failing since build #24 (Manual run by Ville Suoranta) | < 1 sec | ||
Traceback (most recent call last): File "/Users/casaci/bamboohome/xml-data/build-dir/CASA-C6MP380-TTA11/casa6/casatasks/tests/tasks/test_req_task_listobs.py", line 59, in <module> import numpy as np ModuleNotFoundError: No module named 'numpy' |
||||
test_req_task_listsdm
full log
|
Failing since build #24 (Manual run by Ville Suoranta) | < 1 sec | ||
Traceback (most recent call last): File "/Users/casaci/bamboohome/xml-data/build-dir/CASA-C6MP380-TTA11/casa6/casatasks/tests/tasks/test_req_task_listsdm.py", line 29, in <module> import casatools ModuleNotFoundError: No module named 'casatools' During handling of the above exception, another exception occurred: Traceback (most recent call last): (3 more lines...) |
||||
test_req_task_polcal
full log
|
Failing since build #24 (Manual run by Ville Suoranta) | < 1 sec | ||
Traceback (most recent call last): File "/Users/casaci/bamboohome/xml-data/build-dir/CASA-C6MP380-TTA11/casa6/casatasks/tests/tasks/test_req_task_polcal.py", line 27, in <module> import casatools ModuleNotFoundError: No module named 'casatools' During handling of the above exception, another exception occurred: Traceback (most recent call last): (3 more lines...) |
||||
test_req_task_polfromgain
full log
|
Failing since build #24 (Manual run by Ville Suoranta) | < 1 sec | ||
Traceback (most recent call last): File "/Users/casaci/bamboohome/xml-data/build-dir/CASA-C6MP380-TTA11/casa6/casatasks/tests/tasks/test_req_task_polfromgain.py", line 27, in <module> import casatools ModuleNotFoundError: No module named 'casatools' During handling of the above exception, another exception occurred: Traceback (most recent call last): (3 more lines...) |
||||
test_req_task_rerefant
full log
|
Failing since build #24 (Manual run by Ville Suoranta) | < 1 sec | ||
Traceback (most recent call last): File "/Users/casaci/bamboohome/xml-data/build-dir/CASA-C6MP380-TTA11/casa6/casatasks/tests/tasks/test_req_task_rerefant.py", line 27, in <module> import casatools ModuleNotFoundError: No module named 'casatools' During handling of the above exception, another exception occurred: Traceback (most recent call last): (3 more lines...) |
||||
test_req_task_rmfit
full log
|
Failing since build #24 (Manual run by Ville Suoranta) | < 1 sec | ||
Traceback (most recent call last): File "/Users/casaci/bamboohome/xml-data/build-dir/CASA-C6MP380-TTA11/casa6/casatasks/tests/tasks/test_req_task_rmfit.py", line 27, in <module> import casatools ModuleNotFoundError: No module named 'casatools' During handling of the above exception, another exception occurred: Traceback (most recent call last): (3 more lines...) |
||||
test_req_task_rmtables
full log
|
Failing since build #24 (Manual run by Ville Suoranta) | < 1 sec | ||
Traceback (most recent call last): File "/Users/casaci/bamboohome/xml-data/build-dir/CASA-C6MP380-TTA11/casa6/casatasks/tests/tasks/test_req_task_rmtables.py", line 37, in <module> import casatools ModuleNotFoundError: No module named 'casatools' During handling of the above exception, another exception occurred: Traceback (most recent call last): (3 more lines...) |
||||
test_req_task_sdintimaging
full log
|
Failing since build #24 (Manual run by Ville Suoranta) | < 1 sec | ||
Traceback (most recent call last): File "/Users/casaci/bamboohome/xml-data/build-dir/CASA-C6MP380-TTA11/casa6/casatasks/tests/tasks/test_req_task_sdintimaging.py", line 103, in <module> import numpy as np ModuleNotFoundError: No module named 'numpy' |
||||
test_req_task_simanalyze
full log
|
Failing since build #24 (Manual run by Ville Suoranta) | < 1 sec | ||
Traceback (most recent call last): File "/Users/casaci/bamboohome/xml-data/build-dir/CASA-C6MP380-TTA11/casa6/casatasks/tests/tasks/test_req_task_simanalyze.py", line 44, in <module> from __main__ import default ImportError: cannot import name 'default' from '__main__' (/Users/casaci/bamboohome/xml-data/build-dir/CASA-C6MP380-TTA11/casa6/casatasks/tests/tasks/test_req_task_simanalyze.py) |
||||
test_req_task_statwt
full log
|
Failing since build #24 (Manual run by Ville Suoranta) | < 1 sec | ||
Traceback (most recent call last): File "/Users/casaci/bamboohome/xml-data/build-dir/CASA-C6MP380-TTA11/casa6/casatasks/tests/tasks/test_req_task_statwt.py", line 5, in <module> import numpy as np ModuleNotFoundError: No module named 'numpy' |
||||
test_req_task_uvmodelfit
full log
|
Failing since build #24 (Manual run by Ville Suoranta) | < 1 sec | ||
Traceback (most recent call last): File "/Users/casaci/bamboohome/xml-data/build-dir/CASA-C6MP380-TTA11/casa6/casatasks/tests/tasks/test_req_task_uvmodelfit.py", line 27, in <module> import casatools ModuleNotFoundError: No module named 'casatools' During handling of the above exception, another exception occurred: Traceback (most recent call last): (3 more lines...) |
||||
test_req_task_vishead
full log
|
Failing since build #24 (Manual run by Ville Suoranta) | < 1 sec | ||
Traceback (most recent call last): File "/Users/casaci/bamboohome/xml-data/build-dir/CASA-C6MP380-TTA11/casa6/casatasks/tests/tasks/test_req_task_vishead.py", line 27, in <module> import casatools ModuleNotFoundError: No module named 'casatools' During handling of the above exception, another exception occurred: Traceback (most recent call last): (3 more lines...) |
||||
test_req_task_visstat
full log
|
Failing since build #24 (Manual run by Ville Suoranta) | < 1 sec | ||
Traceback (most recent call last): File "/Users/casaci/bamboohome/xml-data/build-dir/CASA-C6MP380-TTA11/casa6/casatasks/tests/tasks/test_req_task_visstat.py", line 27, in <module> import casatools ModuleNotFoundError: No module named 'casatools' During handling of the above exception, another exception occurred: Traceback (most recent call last): (3 more lines...) |
||||
test_sdatmcor
full log
|
Failing since build #24 (Manual run by Ville Suoranta) | < 1 sec | ||
Traceback (most recent call last): File "/Users/casaci/bamboohome/xml-data/build-dir/CASA-C6MP380-TTA11/casa6/casatasks/tests/tasks/test_sdatmcor.py", line 3, in <module> import numpy as np ModuleNotFoundError: No module named 'numpy' |
||||
test_sdbaseline
full log
|
Failing since build #24 (Manual run by Ville Suoranta) | < 1 sec | ||
Traceback (most recent call last): File "/Users/casaci/bamboohome/xml-data/build-dir/CASA-C6MP380-TTA11/casa6/casatasks/tests/tasks/test_sdbaseline.py", line 7, in <module> import numpy ModuleNotFoundError: No module named 'numpy' |
||||
test_sdcal
full log
|
Failing since build #24 (Manual run by Ville Suoranta) | < 1 sec | ||
Traceback (most recent call last): File "/Users/casaci/bamboohome/xml-data/build-dir/CASA-C6MP380-TTA11/casa6/casatasks/tests/tasks/test_sdcal.py", line 7, in <module> import numpy ModuleNotFoundError: No module named 'numpy' |
||||
test_sdfit
full log
|
Failing since build #24 (Manual run by Ville Suoranta) | < 1 sec | ||
Traceback (most recent call last): File "/Users/casaci/bamboohome/xml-data/build-dir/CASA-C6MP380-TTA11/casa6/casatasks/tests/tasks/test_sdfit.py", line 8, in <module> import numpy ModuleNotFoundError: No module named 'numpy' |
||||
test_sdfixscan
full log
|
Failing since build #24 (Manual run by Ville Suoranta) | < 1 sec | ||
Traceback (most recent call last): File "/Users/casaci/bamboohome/xml-data/build-dir/CASA-C6MP380-TTA11/casa6/casatasks/tests/tasks/test_sdfixscan.py", line 8, in <module> import numpy ModuleNotFoundError: No module named 'numpy' |
||||
test_sdgaincal
full log
|
Failing since build #24 (Manual run by Ville Suoranta) | < 1 sec | ||
Traceback (most recent call last): File "/Users/casaci/bamboohome/xml-data/build-dir/CASA-C6MP380-TTA11/casa6/casatasks/tests/tasks/test_sdgaincal.py", line 7, in <module> import numpy ModuleNotFoundError: No module named 'numpy' |
||||
test_sdimaging
full log
|
Failing since build #24 (Manual run by Ville Suoranta) | < 1 sec | ||
Traceback (most recent call last): File "/Users/casaci/bamboohome/xml-data/build-dir/CASA-C6MP380-TTA11/casa6/casatasks/tests/tasks/test_sdimaging.py", line 8, in <module> import numpy ModuleNotFoundError: No module named 'numpy' |
||||
test_sdpolaverage
full log
|
Failing since build #24 (Manual run by Ville Suoranta) | < 1 sec | ||
Traceback (most recent call last): File "/Users/casaci/bamboohome/xml-data/build-dir/CASA-C6MP380-TTA11/casa6/casatasks/tests/tasks/test_sdpolaverage.py", line 9, in <module> from casatasks.private.casa_transition import is_CASA6 ModuleNotFoundError: No module named 'casatasks' |
||||
test_sdsidebandsplit
full log
|
Failing since build #24 (Manual run by Ville Suoranta) | < 1 sec | ||
Traceback (most recent call last): File "/Users/casaci/bamboohome/xml-data/build-dir/CASA-C6MP380-TTA11/casa6/casatasks/tests/tasks/test_sdsidebandsplit.py", line 5, in <module> import numpy ModuleNotFoundError: No module named 'numpy' |
||||
test_sdsmooth
full log
|
Failing since build #24 (Manual run by Ville Suoranta) | < 1 sec | ||
Traceback (most recent call last): File "/Users/casaci/bamboohome/xml-data/build-dir/CASA-C6MP380-TTA11/casa6/casatasks/tests/tasks/test_sdsmooth.py", line 7, in <module> import numpy ModuleNotFoundError: No module named 'numpy' |
||||
test_sdtimeaverage
full log
|
Failing since build #24 (Manual run by Ville Suoranta) | < 1 sec | ||
Traceback (most recent call last): File "/Users/casaci/bamboohome/xml-data/build-dir/CASA-C6MP380-TTA11/casa6/casatasks/tests/tasks/test_sdtimeaverage.py", line 8, in <module> import numpy ModuleNotFoundError: No module named 'numpy' |
||||
test_setjy
full log
|
Failing since build #24 (Manual run by Ville Suoranta) | < 1 sec | ||
Traceback (most recent call last): File "/Users/casaci/bamboohome/xml-data/build-dir/CASA-C6MP380-TTA11/casa6/casatasks/tests/tasks/test_setjy.py", line 5, in <module> import numpy as np ModuleNotFoundError: No module named 'numpy' |
||||
test_simobserve
full log
|
Failing since build #24 (Manual run by Ville Suoranta) | < 1 sec | ||
Traceback (most recent call last): File "/Users/casaci/bamboohome/xml-data/build-dir/CASA-C6MP380-TTA11/casa6/casatasks/tests/tasks/test_simobserve.py", line 6, in <module> import numpy ModuleNotFoundError: No module named 'numpy' |
||||
test_slsearch
full log
|
Failing since build #24 (Manual run by Ville Suoranta) | < 1 sec | ||
Traceback (most recent call last): File "/Users/casaci/bamboohome/xml-data/build-dir/CASA-C6MP380-TTA11/casa6/casatasks/tests/tasks/test_slsearch.py", line 74, in <module> from casatasks.private.casa_transition import is_CASA6 ModuleNotFoundError: No module named 'casatasks' |
||||
test_smoothcal
full log
|
Failing since build #24 (Manual run by Ville Suoranta) | < 1 sec | ||
Traceback (most recent call last): File "/Users/casaci/bamboohome/xml-data/build-dir/CASA-C6MP380-TTA11/casa6/casatasks/tests/tasks/test_smoothcal.py", line 7, in <module> from casatasks.private.casa_transition import is_CASA6 ModuleNotFoundError: No module named 'casatasks' |
||||
test_specfit
full log
|
Failing since build #24 (Manual run by Ville Suoranta) | < 1 sec | ||
Traceback (most recent call last): File "/Users/casaci/bamboohome/xml-data/build-dir/CASA-C6MP380-TTA11/casa6/casatasks/tests/tasks/test_specfit.py", line 71, in <module> import numpy ModuleNotFoundError: No module named 'numpy' |
||||
test_specflux
full log
|
Failing since build #24 (Manual run by Ville Suoranta) | < 1 sec | ||
Traceback (most recent call last): File "/Users/casaci/bamboohome/xml-data/build-dir/CASA-C6MP380-TTA11/casa6/casatasks/tests/tasks/test_specflux.py", line 73, in <module> from casatasks.private.casa_transition import is_CASA6 ModuleNotFoundError: No module named 'casatasks' |
||||
test_specsmooth
full log
|
Failing since build #24 (Manual run by Ville Suoranta) | < 1 sec | ||
Traceback (most recent call last): File "/Users/casaci/bamboohome/xml-data/build-dir/CASA-C6MP380-TTA11/casa6/casatasks/tests/tasks/test_specsmooth.py", line 44, in <module> import numpy ModuleNotFoundError: No module named 'numpy' |
||||
test_splattotable
full log
|
Failing since build #24 (Manual run by Ville Suoranta) | < 1 sec | ||
Traceback (most recent call last): File "/Users/casaci/bamboohome/xml-data/build-dir/CASA-C6MP380-TTA11/casa6/casatasks/tests/tasks/test_splattotable.py", line 74, in <module> from casatasks.private.casa_transition import is_CASA6 ModuleNotFoundError: No module named 'casatasks' |
||||
test_split
full log
|
Failing since build #24 (Manual run by Ville Suoranta) | < 1 sec | ||
Traceback (most recent call last): File "/Users/casaci/bamboohome/xml-data/build-dir/CASA-C6MP380-TTA11/casa6/casatasks/tests/tasks/test_split.py", line 24, in <module> import numpy ModuleNotFoundError: No module named 'numpy' |
||||
test_spxfit
full log
|
Failing since build #24 (Manual run by Ville Suoranta) | < 1 sec | ||
Traceback (most recent call last): File "/Users/casaci/bamboohome/xml-data/build-dir/CASA-C6MP380-TTA11/casa6/casatasks/tests/tasks/test_spxfit.py", line 71, in <module> import numpy ModuleNotFoundError: No module named 'numpy' |
||||
test_tclean
full log
|
Failing since build #24 (Manual run by Ville Suoranta) | < 1 sec | ||
Traceback (most recent call last): File "/Users/casaci/bamboohome/xml-data/build-dir/CASA-C6MP380-TTA11/casa6/casatasks/tests/tasks/test_tclean.py", line 96, in <module> import numpy as np ModuleNotFoundError: No module named 'numpy' |
||||
test_testconcat
full log
|
Failing since build #24 (Manual run by Ville Suoranta) | < 1 sec | ||
Traceback (most recent call last): File "/Users/casaci/bamboohome/xml-data/build-dir/CASA-C6MP380-TTA11/casa6/casatasks/tests/tasks/test_testconcat.py", line 17, in <module> from casatasks.private.casa_transition import is_CASA6 ModuleNotFoundError: No module named 'casatasks' |
||||
test_tsdimaging
full log
|
Failing since build #24 (Manual run by Ville Suoranta) | < 1 sec | ||
Traceback (most recent call last): File "/Users/casaci/bamboohome/xml-data/build-dir/CASA-C6MP380-TTA11/casa6/casatasks/tests/tasks/test_tsdimaging.py", line 9, in <module> import numpy ModuleNotFoundError: No module named 'numpy' |
||||
test_uvcontsub
full log
|
Failing since build #24 (Manual run by Ville Suoranta) | < 1 sec | ||
Traceback (most recent call last): File "/Users/casaci/bamboohome/xml-data/build-dir/CASA-C6MP380-TTA11/casa6/casatasks/tests/tasks/test_uvcontsub.py", line 4, in <module> import numpy ModuleNotFoundError: No module named 'numpy' |
||||
test_uvcontsub3
full log
|
Failing since build #24 (Manual run by Ville Suoranta) | < 1 sec | ||
Traceback (most recent call last): File "/Users/casaci/bamboohome/xml-data/build-dir/CASA-C6MP380-TTA11/casa6/casatasks/tests/tasks/test_uvcontsub3.py", line 4, in <module> import numpy ModuleNotFoundError: No module named 'numpy' |
||||
test_virtualconcat
full log
|
Failing since build #24 (Manual run by Ville Suoranta) | < 1 sec | ||
Traceback (most recent call last): File "/Users/casaci/bamboohome/xml-data/build-dir/CASA-C6MP380-TTA11/casa6/casatasks/tests/tasks/test_virtualconcat.py", line 17, in <module> from casatasks.private.casa_transition import is_CASA6 ModuleNotFoundError: No module named 'casatasks' |
||||
test_vishead
full log
|
Failing since build #24 (Manual run by Ville Suoranta) | < 1 sec | ||
Traceback (most recent call last): File "/Users/casaci/bamboohome/xml-data/build-dir/CASA-C6MP380-TTA11/casa6/casatasks/tests/tasks/test_vishead.py", line 6, in <module> import numpy ModuleNotFoundError: No module named 'numpy' |