Build: #1 failed First build for this plan
Build result summary
Details
- Completed
- Queue duration
- < 1 second
- Duration
- 35 seconds
- Labels
- None
Responsible
No one has taken responsibility for this failure
Error summary for Pipeline PR Test 6.7.4
The job generated some errors, drill down into the full build log for more details.
Cloning into 'casa-build-utils'...
X11 forwarding request failed on channel 0
% Total % Received % Xferd Average Speed Time Time Time Current
Dload Upload Total Spent Left Speed
0 0 0 0 0 0 0 0 --:--:-- --:--:-- --:--:-- 0
100 471 100 471 0 0 18115 0 --:--:-- --:--:-- --:--:-- 18840
% Total % Received % Xferd Average Speed Time Time Time Current
Dload Upload Total Spent Left Speed
0 0 0 0 0 0 0 0 --:--:-- --:--:-- --:--:-- 0
0 800M 0 7719 0 0 142k 0 1:36:01 --:--:-- 1:36:01 139k
21 800M 21 170M 0 0 167M 0 0:00:04 0:00:01 0:00:03 167M
58 800M 58 467M 0 0 231M 0 0:00:03 0:00:02 0:00:01 231M
100 800M 100 800M 0 0 272M 0 0:00:02 0:00:02 --:--:-- 272M
Cloning into 'casa-build-utils'...
WARNING: The script distro is installed in '/home/casatest/.local/bin' which is not on PATH.
Consider adding this directory to PATH or, if you prefer to suppress this warning, use --no-warn-script-location.
[notice] A new release of pip is available: 24.3.1 -> 26.2.1
[notice] To update, run: pip3 install --upgrade pip
Traceback (most recent call last):
File "/home/casatest/casa-build-utils/pipeline/testpipeline.py", line 62, in <module>
raise Exception("Merge failed")
Exception: Merge failed
mkdir: cannot create directory 'workdir': File exists
cp: cannot stat '/home/casatest/casa-build-utils/pipeline/workdir/pipeline_test_result.xml': No such file or directory
chown: cannot access '/pkgout/*': No such file or directory
X11 forwarding request failed on channel 0
% Total % Received % Xferd Average Speed Time Time Time Current
Dload Upload Total Spent Left Speed
0 0 0 0 0 0 0 0 --:--:-- --:--:-- --:--:-- 0
100 471 100 471 0 0 18115 0 --:--:-- --:--:-- --:--:-- 18840
% Total % Received % Xferd Average Speed Time Time Time Current
Dload Upload Total Spent Left Speed
0 0 0 0 0 0 0 0 --:--:-- --:--:-- --:--:-- 0
0 800M 0 7719 0 0 142k 0 1:36:01 --:--:-- 1:36:01 139k
21 800M 21 170M 0 0 167M 0 0:00:04 0:00:01 0:00:03 167M
58 800M 58 467M 0 0 231M 0 0:00:03 0:00:02 0:00:01 231M
100 800M 100 800M 0 0 272M 0 0:00:02 0:00:02 --:--:-- 272M
Cloning into 'casa-build-utils'...
WARNING: The script distro is installed in '/home/casatest/.local/bin' which is not on PATH.
Consider adding this directory to PATH or, if you prefer to suppress this warning, use --no-warn-script-location.
[notice] A new release of pip is available: 24.3.1 -> 26.2.1
[notice] To update, run: pip3 install --upgrade pip
Traceback (most recent call last):
File "/home/casatest/casa-build-utils/pipeline/testpipeline.py", line 62, in <module>
raise Exception("Merge failed")
Exception: Merge failed
mkdir: cannot create directory 'workdir': File exists
cp: cannot stat '/home/casatest/casa-build-utils/pipeline/workdir/pipeline_test_result.xml': No such file or directory
chown: cannot access '/pkgout/*': No such file or directory